openmeetings-dev mailing list archives

Site index · List index
Message view « Date » · « Thread »
Top « Date » · « Thread »
From Apache Jenkins Server <jenk...@builds.apache.org>
Subject Build failed in Jenkins: openmeetings #2215
Date Mon, 04 Dec 2017 04:23:56 GMT
See <https://builds.apache.org/job/openmeetings/2215/display/redirect?page=changes>

Changes:

[solomax666] [OPENMEETINGS-1721] some sonar issues are fixed

------------------------------------------
[...truncated 3.49 MB...]
[INFO] --- flexmojos-maven-plugin:7.1.1:compile-swf (default-compile-swf) @ openmeetings-flash
---
[INFO] Flexmojos 7.1.1
[INFO] 	 GPL License - Version 2.0 (NO WARRANTY) - See COPYRIGHT file
[WARNING] No themes are explicitly defined in the <theme> section or in any scope="theme"
dependencies. Flexmojos is now attempting to figure out which themes to include. (to avoid
this warning you should explicitly state your theme dependencies)
[WARNING] Adding spark theme because spark.swc was included as a dependency
Writing configuration dump to <https://builds.apache.org/job/openmeetings/ws/openmeetings-flash/target/openmeetings-flash-5.0.0-SNAPSHOT-configs.xml>
<https://builds.apache.org/job/openmeetings/ws/openmeetings-flash/target/openmeetings-flash-5.0.0-SNAPSHOT.swf>
(572405 bytes)
[INFO] 
[INFO] --- maven-resources-plugin:3.0.2:testResources (default-testResources) @ openmeetings-flash
---
[INFO] Using 'UTF-8' encoding to copy filtered resources.
[INFO] skip non existing resourceDirectory <https://builds.apache.org/job/openmeetings/ws/openmeetings-flash/src/test/resources>
[INFO] Copying 3 resources
[INFO] 
[INFO] --- flexmojos-maven-plugin:7.1.1:test-compile (default-test-compile) @ openmeetings-flash
---
[INFO] Flexmojos 7.1.1
[INFO] 	 GPL License - Version 2.0 (NO WARRANTY) - See COPYRIGHT file
[INFO] Skipping compiler, test source path doesn't exist.
[INFO] 
[INFO] --- flexmojos-maven-plugin:7.1.1:test-run (default-test-run) @ openmeetings-flash ---
[INFO] Flexmojos 7.1.1
[INFO] 	 GPL License - Version 2.0 (NO WARRANTY) - See COPYRIGHT file
[INFO] ------------------------------------------------------------------------
[INFO] Tests run: 0, Failures: 0, Errors: 0, Time Elapsed: 0 sec
[JENKINS] Recording test results[INFO] 
[INFO] --- flexmojos-maven-plugin:7.1.1:package (default-package) @ openmeetings-flash ---

[INFO] 
[INFO] --- maven-site-plugin:3.6:attach-descriptor (attach-descriptor) @ openmeetings-flash
---
[INFO] Skipping because packaging 'swf' is not pom.
[INFO] 
[INFO] --- maven-install-plugin:2.5.2:install (default-install) @ openmeetings-flash ---
[INFO] Installing <https://builds.apache.org/job/openmeetings/ws/openmeetings-flash/target/openmeetings-flash-5.0.0-SNAPSHOT.swf>
to /home/jenkins/jenkins-slave/maven-repositories/1/org/apache/openmeetings/openmeetings-flash/5.0.0-SNAPSHOT/openmeetings-flash-5.0.0-SNAPSHOT.swf
[INFO] Installing <https://builds.apache.org/job/openmeetings/ws/openmeetings-flash/pom.xml>
to /home/jenkins/jenkins-slave/maven-repositories/1/org/apache/openmeetings/openmeetings-flash/5.0.0-SNAPSHOT/openmeetings-flash-5.0.0-SNAPSHOT.pom
[INFO]                                                                         
[INFO] ------------------------------------------------------------------------
[INFO] Building Openmeetings Screen Sharing applet 5.0.0-SNAPSHOT
[INFO] ------------------------------------------------------------------------
[INFO] 
[INFO] --- maven-clean-plugin:3.0.0:clean (default-clean) @ openmeetings-screenshare ---
[INFO] Deleting <https://builds.apache.org/job/openmeetings/ws/openmeetings-screenshare/target>
[INFO] 
[INFO] --- buildnumber-maven-plugin:1.4:create (default) @ openmeetings-screenshare ---
[INFO] 
[INFO] --- apache-rat-plugin:0.12:check (default) @ openmeetings-screenshare ---
[INFO] Added 1 additional default licenses.
[INFO] Enabled default license matchers.
[INFO] Added 1 custom approved licenses.
[INFO] Will parse SCM ignores for exclusions...
[INFO] Finished adding exclusions from SCM ignore files.
[INFO] 61 implicit excludes (use -debug for more details).
[INFO] Exclude: **/*.mp3
[INFO] 47 resources included (use -debug for more details)
[INFO] Rat check: Summary over all files. Unapproved: 0, unknown: 0, generated: 0, approved:
39 licenses.
[INFO] 
[INFO] --- jacoco-maven-plugin:0.7.9:prepare-agent (prepare-agent) @ openmeetings-screenshare
---
[INFO] argLine set to -javaagent:/home/jenkins/jenkins-slave/maven-repositories/1/org/jacoco/org.jacoco.agent/0.7.9/org.jacoco.agent-0.7.9-runtime.jar=destfile=<https://builds.apache.org/job/openmeetings/ws/openmeetings-screenshare/../target/jacoco.exec,append=true>
[INFO] 
[INFO] --- maven-remote-resources-plugin:1.5:process (process-resource-bundles) @ openmeetings-screenshare
---
[INFO] 
[INFO] --- maven-site-plugin:3.6:site (generate-site) @ openmeetings-screenshare ---
[INFO] configuring report plugin org.apache.maven.plugins:maven-project-info-reports-plugin:2.9
[INFO] configuring report plugin org.apache.maven.plugins:maven-surefire-report-plugin:2.20.1
[INFO] configuring report plugin org.apache.rat:apache-rat-plugin:0.12
[INFO] Relativizing decoration links with respect to localized project URL: http://openmeetings.apache.org/openmeetings-screenshare
[INFO] Rendering site with io.github.devacfr.maven.skins:reflow-maven-skin:jar:1.3.3 skin.
[INFO] Generating "About" report                --- maven-project-info-reports-plugin:2.9:index
[INFO] Generating "CI Management" report        --- maven-project-info-reports-plugin:2.9:cim
[INFO] Generating "Dependencies" report         --- maven-project-info-reports-plugin:2.9:dependencies
[INFO] Generating "Dependency Convergence" report --- maven-project-info-reports-plugin:2.9:dependency-convergence
[INFO] Generating "Dependency Management" report --- maven-project-info-reports-plugin:2.9:dependency-management
[INFO] Generating "Distribution Management" report --- maven-project-info-reports-plugin:2.9:distribution-management
[INFO] Generating "Issue Management" report     --- maven-project-info-reports-plugin:2.9:issue-tracking
[INFO] Generating "Licenses" report             --- maven-project-info-reports-plugin:2.9:license
[INFO] Generating "Mailing Lists" report        --- maven-project-info-reports-plugin:2.9:mailing-list
[INFO] Generating "Plugin Management" report    --- maven-project-info-reports-plugin:2.9:plugin-management
[INFO] Generating "Plugins" report              --- maven-project-info-reports-plugin:2.9:plugins
[INFO] Generating "Team" report                 --- maven-project-info-reports-plugin:2.9:project-team
[INFO] Generating "Source Code Management" report --- maven-project-info-reports-plugin:2.9:scm
[INFO] Generating "Summary" report              --- maven-project-info-reports-plugin:2.9:summary
[INFO] Generating "Surefire Report" report      --- maven-surefire-report-plugin:2.20.1:report-only
[WARNING] Unable to locate Test Source XRef to link to - DISABLED
[INFO] Generating "Rat Report" report           --- apache-rat-plugin:0.12:rat
[INFO] Added 1 additional default licenses.
[INFO] Enabled default license matchers.
[INFO] Added 1 custom approved licenses.
[INFO] Will parse SCM ignores for exclusions...
[INFO] Finished adding exclusions from SCM ignore files.
[INFO] 61 implicit excludes (use -debug for more details).
[INFO] Exclude: **/*.mp3
[INFO] 47 resources included (use -debug for more details)
[JENKINS] Archiving site from <https://builds.apache.org/job/openmeetings/ws/openmeetings-screenshare/target/site>
to /x1/jenkins/jenkins-home/jobs/openmeetings/site/openmeetings-screenshare
[INFO] 
[INFO] --- maven-resources-plugin:3.0.2:copy-resources (create-template) @ openmeetings-screenshare
---
[INFO] Using 'UTF-8' encoding to copy filtered resources.
[INFO] Copying 1 resource
[INFO] 
[INFO] --- maven-resources-plugin:3.0.2:copy-resources (copy-icons) @ openmeetings-screenshare
---
[INFO] Using 'UTF-8' encoding to copy filtered resources.
[INFO] Copying 2 resources
[INFO] 
[INFO] --- maven-antrun-plugin:1.8:run (default) @ openmeetings-screenshare ---
[INFO] Executing tasks

main:
     [copy] Copying 1 file to <https://builds.apache.org/job/openmeetings/ws/openmeetings-screenshare/target/jnlp>
[INFO] Executed tasks
[INFO] 
[INFO] --- keytool-maven-plugin:1.5:generateKeyPair (default) @ openmeetings-screenshare ---
[INFO] 
[INFO] --- maven-resources-plugin:3.0.2:resources (default-resources) @ openmeetings-screenshare
---
[INFO] Using 'UTF-8' encoding to copy filtered resources.
[INFO] Copying 9 resources
[INFO] Copying 3 resources
[INFO] 
[INFO] --- maven-compiler-plugin:3.7.0:compile (default-compile) @ openmeetings-screenshare
---
[INFO] Changes detected - recompiling the module!
[INFO] Compiling 30 source files to <https://builds.apache.org/job/openmeetings/ws/openmeetings-screenshare/target/classes>
An exception has occurred in the compiler (1.8.0_152). Please file a bug against the Java
compiler via the Java bug reporting page (http://bugreport.java.com) after checking the Bug
Database (http://bugs.java.com) for duplicates. Include your program and the following diagnostic
in your report. Thank you.
java.lang.NullPointerException
	at com.sun.tools.javac.code.Types$DefaultTypeVisitor.visit(Types.java:4571)
	at com.sun.tools.javac.code.Types.isSameType(Types.java:1085)
	at com.sun.tools.javac.code.Types.isSameType(Types.java:1080)
	at com.sun.tools.javac.comp.Check.checkConflicts(Check.java:2317)
	at com.sun.tools.javac.comp.Lower$1.visitMethodDef(Lower.java:721)
	at com.sun.tools.javac.tree.JCTree$JCMethodDecl.accept(JCTree.java:778)
	at com.sun.tools.javac.tree.TreeScanner.scan(TreeScanner.java:49)
	at com.sun.tools.javac.tree.TreeScanner.scan(TreeScanner.java:57)
	at com.sun.tools.javac.tree.TreeScanner.visitClassDef(TreeScanner.java:80)
	at com.sun.tools.javac.comp.Lower$1.visitClassDef(Lower.java:738)
	at com.sun.tools.javac.tree.JCTree$JCClassDecl.accept(JCTree.java:693)
	at com.sun.tools.javac.comp.Lower.checkConflicts(Lower.java:711)
	at com.sun.tools.javac.comp.Lower.translateTopLevelClass(Lower.java:3937)
	at com.sun.tools.javac.main.JavaCompiler.desugar(JavaCompiler.java:1512)
	at com.sun.tools.javac.main.JavaCompiler.desugar(JavaCompiler.java:1356)
	at com.sun.tools.javac.main.JavaCompiler.compile2(JavaCompiler.java:901)
	at com.sun.tools.javac.main.JavaCompiler.compile(JavaCompiler.java:860)
	at com.sun.tools.javac.main.Main.compile(Main.java:523)
	at com.sun.tools.javac.api.JavacTaskImpl.doCall(JavacTaskImpl.java:129)
	at com.sun.tools.javac.api.JavacTaskImpl.call(JavacTaskImpl.java:138)
	at org.codehaus.plexus.compiler.javac.JavaxToolsCompiler.compileInProcess(JavaxToolsCompiler.java:126)
	at org.codehaus.plexus.compiler.javac.JavacCompiler.performCompile(JavacCompiler.java:174)
	at org.apache.maven.plugin.compiler.AbstractCompilerMojo.execute(AbstractCompilerMojo.java:1075)
	at org.apache.maven.plugin.compiler.CompilerMojo.execute(CompilerMojo.java:168)
	at org.apache.maven.plugin.DefaultBuildPluginManager.executeMojo(DefaultBuildPluginManager.java:134)
	at org.apache.maven.lifecycle.internal.MojoExecutor.execute(MojoExecutor.java:207)
	at org.apache.maven.lifecycle.internal.MojoExecutor.execute(MojoExecutor.java:153)
	at org.apache.maven.lifecycle.internal.MojoExecutor.execute(MojoExecutor.java:145)
	at org.apache.maven.lifecycle.internal.LifecycleModuleBuilder.buildProject(LifecycleModuleBuilder.java:116)
	at org.apache.maven.lifecycle.internal.LifecycleModuleBuilder.buildProject(LifecycleModuleBuilder.java:80)
	at org.apache.maven.lifecycle.internal.builder.singlethreaded.SingleThreadedBuilder.build(SingleThreadedBuilder.java:51)
	at org.apache.maven.lifecycle.internal.LifecycleStarter.execute(LifecycleStarter.java:128)
	at org.apache.maven.DefaultMaven.doExecute(DefaultMaven.java:307)
	at org.apache.maven.DefaultMaven.doExecute(DefaultMaven.java:193)
	at org.apache.maven.DefaultMaven.execute(DefaultMaven.java:106)
	at org.jvnet.hudson.maven3.launcher.Maven33Launcher.main(Maven33Launcher.java:129)
	at sun.reflect.NativeMethodAccessorImpl.invoke0(Native Method)
	at sun.reflect.NativeMethodAccessorImpl.invoke(NativeMethodAccessorImpl.java:62)
	at sun.reflect.DelegatingMethodAccessorImpl.invoke(DelegatingMethodAccessorImpl.java:43)
	at java.lang.reflect.Method.invoke(Method.java:498)
	at org.codehaus.plexus.classworlds.launcher.Launcher.launchStandard(Launcher.java:330)
	at org.codehaus.plexus.classworlds.launcher.Launcher.launch(Launcher.java:238)
	at jenkins.maven3.agent.Maven33Main.launch(Maven33Main.java:176)
	at sun.reflect.NativeMethodAccessorImpl.invoke0(Native Method)
	at sun.reflect.NativeMethodAccessorImpl.invoke(NativeMethodAccessorImpl.java:62)
	at sun.reflect.DelegatingMethodAccessorImpl.invoke(DelegatingMethodAccessorImpl.java:43)
	at java.lang.reflect.Method.invoke(Method.java:498)
	at hudson.maven.Maven3Builder.call(Maven3Builder.java:139)
	at hudson.maven.Maven3Builder.call(Maven3Builder.java:70)
	at hudson.remoting.UserRequest.perform(UserRequest.java:181)
	at hudson.remoting.UserRequest.perform(UserRequest.java:52)
	at hudson.remoting.Request$2.run(Request.java:336)
	at hudson.remoting.InterceptingExecutorService$1.call(InterceptingExecutorService.java:68)
	at java.util.concurrent.FutureTask.run(FutureTask.java:266)
	at java.util.concurrent.ThreadPoolExecutor.runWorker(ThreadPoolExecutor.java:1149)
	at java.util.concurrent.ThreadPoolExecutor$Worker.run(ThreadPoolExecutor.java:624)
	at java.lang.Thread.run(Thread.java:748)
[INFO] -------------------------------------------------------------
[ERROR] COMPILATION ERROR : 
[INFO] -------------------------------------------------------------
[ERROR] An unknown compilation problem occurred
[INFO] 1 error
[INFO] -------------------------------------------------------------
[INFO]                                                                         
[INFO] ------------------------------------------------------------------------
[INFO] Skipping Openmeetings
[INFO] This project has been banned from the build due to previous failures.
[INFO] ------------------------------------------------------------------------
[INFO] ------------------------------------------------------------------------
[INFO] Reactor Summary:
[INFO] 
[INFO] Openmeetings ....................................... SUCCESS [ 29.335 s]
[INFO] Openmeetings Util .................................. SUCCESS [03:23 min]
[INFO] Openmeetings DB .................................... SUCCESS [ 25.927 s]
[INFO] Openmeetings Core .................................. SUCCESS [ 35.241 s]
[INFO] Openmeetings Install ............................... SUCCESS [ 22.395 s]
[INFO] Openmeetings Service ............................... SUCCESS [ 18.656 s]
[INFO] Openmeetings Webservices ........................... SUCCESS [01:07 min]
[INFO] Openmeetings Web ................................... SUCCESS [21:03 min]
[INFO] Openmeetings Flash ................................. SUCCESS [ 14.889 s]
[INFO] Openmeetings Screen Sharing applet ................. FAILURE [  9.980 s]
[INFO] Openmeetings Server ................................ SKIPPED
[INFO] ------------------------------------------------------------------------
[INFO] BUILD FAILURE
[INFO] ------------------------------------------------------------------------
[INFO] Total time: 28:22 min
[INFO] Finished at: 2017-12-04T04:23:14+00:00
[INFO] Final Memory: 146M/980M
[INFO] ------------------------------------------------------------------------
[ERROR] Failed to execute goal org.apache.maven.plugins:maven-compiler-plugin:3.7.0:compile
(default-compile) on project openmeetings-screenshare: Compilation failure
[ERROR] An unknown compilation problem occurred
[ERROR] -> [Help 1]
[ERROR] 
[ERROR] To see the full stack trace of the errors, re-run Maven with the -e switch.
[ERROR] Re-run Maven using the -X switch to enable full debug logging.
[ERROR] 
[ERROR] For more information about the errors and possible solutions, please read the following
articles:
[ERROR] [Help 1] http://cwiki.apache.org/confluence/display/MAVEN/MojoFailureException
[ERROR] 
[ERROR] After correcting the problems, you can resume the build with the command
[ERROR]   mvn <goals> -rf :openmeetings-screenshare
[JENKINS] Archiving <https://builds.apache.org/job/openmeetings/ws/openmeetings-server/pom.xml>
to org.apache.openmeetings/openmeetings-server/5.0.0-SNAPSHOT/openmeetings-server-5.0.0-SNAPSHOT.pom
[JENKINS] Archiving <https://builds.apache.org/job/openmeetings/ws/openmeetings-screenshare/pom.xml>
to org.apache.openmeetings/openmeetings-screenshare/5.0.0-SNAPSHOT/openmeetings-screenshare-5.0.0-SNAPSHOT.pom
[JENKINS] Archiving <https://builds.apache.org/job/openmeetings/ws/openmeetings-util/pom.xml>
to org.apache.openmeetings/openmeetings-util/5.0.0-SNAPSHOT/openmeetings-util-5.0.0-SNAPSHOT.pom
[JENKINS] Archiving <https://builds.apache.org/job/openmeetings/ws/openmeetings-util/target/openmeetings-util-5.0.0-SNAPSHOT.jar>
to org.apache.openmeetings/openmeetings-util/5.0.0-SNAPSHOT/openmeetings-util-5.0.0-SNAPSHOT.jar
[JENKINS] Archiving <https://builds.apache.org/job/openmeetings/ws/openmeetings-util/target/openmeetings-util-5.0.0-SNAPSHOT-tests.jar>
to org.apache.openmeetings/openmeetings-util/5.0.0-SNAPSHOT/openmeetings-util-5.0.0-SNAPSHOT-tests.jar
[JENKINS] Archiving <https://builds.apache.org/job/openmeetings/ws/openmeetings-install/pom.xml>
to org.apache.openmeetings/openmeetings-install/5.0.0-SNAPSHOT/openmeetings-install-5.0.0-SNAPSHOT.pom
[JENKINS] Archiving <https://builds.apache.org/job/openmeetings/ws/openmeetings-install/target/openmeetings-install-5.0.0-SNAPSHOT.jar>
to org.apache.openmeetings/openmeetings-install/5.0.0-SNAPSHOT/openmeetings-install-5.0.0-SNAPSHOT.jar
[JENKINS] Archiving <https://builds.apache.org/job/openmeetings/ws/openmeetings-service/pom.xml>
to org.apache.openmeetings/openmeetings-service/5.0.0-SNAPSHOT/openmeetings-service-5.0.0-SNAPSHOT.pom
[JENKINS] Archiving <https://builds.apache.org/job/openmeetings/ws/openmeetings-service/target/openmeetings-service-5.0.0-SNAPSHOT.jar>
to org.apache.openmeetings/openmeetings-service/5.0.0-SNAPSHOT/openmeetings-service-5.0.0-SNAPSHOT.jar
[JENKINS] Archiving <https://builds.apache.org/job/openmeetings/ws/pom.xml> to org.apache.openmeetings/openmeetings-parent/5.0.0-SNAPSHOT/openmeetings-parent-5.0.0-SNAPSHOT.pom
[JENKINS] Archiving <https://builds.apache.org/job/openmeetings/ws/target/openmeetings-parent-5.0.0-SNAPSHOT-site.xml>
to org.apache.openmeetings/openmeetings-parent/5.0.0-SNAPSHOT/openmeetings-parent-5.0.0-SNAPSHOT-site.xml
[Fast Archiver] Compressed 45.16 KB of artifacts by 70.9% relative to #2214
[JENKINS] Archiving <https://builds.apache.org/job/openmeetings/ws/openmeetings-db/pom.xml>
to org.apache.openmeetings/openmeetings-db/5.0.0-SNAPSHOT/openmeetings-db-5.0.0-SNAPSHOT.pom
[JENKINS] Archiving <https://builds.apache.org/job/openmeetings/ws/openmeetings-db/target/openmeetings-db-5.0.0-SNAPSHOT.jar>
to org.apache.openmeetings/openmeetings-db/5.0.0-SNAPSHOT/openmeetings-db-5.0.0-SNAPSHOT.jar
[JENKINS] Archiving <https://builds.apache.org/job/openmeetings/ws/openmeetings-web/pom.xml>
to org.apache.openmeetings/openmeetings-web/5.0.0-SNAPSHOT/openmeetings-web-5.0.0-SNAPSHOT.pom
[JENKINS] Archiving <https://builds.apache.org/job/openmeetings/ws/openmeetings-web/target/openmeetings-web-5.0.0-SNAPSHOT.war>
to org.apache.openmeetings/openmeetings-web/5.0.0-SNAPSHOT/openmeetings-web-5.0.0-SNAPSHOT.war
[Fast Archiver] Compressed 105.96 MB of artifacts by 96.2% relative to #2214
[JENKINS] Archiving <https://builds.apache.org/job/openmeetings/ws/openmeetings-webservice/pom.xml>
to org.apache.openmeetings/openmeetings-webservice/5.0.0-SNAPSHOT/openmeetings-webservice-5.0.0-SNAPSHOT.pom
[JENKINS] Archiving <https://builds.apache.org/job/openmeetings/ws/openmeetings-webservice/target/openmeetings-webservice-5.0.0-SNAPSHOT.jar>
to org.apache.openmeetings/openmeetings-webservice/5.0.0-SNAPSHOT/openmeetings-webservice-5.0.0-SNAPSHOT.jar
[JENKINS] Archiving <https://builds.apache.org/job/openmeetings/ws/openmeetings-core/pom.xml>
to org.apache.openmeetings/openmeetings-core/5.0.0-SNAPSHOT/openmeetings-core-5.0.0-SNAPSHOT.pom
[JENKINS] Archiving <https://builds.apache.org/job/openmeetings/ws/openmeetings-core/target/openmeetings-core-5.0.0-SNAPSHOT.jar>
to org.apache.openmeetings/openmeetings-core/5.0.0-SNAPSHOT/openmeetings-core-5.0.0-SNAPSHOT.jar
[JENKINS] Archiving <https://builds.apache.org/job/openmeetings/ws/openmeetings-core/target/openmeetings-core-5.0.0-SNAPSHOT-tests.jar>
to org.apache.openmeetings/openmeetings-core/5.0.0-SNAPSHOT/openmeetings-core-5.0.0-SNAPSHOT-tests.jar
[JENKINS] Archiving <https://builds.apache.org/job/openmeetings/ws/openmeetings-flash/pom.xml>
to org.apache.openmeetings/openmeetings-flash/5.0.0-SNAPSHOT/openmeetings-flash-5.0.0-SNAPSHOT.pom
[JENKINS] Archiving <https://builds.apache.org/job/openmeetings/ws/openmeetings-flash/target/openmeetings-flash-5.0.0-SNAPSHOT.swf>
to org.apache.openmeetings/openmeetings-flash/5.0.0-SNAPSHOT/openmeetings-flash-5.0.0-SNAPSHOT.swf
Sending e-mails to: dev@openmeetings.apache.org
channel stopped
Archiving artifacts
[Fast Archiver] Compressed 278.10 MB of artifacts by 100.0% relative to #2214
Not sending mail to unregistered user solomax666@gmail.com

Mime
View raw message