openmeetings-dev mailing list archives

Site index · List index
Message view « Date » · « Thread »
Top « Date » · « Thread »
From Apache Jenkins Server <jenk...@builds.apache.org>
Subject Build failed in Jenkins: openmeetings #2229
Date Sat, 09 Dec 2017 17:10:57 GMT
See <https://builds.apache.org/job/openmeetings/2229/display/redirect?page=changes>

Changes:

[solomax666] [OPENMEETINGS-1782] https is used instead of http, link to the

------------------------------------------
Started by an SCM change
[EnvInject] - Loading node environment variables.
Building remotely on ubuntu-eu2 (ubuntu trusty) in workspace <https://builds.apache.org/job/openmeetings/ws/>
 > git rev-parse --is-inside-work-tree # timeout=10
Fetching changes from the remote Git repository
 > git config remote.origin.url https://git-wip-us.apache.org/repos/asf/openmeetings.git
# timeout=10
Fetching upstream changes from https://git-wip-us.apache.org/repos/asf/openmeetings.git
 > git --version # timeout=10
 > git fetch --tags --progress https://git-wip-us.apache.org/repos/asf/openmeetings.git
+refs/heads/*:refs/remotes/origin/*
 > git rev-parse refs/remotes/origin/master^{commit} # timeout=10
 > git rev-parse refs/remotes/origin/origin/master^{commit} # timeout=10
Checking out Revision 9a9f4cfb3e60c46f17cc128b46457bfb6f4a4508 (refs/remotes/origin/master)
 > git config core.sparsecheckout # timeout=10
 > git checkout -f 9a9f4cfb3e60c46f17cc128b46457bfb6f4a4508
Commit message: "[OPENMEETINGS-1782] https is used instead of http, link to the instructions
for verify are added"
 > git rev-list e18e84ef9d57738c836718aab2502c77ecd16fbc # timeout=10
Parsing POMs
Established TCP socket on 35397
maven33-agent.jar already up to date
maven33-interceptor.jar already up to date
maven3-interceptor-commons.jar already up to date
[openmeetings] $ /home/jenkins/tools/java/latest1.8/bin/java -Xmx2g -Xms512m -XX:MaxMetaspaceSize=512m
-cp /home/jenkins/jenkins-slave/maven33-agent.jar:/home/jenkins/tools/maven/apache-maven-3.3.9/boot/plexus-classworlds-2.5.2.jar:/home/jenkins/tools/maven/apache-maven-3.3.9/conf/logging
jenkins.maven3.agent.Maven33Main /home/jenkins/tools/maven/apache-maven-3.3.9 /home/jenkins/jenkins-slave/slave.jar
/home/jenkins/jenkins-slave/maven33-interceptor.jar /home/jenkins/jenkins-slave/maven3-interceptor-commons.jar
35397
<===[JENKINS REMOTING CAPACITY]===>   channel started
Executing Maven:  -B -f <https://builds.apache.org/job/openmeetings/ws/pom.xml> -Dmaven.repo.local=/home/jenkins/jenkins-slave/maven-repositories/1
clean install sonar:sonar -PallModules,Jenkins
[INFO] Scanning for projects...
[INFO] ------------------------------------------------------------------------
[INFO] Reactor Build Order:
[INFO] 
[INFO] Openmeetings
[INFO] Openmeetings Util
[INFO] Openmeetings DB
[INFO] Openmeetings Core
[INFO] Openmeetings Install
[INFO] Openmeetings Service
[INFO] Openmeetings Webservices
[INFO] Openmeetings Web
[INFO] Openmeetings Flash
[INFO] Openmeetings Screen Sharing applet
[INFO] Openmeetings Server
[INFO]                                                                         
[INFO] ------------------------------------------------------------------------
[INFO] Building Openmeetings 5.0.0-SNAPSHOT
[INFO] ------------------------------------------------------------------------
[INFO] 
[INFO] --- maven-clean-plugin:3.0.0:clean (default-clean) @ openmeetings-parent ---
[INFO] Deleting <https://builds.apache.org/job/openmeetings/ws/target>
[INFO] 
[INFO] --- buildnumber-maven-plugin:1.4:create (default) @ openmeetings-parent ---
[INFO] ShortRevision tag detected. The value is '7'.
[INFO] Executing: /bin/sh -c cd '<https://builds.apache.org/job/openmeetings/ws/'> &&
'git' 'rev-parse' '--verify' '--short=7' 'HEAD'
[INFO] Working directory: <https://builds.apache.org/job/openmeetings/ws/>
[INFO] Storing buildNumber: 9a9f4cf at timestamp: 1512839421405
[WARNING] Cannot get the branch information from the git repository: 
Detecting the current branch failed: fatal: ref HEAD is not a symbolic ref

[INFO] ShortRevision tag detected. The value is '7'.
[INFO] Executing: /bin/sh -c cd '<https://builds.apache.org/job/openmeetings/ws/'> &&
'git' 'rev-parse' '--verify' '--short=7' 'HEAD'
[INFO] Working directory: <https://builds.apache.org/job/openmeetings/ws/>
[INFO] Storing buildScmBranch: UNKNOWN
[INFO] 
[INFO] --- apache-rat-plugin:0.12:check (default) @ openmeetings-parent ---
[INFO] Added 1 additional default licenses.
[INFO] Enabled default license matchers.
[INFO] Added 1 custom approved licenses.
[INFO] Will parse SCM ignores for exclusions...
[INFO] Parsing exclusions from <https://builds.apache.org/job/openmeetings/ws/.gitignore>
[INFO] Finished adding exclusions from SCM ignore files.
[INFO] 76 implicit excludes (use -debug for more details).
[INFO] Exclude: **/*.mp3
[INFO] 9 resources included (use -debug for more details)
[INFO] Rat check: Summary over all files. Unapproved: 1, unknown: 1, generated: 0, approved:
3 licenses.
[INFO]                                                                         
[INFO] ------------------------------------------------------------------------
[INFO] Skipping Openmeetings
[INFO] This project has been banned from the build due to previous failures.
[INFO] ------------------------------------------------------------------------
[INFO] ------------------------------------------------------------------------
[INFO] Reactor Summary:
[INFO] 
[INFO] Openmeetings ....................................... FAILURE [  2.271 s]
[INFO] Openmeetings Util .................................. SKIPPED
[INFO] Openmeetings DB .................................... SKIPPED
[INFO] Openmeetings Core .................................. SKIPPED
[INFO] Openmeetings Install ............................... SKIPPED
[INFO] Openmeetings Service ............................... SKIPPED
[INFO] Openmeetings Webservices ........................... SKIPPED
[INFO] Openmeetings Web ................................... SKIPPED
[INFO] Openmeetings Flash ................................. SKIPPED
[INFO] Openmeetings Screen Sharing applet ................. SKIPPED
[INFO] Openmeetings Server ................................ SKIPPED
[INFO] ------------------------------------------------------------------------
[INFO] BUILD FAILURE
[INFO] ------------------------------------------------------------------------
[INFO] Total time: 7.777 s
[INFO] Finished at: 2017-12-09T17:10:24+00:00
[INFO] Final Memory: 41M/785M
[INFO] ------------------------------------------------------------------------
[ERROR] Failed to execute goal org.apache.rat:apache-rat-plugin:0.12:check (default) on project
openmeetings-parent: Too many files with unapproved license: 1 See RAT report in: <https://builds.apache.org/job/openmeetings/ws/target/rat.txt>
-> [Help 1]
[ERROR] 
[ERROR] To see the full stack trace of the errors, re-run Maven with the -e switch.
[ERROR] Re-run Maven using the -X switch to enable full debug logging.
[ERROR] 
[ERROR] For more information about the errors and possible solutions, please read the following
articles:
[ERROR] [Help 1] http://cwiki.apache.org/confluence/display/MAVEN/MojoFailureException
[JENKINS] Archiving <https://builds.apache.org/job/openmeetings/ws/openmeetings-server/pom.xml>
to org.apache.openmeetings/openmeetings-server/5.0.0-SNAPSHOT/openmeetings-server-5.0.0-SNAPSHOT.pom
[JENKINS] Archiving <https://builds.apache.org/job/openmeetings/ws/openmeetings-screenshare/pom.xml>
to org.apache.openmeetings/openmeetings-screenshare/5.0.0-SNAPSHOT/openmeetings-screenshare-5.0.0-SNAPSHOT.pom
[JENKINS] Archiving <https://builds.apache.org/job/openmeetings/ws/openmeetings-util/pom.xml>
to org.apache.openmeetings/openmeetings-util/5.0.0-SNAPSHOT/openmeetings-util-5.0.0-SNAPSHOT.pom
[Fast Archiver] No artifacts from openmeetings » Openmeetings Util #2228 to compare, so performing
full copy of artifacts
[JENKINS] Archiving <https://builds.apache.org/job/openmeetings/ws/openmeetings-install/pom.xml>
to org.apache.openmeetings/openmeetings-install/5.0.0-SNAPSHOT/openmeetings-install-5.0.0-SNAPSHOT.pom
[Fast Archiver] No artifacts from openmeetings » Openmeetings Install #2228 to compare, so
performing full copy of artifacts
[JENKINS] Archiving <https://builds.apache.org/job/openmeetings/ws/openmeetings-service/pom.xml>
to org.apache.openmeetings/openmeetings-service/5.0.0-SNAPSHOT/openmeetings-service-5.0.0-SNAPSHOT.pom
[Fast Archiver] No artifacts from openmeetings » Openmeetings Service #2228 to compare, so
performing full copy of artifacts
[JENKINS] Archiving <https://builds.apache.org/job/openmeetings/ws/pom.xml> to org.apache.openmeetings/openmeetings-parent/5.0.0-SNAPSHOT/openmeetings-parent-5.0.0-SNAPSHOT.pom
[Fast Archiver] No artifacts from openmeetings » Openmeetings #2228 to compare, so performing
full copy of artifacts
[JENKINS] Archiving <https://builds.apache.org/job/openmeetings/ws/openmeetings-db/pom.xml>
to org.apache.openmeetings/openmeetings-db/5.0.0-SNAPSHOT/openmeetings-db-5.0.0-SNAPSHOT.pom
[Fast Archiver] No artifacts from openmeetings » Openmeetings DB #2228 to compare, so performing
full copy of artifacts
[JENKINS] Archiving <https://builds.apache.org/job/openmeetings/ws/openmeetings-web/pom.xml>
to org.apache.openmeetings/openmeetings-web/5.0.0-SNAPSHOT/openmeetings-web-5.0.0-SNAPSHOT.pom
[Fast Archiver] No artifacts from openmeetings » Openmeetings Web #2228 to compare, so performing
full copy of artifacts
[JENKINS] Archiving <https://builds.apache.org/job/openmeetings/ws/openmeetings-webservice/pom.xml>
to org.apache.openmeetings/openmeetings-webservice/5.0.0-SNAPSHOT/openmeetings-webservice-5.0.0-SNAPSHOT.pom
[Fast Archiver] No artifacts from openmeetings » Openmeetings Webservices #2228 to compare,
so performing full copy of artifacts
[JENKINS] Archiving <https://builds.apache.org/job/openmeetings/ws/openmeetings-core/pom.xml>
to org.apache.openmeetings/openmeetings-core/5.0.0-SNAPSHOT/openmeetings-core-5.0.0-SNAPSHOT.pom
[Fast Archiver] No artifacts from openmeetings » Openmeetings Core #2228 to compare, so performing
full copy of artifacts
[JENKINS] Archiving <https://builds.apache.org/job/openmeetings/ws/openmeetings-flash/pom.xml>
to org.apache.openmeetings/openmeetings-flash/5.0.0-SNAPSHOT/openmeetings-flash-5.0.0-SNAPSHOT.pom
Sending e-mails to: dev@openmeetings.apache.org
channel stopped
Archiving artifacts
[Fast Archiver] Compressed 279.46 MB of artifacts by 100.0% relative to #2227
Not sending mail to unregistered user solomax666@gmail.com

Mime
View raw message