openmeetings-dev mailing list archives

Site index · List index
Message view « Date » · « Thread »
Top « Date » · « Thread »
From Apache Jenkins Server <jenk...@builds.apache.org>
Subject Build failed in Jenkins: OpenMeetings 4.0.x #128
Date Fri, 01 Dec 2017 04:02:06 GMT
See <https://builds.apache.org/job/OpenMeetings%204.0.x/128/display/redirect?page=changes>

Changes:

[solomax666] [OPENMEETINGS-1774] carousel images are updated

------------------------------------------
Started by an SCM change
[EnvInject] - Loading node environment variables.
Building remotely on H13 (Hadoop xenial) in workspace <https://builds.apache.org/job/OpenMeetings%204.0.x/ws/>
 > git rev-parse --is-inside-work-tree # timeout=10
Fetching changes from the remote Git repository
 > git config remote.origin.url https://git-wip-us.apache.org/repos/asf/openmeetings.git
# timeout=10
Fetching upstream changes from https://git-wip-us.apache.org/repos/asf/openmeetings.git
 > git --version # timeout=10
 > git fetch --tags --progress https://git-wip-us.apache.org/repos/asf/openmeetings.git
+refs/heads/*:refs/remotes/origin/*
 > git rev-parse refs/remotes/origin/4.0.x^{commit} # timeout=10
 > git rev-parse refs/remotes/origin/origin/4.0.x^{commit} # timeout=10
Checking out Revision 56f3cfa9119fee6957f9fd12d7f31398a99081cd (refs/remotes/origin/4.0.x)
 > git config core.sparsecheckout # timeout=10
 > git checkout -f 56f3cfa9119fee6957f9fd12d7f31398a99081cd
Commit message: "[OPENMEETINGS-1774] carousel images are updated"
 > git rev-list 1d85d8a4a89dd21ed64697466ee6a471b4df8ea5 # timeout=10
Parsing POMs
Modules changed, recalculating dependency graph
Established TCP socket on 42187
maven33-agent.jar already up to date
maven33-interceptor.jar already up to date
maven3-interceptor-commons.jar already up to date
[OpenMeetings 4.0.x] $ /home/jenkins/tools/java/latest1.8/bin/java -Xmx2g -Xms512m -XX:MaxMetaspaceSize=512m
-cp /home/jenkins/jenkins-slave/maven33-agent.jar:/home/jenkins/tools/maven/apache-maven-3.3.9/boot/plexus-classworlds-2.5.2.jar:/home/jenkins/tools/maven/apache-maven-3.3.9/conf/logging
jenkins.maven3.agent.Maven33Main /home/jenkins/tools/maven/apache-maven-3.3.9 /home/jenkins/jenkins-slave/slave.jar
/home/jenkins/jenkins-slave/maven33-interceptor.jar /home/jenkins/jenkins-slave/maven3-interceptor-commons.jar
42187
<===[JENKINS REMOTING CAPACITY]===>   channel started
Executing Maven:  -B -f <https://builds.apache.org/job/OpenMeetings%204.0.x/ws/pom.xml>
-Dmaven.repo.local=/home/jenkins/jenkins-slave/maven-repositories/1 clean install sonar:sonar
-PallModules,Jenkins
[INFO] Scanning for projects...
[INFO] Downloading: https://repository.apache.org/content/groups/snapshots/org/apache/felix/maven-bundle-plugin/3.3.0/maven-bundle-plugin-3.3.0.jar
[INFO] Downloading: http://repository.jspresso.org/maven2/org/apache/felix/maven-bundle-plugin/3.3.0/maven-bundle-plugin-3.3.0.jar
[INFO] Downloading: https://dl.bintray.com/openmeetings/maven/org/apache/felix/maven-bundle-plugin/3.3.0/maven-bundle-plugin-3.3.0.jar
[ERROR] [ERROR] Some problems were encountered while processing the POMs:
[ERROR] Unresolveable build extension: Plugin org.apache.felix:maven-bundle-plugin:3.3.0 or
one of its dependencies could not be resolved: Could not find artifact org.apache.felix:maven-bundle-plugin:jar:3.3.0
in apache-snapshots (https://repository.apache.org/content/groups/snapshots) @ 
 @ 
[ERROR] The build could not read 1 project -> [Help 1]
[ERROR]   
[ERROR]   The project org.apache.openmeetings:openmeetings-parent:4.0.1-SNAPSHOT (<https://builds.apache.org/job/OpenMeetings%204.0.x/ws/pom.xml)>
has 1 error
[ERROR]     Unresolveable build extension: Plugin org.apache.felix:maven-bundle-plugin:3.3.0
or one of its dependencies could not be resolved: Could not find artifact org.apache.felix:maven-bundle-plugin:jar:3.3.0
in apache-snapshots (https://repository.apache.org/content/groups/snapshots) -> [Help 2]
[ERROR] 
[ERROR] To see the full stack trace of the errors, re-run Maven with the -e switch.
[ERROR] Re-run Maven using the -X switch to enable full debug logging.
[ERROR] 
[ERROR] For more information about the errors and possible solutions, please read the following
articles:
[ERROR] [Help 1] http://cwiki.apache.org/confluence/display/MAVEN/ProjectBuildingException
[ERROR] [Help 2] http://cwiki.apache.org/confluence/display/MAVEN/PluginManagerException
channel stopped
Archiving artifacts
Not sending mail to unregistered user solomax666@gmail.com

Mime
View raw message