openmeetings-dev mailing list archives

Site index · List index
Message view « Date » · « Thread »
Top « Date » · « Thread »
From Apache Jenkins Server <jenk...@builds.apache.org>
Subject Build failed in Jenkins: openmeetings #2153
Date Tue, 14 Nov 2017 16:53:09 GMT
See <https://builds.apache.org/job/openmeetings/2153/display/redirect?page=changes>

Changes:

[solomax666] [OPENMEETINGS-1754] sidebar is made hidable

------------------------------------------
[...truncated 3.94 MB...]
16:52:19,424 |-INFO in ch.qos.logback.classic.joran.action.LoggerAction - Setting level of
logger [de.hunsicker.jalopy.io] to ERROR
16:52:19,424 |-INFO in ch.qos.logback.classic.joran.action.LoggerAction - Setting level of
logger [httpclient.wire.header] to ERROR
16:52:19,424 |-INFO in ch.qos.logback.classic.joran.action.LoggerAction - Setting level of
logger [org.apache.mina.filter.ssl.SslFilter] to ERROR
16:52:19,424 |-INFO in ch.qos.logback.classic.joran.action.LoggerAction - Setting level of
logger [org.apache.openmeetings] to DEBUG
16:52:19,424 |-INFO in ch.qos.logback.classic.joran.action.RootLoggerAction - Setting level
of ROOT logger to INFO
16:52:19,424 |-INFO in ch.qos.logback.core.joran.action.AppenderRefAction - Attaching appender
named [FILE] to Logger[ROOT]
16:52:19,425 |-INFO in ch.qos.logback.core.joran.action.AppenderRefAction - Attaching appender
named [CONSOLE] to Logger[ROOT]
16:52:19,425 |-INFO in ch.qos.logback.classic.joran.action.ConfigurationAction - End of configuration.
16:52:19,426 |-INFO in ch.qos.logback.classic.joran.JoranConfigurator@72e789cb - Registering
current configuration as safe fallback point

SLF4J: A number (1) of logging calls during the initialization phase have been intercepted
and are
SLF4J: now being replayed. These are subject to the filtering rules of the underlying logging
system.
SLF4J: See also http://www.slf4j.org/codes.html#replay
 INFO 11-14 16:52:19.782 673 187 o.s.t.c.s.DefaultTestContextBootstrapper [main] - Using TestExecutionListeners:
[org.springframework.test.context.web.ServletTestExecutionListener@696db620, org.springframework.test.context.support.DirtiesContextBeforeModesTestExecutionListener@6968c1d6,
org.springframework.test.context.support.DependencyInjectionTestExecutionListener@7d986d83,
org.springframework.test.context.support.DirtiesContextTestExecutionListener@77f991c]
[INFO] 
[INFO] Results:
[INFO] 
[INFO] Tests run: 140, Failures: 0, Errors: 0, Skipped: 0
[INFO] 
[JENKINS] Recording test results
[INFO] 
[INFO] --- maven-war-plugin:3.2.0:exploded (create-war) @ openmeetings-web ---
[INFO] Exploding webapp
[INFO] Assembling webapp [openmeetings-web] in [<https://builds.apache.org/job/openmeetings/ws/openmeetings-web/target/openmeetings-web-5.0.0-SNAPSHOT]>
[INFO] Processing war project
[INFO] Copying webapp webResources [<https://builds.apache.org/job/openmeetings/ws/openmeetings-web/target/generated-res]>
to [<https://builds.apache.org/job/openmeetings/ws/openmeetings-web/target/openmeetings-web-5.0.0-SNAPSHOT]>
[INFO] Copying webapp resources [<https://builds.apache.org/job/openmeetings/ws/openmeetings-web/src/main/webapp]>
[INFO] Building jar: <https://builds.apache.org/job/openmeetings/ws/openmeetings-web/target/openmeetings-web-5.0.0-SNAPSHOT/WEB-INF/lib/openmeetings-web-5.0.0-SNAPSHOT.jar>
[INFO] Webapp assembled in [495 msecs]
[INFO] 
[INFO] --- maven-dependency-plugin:3.0.2:copy-dependencies (copy-dependencies) @ openmeetings-web
---
[INFO] Copying wicketstuff-urlfragment-8.0.0-M8.jar to <https://builds.apache.org/job/openmeetings/ws/openmeetings-web/target/lib/wicketstuff-urlfragment-8.0.0-M8.jar>
[INFO] Copying openmeetings-webservice-5.0.0-SNAPSHOT.jar to <https://builds.apache.org/job/openmeetings/ws/openmeetings-web/target/lib/openmeetings-webservice-5.0.0-SNAPSHOT.jar>
[INFO] Copying wicket-jquery-ui-calendar-8.0.0-M8.jar to <https://builds.apache.org/job/openmeetings/ws/openmeetings-web/target/lib/wicket-jquery-ui-calendar-8.0.0-M8.jar>
[INFO] Copying wicketstuff-select2-8.0.0-M8.jar to <https://builds.apache.org/job/openmeetings/ws/openmeetings-web/target/lib/wicketstuff-select2-8.0.0-M8.jar>
[INFO] Copying wicket-devutils-8.0.0-M8.jar to <https://builds.apache.org/job/openmeetings/ws/openmeetings-web/target/lib/wicket-devutils-8.0.0-M8.jar>
[INFO] Copying wicket-kendo-ui-8.0.0-M8.jar to <https://builds.apache.org/job/openmeetings/ws/openmeetings-web/target/lib/wicket-kendo-ui-8.0.0-M8.jar>
[INFO] Copying jqplot-8.0.0-M8.jar to <https://builds.apache.org/job/openmeetings/ws/openmeetings-web/target/lib/jqplot-8.0.0-M8.jar>
[INFO] Copying selenium-java-3.7.1.jar to <https://builds.apache.org/job/openmeetings/ws/openmeetings-web/target/lib/selenium-java-3.7.1.jar>
[INFO] Copying openmeetings-core-5.0.0-SNAPSHOT-tests.jar to <https://builds.apache.org/job/openmeetings/ws/openmeetings-web/target/lib/openmeetings-core-5.0.0-SNAPSHOT-tests.jar>
[INFO] Copying openmeetings-util-5.0.0-SNAPSHOT.jar to <https://builds.apache.org/job/openmeetings/ws/openmeetings-web/target/lib/openmeetings-util-5.0.0-SNAPSHOT.jar>
[INFO] Copying wicket-jquery-ui-plugins-8.0.0-M8.jar to <https://builds.apache.org/job/openmeetings/ws/openmeetings-web/target/lib/wicket-jquery-ui-plugins-8.0.0-M8.jar>
[INFO] Copying pdfbox-2.0.8.jar to <https://builds.apache.org/job/openmeetings/ws/openmeetings-web/target/lib/pdfbox-2.0.8.jar>
[INFO] Copying wicketstuff-dashboard-core-8.0.0-M8.jar to <https://builds.apache.org/job/openmeetings/ws/openmeetings-web/target/lib/wicketstuff-dashboard-core-8.0.0-M8.jar>
[INFO] Copying commons-lang3-3.7.jar to <https://builds.apache.org/job/openmeetings/ws/openmeetings-web/target/lib/commons-lang3-3.7.jar>
[INFO] Copying tomcat-embed-jasper-9.0.1.jar to <https://builds.apache.org/job/openmeetings/ws/openmeetings-web/target/lib/tomcat-embed-jasper-9.0.1.jar>
[INFO] Copying spring-test-4.3.12.RELEASE.jar to <https://builds.apache.org/job/openmeetings/ws/openmeetings-web/target/lib/spring-test-4.3.12.RELEASE.jar>
[INFO] Copying wicket-jquery-ui-8.0.0-M8.jar to <https://builds.apache.org/job/openmeetings/ws/openmeetings-web/target/lib/wicket-jquery-ui-8.0.0-M8.jar>
[INFO] Copying openmeetings-db-5.0.0-SNAPSHOT.jar to <https://builds.apache.org/job/openmeetings/ws/openmeetings-web/target/lib/openmeetings-db-5.0.0-SNAPSHOT.jar>
[INFO] Copying spring-core-4.3.12.RELEASE.jar to <https://builds.apache.org/job/openmeetings/ws/openmeetings-web/target/lib/spring-core-4.3.12.RELEASE.jar>
[INFO] Copying spring-orm-4.3.12.RELEASE.jar to <https://builds.apache.org/job/openmeetings/ws/openmeetings-web/target/lib/spring-orm-4.3.12.RELEASE.jar>
[INFO] Copying tomcat-embed-core-9.0.1.jar to <https://builds.apache.org/job/openmeetings/ws/openmeetings-web/target/lib/tomcat-embed-core-9.0.1.jar>
[INFO] Copying tomcat-servlet-api-9.0.1.jar to <https://builds.apache.org/job/openmeetings/ws/openmeetings-web/target/lib/tomcat-servlet-api-9.0.1.jar>
[INFO] Copying wicket-auth-roles-8.0.0-M8.jar to <https://builds.apache.org/job/openmeetings/ws/openmeetings-web/target/lib/wicket-auth-roles-8.0.0-M8.jar>
[INFO] Copying tomcat-embed-websocket-9.0.1.jar to <https://builds.apache.org/job/openmeetings/ws/openmeetings-web/target/lib/tomcat-embed-websocket-9.0.1.jar>
[INFO] Copying openmeetings-core-5.0.0-SNAPSHOT.jar to <https://builds.apache.org/job/openmeetings/ws/openmeetings-web/target/lib/openmeetings-core-5.0.0-SNAPSHOT.jar>
[INFO] Copying openmeetings-install-5.0.0-SNAPSHOT.jar to <https://builds.apache.org/job/openmeetings/ws/openmeetings-web/target/lib/openmeetings-install-5.0.0-SNAPSHOT.jar>
[INFO] Copying wicket-kendo-ui-theme-default-8.0.0-M8.jar to <https://builds.apache.org/job/openmeetings/ws/openmeetings-web/target/lib/wicket-kendo-ui-theme-default-8.0.0-M8.jar>
[INFO] Copying wicket-kendo-ui-culture-8.0.0-M8.jar to <https://builds.apache.org/job/openmeetings/ws/openmeetings-web/target/lib/wicket-kendo-ui-culture-8.0.0-M8.jar>
[INFO] Copying junit-4.12.jar to <https://builds.apache.org/job/openmeetings/ws/openmeetings-web/target/lib/junit-4.12.jar>
[INFO] Copying tomcat-catalina-ha-9.0.1.jar to <https://builds.apache.org/job/openmeetings/ws/openmeetings-web/target/lib/tomcat-catalina-ha-9.0.1.jar>
[INFO] Copying derbynet-10.14.1.0.jar to <https://builds.apache.org/job/openmeetings/ws/openmeetings-web/target/lib/derbynet-10.14.1.0.jar>
[INFO] Copying wicket-native-websocket-javax-8.0.0-M8.jar to <https://builds.apache.org/job/openmeetings/ws/openmeetings-web/target/lib/wicket-native-websocket-javax-8.0.0-M8.jar>
[INFO] Copying openmeetings-util-5.0.0-SNAPSHOT-tests.jar to <https://builds.apache.org/job/openmeetings/ws/openmeetings-web/target/lib/openmeetings-util-5.0.0-SNAPSHOT-tests.jar>
[INFO] Copying wicket-jquery-ui-core-8.0.0-M8.jar to <https://builds.apache.org/job/openmeetings/ws/openmeetings-web/target/lib/wicket-jquery-ui-core-8.0.0-M8.jar>
[INFO] Copying openmeetings-service-5.0.0-SNAPSHOT.jar to <https://builds.apache.org/job/openmeetings/ws/openmeetings-web/target/lib/openmeetings-service-5.0.0-SNAPSHOT.jar>
[INFO] Copying spring-context-support-4.3.12.RELEASE.jar to <https://builds.apache.org/job/openmeetings/ws/openmeetings-web/target/lib/spring-context-support-4.3.12.RELEASE.jar>
[INFO] Copying cxf-rt-rs-client-3.2.1.jar to <https://builds.apache.org/job/openmeetings/ws/openmeetings-web/target/lib/cxf-rt-rs-client-3.2.1.jar>
[INFO] 
[INFO] --- maven-war-plugin:3.2.0:war (default-war) @ openmeetings-web ---
[INFO] Packaging webapp
[INFO] Assembling webapp [openmeetings-web] in [<https://builds.apache.org/job/openmeetings/ws/openmeetings-web/target/openmeetings-web-5.0.0-SNAPSHOT]>
[INFO] Processing war project
[INFO] Copying webapp webResources [<https://builds.apache.org/job/openmeetings/ws/openmeetings-web/target/generated-res]>
to [<https://builds.apache.org/job/openmeetings/ws/openmeetings-web/target/openmeetings-web-5.0.0-SNAPSHOT]>
[INFO] Copying webapp resources [<https://builds.apache.org/job/openmeetings/ws/openmeetings-web/src/main/webapp]>
[INFO] Building jar: <https://builds.apache.org/job/openmeetings/ws/openmeetings-web/target/openmeetings-web-5.0.0-SNAPSHOT/WEB-INF/lib/openmeetings-web-5.0.0-SNAPSHOT.jar>
[INFO] Webapp assembled in [311 msecs]
[INFO] Building war: <https://builds.apache.org/job/openmeetings/ws/openmeetings-web/target/openmeetings-web-5.0.0-SNAPSHOT.war>
[INFO] 
[INFO] --- maven-site-plugin:3.3:attach-descriptor (attach-descriptor) @ openmeetings-web
---
[INFO] 
[INFO] --- maven-install-plugin:2.5.2:install (default-install) @ openmeetings-web ---
[INFO] Installing <https://builds.apache.org/job/openmeetings/ws/openmeetings-web/target/openmeetings-web-5.0.0-SNAPSHOT.war>
to /home/jenkins/jenkins-slave/maven-repositories/1/org/apache/openmeetings/openmeetings-web/5.0.0-SNAPSHOT/openmeetings-web-5.0.0-SNAPSHOT.war
[INFO] Installing <https://builds.apache.org/job/openmeetings/ws/openmeetings-web/pom.xml>
to /home/jenkins/jenkins-slave/maven-repositories/1/org/apache/openmeetings/openmeetings-web/5.0.0-SNAPSHOT/openmeetings-web-5.0.0-SNAPSHOT.pom
[INFO]                                                                         
[INFO] ------------------------------------------------------------------------
[INFO] Building Openmeetings Flash 5.0.0-SNAPSHOT
[INFO] ------------------------------------------------------------------------
[INFO] 
[INFO] --- maven-clean-plugin:3.0.0:clean (default-clean) @ openmeetings-flash ---
[INFO] Deleting <https://builds.apache.org/job/openmeetings/ws/openmeetings-flash/target>
[INFO] 
[INFO] --- buildnumber-maven-plugin:1.4:create (default) @ openmeetings-flash ---
[INFO] 
[INFO] --- apache-rat-plugin:0.12:check (default) @ openmeetings-flash ---
[INFO] Added 1 additional default licenses.
[INFO] Enabled default license matchers.
[INFO] Added 1 custom approved licenses.
[INFO] Will parse SCM ignores for exclusions...
[INFO] Finished adding exclusions from SCM ignore files.
[INFO] 61 implicit excludes (use -debug for more details).
[INFO] Exclude: **/*.mp3
[INFO] 26 resources included (use -debug for more details)
[INFO] Rat check: Summary over all files. Unapproved: 0, unknown: 0, generated: 0, approved:
18 licenses.
[INFO] 
[INFO] --- jacoco-maven-plugin:0.7.9:prepare-agent (prepare-agent) @ openmeetings-flash ---
[INFO] argLine set to -javaagent:/home/jenkins/jenkins-slave/maven-repositories/1/org/jacoco/org.jacoco.agent/0.7.9/org.jacoco.agent-0.7.9-runtime.jar=destfile=<https://builds.apache.org/job/openmeetings/ws/openmeetings-flash/../target/jacoco.exec,append=true>
[INFO] 
[INFO] --- maven-dependency-plugin:3.0.2:unpack (unpack) @ openmeetings-flash ---
[INFO] Configured Artifact: org.openlaszlo:openlaszlo:4.9.8:tgz
[WARNING] The POM for org.openlaszlo:openlaszlo:tgz:4.9.8 is missing, no dependency information
available
[INFO] Unpacking /home/jenkins/jenkins-slave/maven-repositories/1/org/openlaszlo/openlaszlo/4.9.8/openlaszlo-4.9.8.tgz
to <https://builds.apache.org/job/openmeetings/ws/openmeetings-flash/target> with includes
"" and excludes ""
[INFO] Expanding: /home/jenkins/jenkins-slave/maven-repositories/1/org/openlaszlo/openlaszlo/4.9.8/openlaszlo-4.9.8.tgz
into <https://builds.apache.org/job/openmeetings/ws/openmeetings-flash/target>
[INFO] 
[INFO] --- maven-remote-resources-plugin:1.5:process (process-resource-bundles) @ openmeetings-flash
---
[INFO] 
[INFO] --- maven-site-plugin:3.3:site (generate-site) @ openmeetings-flash ---
[INFO] configuring report plugin org.apache.maven.plugins:maven-project-info-reports-plugin:2.9
[INFO] configuring report plugin org.apache.maven.plugins:maven-surefire-report-plugin:2.20.1
[INFO] configuring report plugin org.apache.rat:apache-rat-plugin:0.12
[INFO] Parent project loaded from repository: org.apache:apache:pom:18
[INFO] Relativizing decoration links with respect to project URL: http://openmeetings.apache.org/openmeetings-flash
[INFO] Rendering site with lt.velykis.maven.skins:reflow-maven-skin:jar:1.1.1 skin.
[INFO] Generating "About" report    --- maven-project-info-reports-plugin:2.9
[INFO] Generating "CI Management" report    --- maven-project-info-reports-plugin:2.9
[INFO] Generating "Dependencies" report    --- maven-project-info-reports-plugin:2.9
[INFO] Generating "Dependency Convergence" report    --- maven-project-info-reports-plugin:2.9
[INFO] Generating "Dependency Management" report    --- maven-project-info-reports-plugin:2.9
[INFO] Generating "Distribution Management" report    --- maven-project-info-reports-plugin:2.9
[INFO] Generating "Issue Management" report    --- maven-project-info-reports-plugin:2.9
[INFO] Generating "Licenses" report    --- maven-project-info-reports-plugin:2.9
[INFO] Generating "Mailing Lists" report    --- maven-project-info-reports-plugin:2.9
[INFO] Generating "Plugin Management" report    --- maven-project-info-reports-plugin:2.9
[INFO] Generating "Plugins" report    --- maven-project-info-reports-plugin:2.9
[INFO] Generating "Team" report    --- maven-project-info-reports-plugin:2.9
[INFO] Generating "Source Code Management" report    --- maven-project-info-reports-plugin:2.9
[INFO] Generating "Summary" report    --- maven-project-info-reports-plugin:2.9
[INFO] Generating "Surefire Report" report    --- maven-surefire-report-plugin:2.20.1
[WARNING] Unable to locate Test Source XRef to link to - DISABLED
[INFO] Generating "Rat Report" report    --- apache-rat-plugin:0.12
[INFO] Enabled default license matchers.
[INFO] Will parse SCM ignores for exclusions...
[INFO] Finished adding exclusions from SCM ignore files.
[INFO] 61 implicit excludes (use -debug for more details).
[INFO] No excludes explicitly specified.
[INFO] 26 resources included (use -debug for more details)
Compiler warnings:
  WARNING:  'org.apache.xerces.jaxp.SAXParserImpl: Property 'http://javax.xml.XMLConstants/property/accessExternalDTD'
is not recognized.'
[JENKINS] Archiving site from <https://builds.apache.org/job/openmeetings/ws/openmeetings-flash/target/site>
to /x1/jenkins/jenkins-home/jobs/openmeetings/site/openmeetings-flash
[INFO] 
[INFO] --- maven-resources-plugin:3.0.2:resources (default-resources) @ openmeetings-flash
---
[INFO] Using 'UTF-8' encoding to copy filtered resources.
[INFO] skip non existing resourceDirectory <https://builds.apache.org/job/openmeetings/ws/openmeetings-flash/src/main/resources>
[INFO] Copying 3 resources
[INFO] 
[INFO] --- maven-compiler-plugin:3.7.0:compile (default-compile) @ openmeetings-flash ---
[INFO] No sources to compile
[INFO] 
[INFO] --- maven-antrun-plugin:1.8:run (default) @ openmeetings-flash ---
[INFO] Executing tasks

main:

compile.flex.debug:

compile.flex:

if_windows:

if_unix:

-compile.flex:
     [exec] Loading configuration file <https://builds.apache.org/job/openmeetings/ws/openmeetings-flash/target/openlaszlo46/WEB-INF/flexsdk/4.15.0/frameworks/flex-config.xml>
     [exec] <https://builds.apache.org/job/openmeetings/ws/openmeetings-flash/target/main.swf>
(580518 bytes)

compile.laszlo.networktesting.debug:

-compile.flash:
     [java] Compiling: networktesting.lzx to networktestingdebug.swf10.swf
     [java] Compilation errors occurred:
     [java] writeOptionsFile: cannot write incremental compiler options file: java.io.FileNotFoundException:
/tmp/lzswf9/./build/networktesting/LZC_COMPILER_OPTIONS (Permission denied)
     [java] 
[INFO]                                                                         
[INFO] ------------------------------------------------------------------------
[INFO] Skipping Openmeetings
[INFO] This project has been banned from the build due to previous failures.
[INFO] ------------------------------------------------------------------------
[INFO] ------------------------------------------------------------------------
[INFO] Reactor Summary:
[INFO] 
[INFO] Openmeetings ....................................... SUCCESS [ 28.449 s]
[INFO] Openmeetings Util .................................. SUCCESS [03:25 min]
[INFO] Openmeetings DB .................................... SUCCESS [ 20.316 s]
[INFO] Openmeetings Core .................................. SUCCESS [ 31.938 s]
[INFO] Openmeetings Install ............................... SUCCESS [ 15.565 s]
[INFO] Openmeetings Service ............................... SUCCESS [ 13.793 s]
[INFO] Openmeetings Webservices ........................... SUCCESS [01:02 min]
[INFO] Openmeetings Web ................................... SUCCESS [23:38 min]
[INFO] Openmeetings Flash ................................. FAILURE [ 13.458 s]
[INFO] Openmeetings Screen Sharing applet ................. SKIPPED
[INFO] Openmeetings Server ................................ SKIPPED
[INFO] ------------------------------------------------------------------------
[INFO] BUILD FAILURE
[INFO] ------------------------------------------------------------------------
[INFO] Total time: 30:19 min
[INFO] Finished at: 2017-11-14T16:52:41+00:00
[INFO] Final Memory: 110M/1103M
[INFO] ------------------------------------------------------------------------
[ERROR] Failed to execute goal org.apache.maven.plugins:maven-antrun-plugin:1.8:run (default)
on project openmeetings-flash: An Ant BuildException has occured: The following error occurred
while executing this line:
[ERROR] <https://builds.apache.org/job/openmeetings/ws/openmeetings-flash/openlaszlo.xml>:66:
The following error occurred while executing this line:
[ERROR] <https://builds.apache.org/job/openmeetings/ws/openmeetings-flash/openlaszlo.xml>:43:
Java returned: 2
[ERROR] around Ant part ...<ant antfile="<https://builds.apache.org/job/openmeetings/ws/openmeetings-flash/openlaszlo.xml">
target="client.only"/>... @ 4:125 in <https://builds.apache.org/job/openmeetings/ws/openmeetings-flash/target/antrun/build-main.xml>
[ERROR] -> [Help 1]
[ERROR] 
[ERROR] To see the full stack trace of the errors, re-run Maven with the -e switch.
[ERROR] Re-run Maven using the -X switch to enable full debug logging.
[ERROR] 
[ERROR] For more information about the errors and possible solutions, please read the following
articles:
[ERROR] [Help 1] http://cwiki.apache.org/confluence/display/MAVEN/MojoExecutionException
[ERROR] 
[ERROR] After correcting the problems, you can resume the build with the command
[ERROR]   mvn <goals> -rf :openmeetings-flash
[JENKINS] Archiving <https://builds.apache.org/job/openmeetings/ws/openmeetings-server/pom.xml>
to org.apache.openmeetings/openmeetings-server/5.0.0-SNAPSHOT/openmeetings-server-5.0.0-SNAPSHOT.pom
[JENKINS] Archiving <https://builds.apache.org/job/openmeetings/ws/openmeetings-screenshare/pom.xml>
to org.apache.openmeetings/openmeetings-screenshare/5.0.0-SNAPSHOT/openmeetings-screenshare-5.0.0-SNAPSHOT.pom
[JENKINS] Archiving <https://builds.apache.org/job/openmeetings/ws/openmeetings-util/pom.xml>
to org.apache.openmeetings/openmeetings-util/5.0.0-SNAPSHOT/openmeetings-util-5.0.0-SNAPSHOT.pom
[JENKINS] Archiving <https://builds.apache.org/job/openmeetings/ws/openmeetings-util/target/openmeetings-util-5.0.0-SNAPSHOT.jar>
to org.apache.openmeetings/openmeetings-util/5.0.0-SNAPSHOT/openmeetings-util-5.0.0-SNAPSHOT.jar
[JENKINS] Archiving <https://builds.apache.org/job/openmeetings/ws/openmeetings-util/target/openmeetings-util-5.0.0-SNAPSHOT-tests.jar>
to org.apache.openmeetings/openmeetings-util/5.0.0-SNAPSHOT/openmeetings-util-5.0.0-SNAPSHOT-tests.jar
[JENKINS] Archiving <https://builds.apache.org/job/openmeetings/ws/openmeetings-install/pom.xml>
to org.apache.openmeetings/openmeetings-install/5.0.0-SNAPSHOT/openmeetings-install-5.0.0-SNAPSHOT.pom
[JENKINS] Archiving <https://builds.apache.org/job/openmeetings/ws/openmeetings-install/target/openmeetings-install-5.0.0-SNAPSHOT.jar>
to org.apache.openmeetings/openmeetings-install/5.0.0-SNAPSHOT/openmeetings-install-5.0.0-SNAPSHOT.jar
[JENKINS] Archiving <https://builds.apache.org/job/openmeetings/ws/openmeetings-service/pom.xml>
to org.apache.openmeetings/openmeetings-service/5.0.0-SNAPSHOT/openmeetings-service-5.0.0-SNAPSHOT.pom
[JENKINS] Archiving <https://builds.apache.org/job/openmeetings/ws/openmeetings-service/target/openmeetings-service-5.0.0-SNAPSHOT.jar>
to org.apache.openmeetings/openmeetings-service/5.0.0-SNAPSHOT/openmeetings-service-5.0.0-SNAPSHOT.jar
[JENKINS] Archiving <https://builds.apache.org/job/openmeetings/ws/pom.xml> to org.apache.openmeetings/openmeetings-parent/5.0.0-SNAPSHOT/openmeetings-parent-5.0.0-SNAPSHOT.pom
[JENKINS] Archiving <https://builds.apache.org/job/openmeetings/ws/target/openmeetings-parent-5.0.0-SNAPSHOT-site.xml>
to org.apache.openmeetings/openmeetings-parent/5.0.0-SNAPSHOT/openmeetings-parent-5.0.0-SNAPSHOT-site.xml
[Fast Archiver] Compressed 44.02 KB of artifacts by 72.7% relative to #2152
[JENKINS] Archiving <https://builds.apache.org/job/openmeetings/ws/openmeetings-db/pom.xml>
to org.apache.openmeetings/openmeetings-db/5.0.0-SNAPSHOT/openmeetings-db-5.0.0-SNAPSHOT.pom
[JENKINS] Archiving <https://builds.apache.org/job/openmeetings/ws/openmeetings-db/target/openmeetings-db-5.0.0-SNAPSHOT.jar>
to org.apache.openmeetings/openmeetings-db/5.0.0-SNAPSHOT/openmeetings-db-5.0.0-SNAPSHOT.jar
[JENKINS] Archiving <https://builds.apache.org/job/openmeetings/ws/openmeetings-web/pom.xml>
to org.apache.openmeetings/openmeetings-web/5.0.0-SNAPSHOT/openmeetings-web-5.0.0-SNAPSHOT.pom
[JENKINS] Archiving <https://builds.apache.org/job/openmeetings/ws/openmeetings-web/target/openmeetings-web-5.0.0-SNAPSHOT.war>
to org.apache.openmeetings/openmeetings-web/5.0.0-SNAPSHOT/openmeetings-web-5.0.0-SNAPSHOT.war
[Fast Archiver] Compressed 64.73 MB of artifacts by 94.6% relative to #2152
[JENKINS] Archiving <https://builds.apache.org/job/openmeetings/ws/openmeetings-webservice/pom.xml>
to org.apache.openmeetings/openmeetings-webservice/5.0.0-SNAPSHOT/openmeetings-webservice-5.0.0-SNAPSHOT.pom
[JENKINS] Archiving <https://builds.apache.org/job/openmeetings/ws/openmeetings-webservice/target/openmeetings-webservice-5.0.0-SNAPSHOT.jar>
to org.apache.openmeetings/openmeetings-webservice/5.0.0-SNAPSHOT/openmeetings-webservice-5.0.0-SNAPSHOT.jar
[JENKINS] Archiving <https://builds.apache.org/job/openmeetings/ws/openmeetings-core/pom.xml>
to org.apache.openmeetings/openmeetings-core/5.0.0-SNAPSHOT/openmeetings-core-5.0.0-SNAPSHOT.pom
[JENKINS] Archiving <https://builds.apache.org/job/openmeetings/ws/openmeetings-core/target/openmeetings-core-5.0.0-SNAPSHOT.jar>
to org.apache.openmeetings/openmeetings-core/5.0.0-SNAPSHOT/openmeetings-core-5.0.0-SNAPSHOT.jar
[JENKINS] Archiving <https://builds.apache.org/job/openmeetings/ws/openmeetings-core/target/openmeetings-core-5.0.0-SNAPSHOT-tests.jar>
to org.apache.openmeetings/openmeetings-core/5.0.0-SNAPSHOT/openmeetings-core-5.0.0-SNAPSHOT-tests.jar
[JENKINS] Archiving <https://builds.apache.org/job/openmeetings/ws/openmeetings-flash/pom.xml>
to org.apache.openmeetings/openmeetings-flash/5.0.0-SNAPSHOT/openmeetings-flash-5.0.0-SNAPSHOT.pom
Sending e-mails to: dev@openmeetings.apache.org
channel stopped
Archiving artifacts
Not sending mail to unregistered user solomax666@gmail.com

Mime
View raw message