openmeetings-dev mailing list archives

Site index · List index
Message view « Date » · « Thread »
Top « Date » · « Thread »
From Apache Jenkins Server <jenk...@builds.apache.org>
Subject Build failed in Jenkins: openmeetings #1789
Date Mon, 14 Aug 2017 10:33:20 GMT
See <https://builds.apache.org/job/openmeetings/1789/display/redirect?page=changes>

Changes:

[solomax666] [OPENMEETINGS-980] wicketstuff version is updated

------------------------------------------
[...truncated 124.39 KB...]
[INFO] Downloaded: https://repo.maven.apache.org/maven2/com/googlecode/wicket-jquery-ui/wicket-kendo-ui/8.0.0-M7/wicket-kendo-ui-8.0.0-M7.jar
(1518 KB at 7624.3 KB/sec)
[INFO] Downloading: https://repo.maven.apache.org/maven2/org/wicketstuff/wicketstuff-select2/8.0.0-M7/wicketstuff-select2-8.0.0-M7.jar
[INFO] Downloaded: https://repo.maven.apache.org/maven2/org/wicketstuff/wicketstuff-dashboard-core/8.0.0-M7/wicketstuff-dashboard-core-8.0.0-M7.jar
(130 KB at 486.9 KB/sec)
[INFO] Downloading: https://repo.maven.apache.org/maven2/org/wicketstuff/jqplot/8.0.0-M7/jqplot-8.0.0-M7.jar
[INFO] Downloaded: https://repo.maven.apache.org/maven2/com/googlecode/wicket-jquery-ui/wicket-kendo-ui-culture/8.0.0-M7/wicket-kendo-ui-culture-8.0.0-M7.jar
(3024 KB at 9053.3 KB/sec)
[INFO] Downloaded: https://repo.maven.apache.org/maven2/com/googlecode/wicket-jquery-ui/wicket-kendo-ui-theme-default/8.0.0-M7/wicket-kendo-ui-theme-default-8.0.0-M7.jar
(3744 KB at 11140.1 KB/sec)
[INFO] Downloaded: https://repo.maven.apache.org/maven2/org/wicketstuff/wicketstuff-urlfragment/8.0.0-M7/wicketstuff-urlfragment-8.0.0-M7.jar
(18 KB at 45.8 KB/sec)
[INFO] Downloaded: https://repo.maven.apache.org/maven2/org/wicketstuff/wicketstuff-select2/8.0.0-M7/wicketstuff-select2-8.0.0-M7.jar
(180 KB at 421.6 KB/sec)
[INFO] Downloaded: https://repo.maven.apache.org/maven2/org/wicketstuff/jqplot/8.0.0-M7/jqplot-8.0.0-M7.jar
(393 KB at 608.9 KB/sec)
[INFO] 
[INFO] --- maven-clean-plugin:3.0.0:clean (default-clean) @ openmeetings-web ---
[INFO] Deleting <https://builds.apache.org/job/openmeetings/ws/openmeetings-web/target>
[INFO] 
[INFO] --- buildnumber-maven-plugin:1.4:create (default) @ openmeetings-web ---
[INFO] 
[INFO] --- apache-rat-plugin:0.12:check (default) @ openmeetings-web ---
[INFO] Added 1 additional default licenses.
[INFO] Enabled default license matchers.
[INFO] Added 1 custom approved licenses.
[INFO] Will parse SCM ignores for exclusions...
[INFO] Finished adding exclusions from SCM ignore files.
[INFO] 61 implicit excludes (use -debug for more details).
[INFO] Exclude: **/*.mp3
[INFO] 590 resources included (use -debug for more details)
[INFO] Rat check: Summary over all files. Unapproved: 0, unknown: 0, generated: 0, approved:
458 licenses.
[INFO] 
[INFO] --- maven-remote-resources-plugin:1.5:process (process-resource-bundles) @ openmeetings-web
---
[INFO] 
[INFO] --- maven-site-plugin:3.3:site (generate-site) @ openmeetings-web ---
[INFO] configuring report plugin org.apache.maven.plugins:maven-project-info-reports-plugin:2.9
[INFO] configuring report plugin org.apache.maven.plugins:maven-surefire-report-plugin:2.20
[INFO] configuring report plugin org.apache.rat:apache-rat-plugin:0.12
[INFO] Parent project loaded from repository: org.apache:apache:pom:18
[INFO] Relativizing decoration links with respect to project URL: http://openmeetings.apache.org/openmeetings-web
[INFO] Rendering site with lt.velykis.maven.skins:reflow-maven-skin:jar:1.1.1 skin.
[INFO] Generating "About" report    --- maven-project-info-reports-plugin:2.9
[INFO] Generating "CI Management" report    --- maven-project-info-reports-plugin:2.9
[INFO] Generating "Dependencies" report    --- maven-project-info-reports-plugin:2.9
[INFO] Generating "Dependency Convergence" report    --- maven-project-info-reports-plugin:2.9
[INFO] Generating "Dependency Management" report    --- maven-project-info-reports-plugin:2.9
[INFO] Generating "Distribution Management" report    --- maven-project-info-reports-plugin:2.9
[INFO] Generating "Issue Management" report    --- maven-project-info-reports-plugin:2.9
[INFO] Generating "Licenses" report    --- maven-project-info-reports-plugin:2.9
[INFO] Generating "Mailing Lists" report    --- maven-project-info-reports-plugin:2.9
[INFO] Generating "Plugin Management" report    --- maven-project-info-reports-plugin:2.9
[INFO] Generating "Plugins" report    --- maven-project-info-reports-plugin:2.9
[INFO] Generating "Team" report    --- maven-project-info-reports-plugin:2.9
[INFO] Generating "Source Code Management" report    --- maven-project-info-reports-plugin:2.9
[INFO] Generating "Summary" report    --- maven-project-info-reports-plugin:2.9
[INFO] Generating "Surefire Report" report    --- maven-surefire-report-plugin:2.20
[WARNING] Unable to locate Test Source XRef to link to - DISABLED
[INFO] Generating "Rat Report" report    --- apache-rat-plugin:0.12
[INFO] Enabled default license matchers.
[INFO] Will parse SCM ignores for exclusions...
[INFO] Finished adding exclusions from SCM ignore files.
[INFO] 61 implicit excludes (use -debug for more details).
[INFO] No excludes explicitly specified.
[INFO] 591 resources included (use -debug for more details)
Compiler warnings:
  WARNING:  'org.apache.xerces.jaxp.SAXParserImpl: Property 'http://javax.xml.XMLConstants/property/accessExternalDTD'
is not recognized.'
[JENKINS] Archiving site from <https://builds.apache.org/job/openmeetings/ws/openmeetings-web/target/site>
to /x1/jenkins/jenkins-home/jobs/openmeetings/site/openmeetings-web
[INFO] 
[INFO] --- maven-antrun-plugin:1.8:run (select-db) @ openmeetings-web ---
[INFO] Executing tasks

main:
     [copy] Copying 1 file to <https://builds.apache.org/job/openmeetings/ws/openmeetings-web/target/generated-res>
[INFO] Executed tasks
[INFO] 
[INFO] --- maven-resources-plugin:3.0.2:resources (default-resources) @ openmeetings-web ---
[INFO] Using 'UTF-8' encoding to copy filtered resources.
[INFO] skip non existing resourceDirectory <https://builds.apache.org/job/openmeetings/ws/openmeetings-web/src/main/resources>
[INFO] Copying 3 resources
[INFO] 
[INFO] --- minify-maven-plugin:1.7.6:minify (theme-minify) @ openmeetings-web ---
[INFO] Starting CSS task:
[INFO] Processing source file [general.css].
[INFO] Processing source file [activities.css].
[INFO] Processing source file [admin.css].
[INFO] Processing source file [calendar.css].
[INFO] Processing source file [chat.css].
[INFO] Processing source file [menu.css].
[INFO] Processing source file [room.css].
[INFO] Processing source file [tree.css].
[INFO] Processing source file [wb.css].
[INFO] Creating the merged file [theme.css].
[INFO] Creating the minified file [theme.min.css].
[INFO] Uncompressed size: 46210 bytes.
[INFO] Compressed size: 33480 bytes minified (6852 bytes gzipped).
[INFO] 
[INFO] Starting JavaScript task:
[INFO] 
[INFO] --- minify-maven-plugin:1.7.6:minify (theme-rtl-minify) @ openmeetings-web ---
[INFO] Starting CSS task:
[INFO] Processing source file [general-rtl.css].
[INFO] Creating the merged file [theme-rtl.css].
[INFO] Creating the minified file [theme-rtl.min.css].
[INFO] Uncompressed size: 2481 bytes.
[INFO] Compressed size: 1405 bytes minified (461 bytes gzipped).
[INFO] 
[INFO] Starting JavaScript task:
[INFO] 
[INFO] --- maven-compiler-plugin:3.6.1:compile (default-compile) @ openmeetings-web ---
[INFO] Changes detected - recompiling the module!
[INFO] Compiling 214 source files to <https://builds.apache.org/job/openmeetings/ws/openmeetings-web/target/classes>
[INFO] -------------------------------------------------------------
[ERROR] COMPILATION ERROR : 
[INFO] -------------------------------------------------------------
[ERROR] <https://builds.apache.org/job/openmeetings/ws/openmeetings-web/src/main/java/org/apache/openmeetings/web/room/SwfPanel.java>:[59,26]
package com.hazelcast.core does not exist
[ERROR] <https://builds.apache.org/job/openmeetings/ws/openmeetings-web/src/main/java/org/apache/openmeetings/web/app/Application.java>:[132,28]
package com.hazelcast.config does not exist
[ERROR] <https://builds.apache.org/job/openmeetings/ws/openmeetings-web/src/main/java/org/apache/openmeetings/web/app/Application.java>:[133,26]
package com.hazelcast.core does not exist
[ERROR] <https://builds.apache.org/job/openmeetings/ws/openmeetings-web/src/main/java/org/apache/openmeetings/web/app/Application.java>:[134,26]
package com.hazelcast.core does not exist
[ERROR] <https://builds.apache.org/job/openmeetings/ws/openmeetings-web/src/main/java/org/apache/openmeetings/web/app/Application.java>:[135,26]
package com.hazelcast.core does not exist
[ERROR] <https://builds.apache.org/job/openmeetings/ws/openmeetings-web/src/main/java/org/apache/openmeetings/web/app/Application.java>:[136,26]
package com.hazelcast.core does not exist
[ERROR] <https://builds.apache.org/job/openmeetings/ws/openmeetings-web/src/main/java/org/apache/openmeetings/web/app/Application.java>:[137,26]
package com.hazelcast.core does not exist
[ERROR] <https://builds.apache.org/job/openmeetings/ws/openmeetings-web/src/main/java/org/apache/openmeetings/web/app/Application.java>:[138,26]
package com.hazelcast.core does not exist
[ERROR] <https://builds.apache.org/job/openmeetings/ws/openmeetings-web/src/main/java/org/apache/openmeetings/web/app/Application.java>:[139,26]
package com.hazelcast.core does not exist
[ERROR] <https://builds.apache.org/job/openmeetings/ws/openmeetings-web/src/main/java/org/apache/openmeetings/web/app/Application.java>:[140,26]
package com.hazelcast.core does not exist
[ERROR] <https://builds.apache.org/job/openmeetings/ws/openmeetings-web/src/main/java/org/apache/openmeetings/web/app/Application.java>:[141,26]
package com.hazelcast.core does not exist
[ERROR] <https://builds.apache.org/job/openmeetings/ws/openmeetings-web/src/main/java/org/apache/openmeetings/web/app/Application.java>:[166,23]
cannot find symbol
  symbol:   class HazelcastInstance
  location: class org.apache.openmeetings.web.app.Application
[ERROR] <https://builds.apache.org/job/openmeetings/ws/openmeetings-web/src/main/java/org/apache/openmeetings/web/app/Application.java>:[167,17]
cannot find symbol
  symbol:   class ITopic
  location: class org.apache.openmeetings.web.app.Application
[ERROR] <https://builds.apache.org/job/openmeetings/ws/openmeetings-web/src/main/java/org/apache/openmeetings/web/app/Application.java>:[860,21]
cannot find symbol
  symbol:   class Member
  location: class org.apache.openmeetings.web.app.Application
[ERROR] <https://builds.apache.org/job/openmeetings/ws/openmeetings-web/src/main/java/org/apache/openmeetings/web/room/SwfPanel.java>:[175,68]
cannot find symbol
  symbol:   class Member
  location: class org.apache.openmeetings.web.room.SwfPanel
[ERROR] <https://builds.apache.org/job/openmeetings/ws/openmeetings-web/src/main/java/org/apache/openmeetings/web/room/poll/PollResultsDialog.java>:[58,30]
package br.com.digilabs.jqplot does not exist
[ERROR] <https://builds.apache.org/job/openmeetings/ws/openmeetings-web/src/main/java/org/apache/openmeetings/web/room/poll/PollResultsDialog.java>:[59,30]
package br.com.digilabs.jqplot does not exist
[ERROR] <https://builds.apache.org/job/openmeetings/ws/openmeetings-web/src/main/java/org/apache/openmeetings/web/room/poll/PollResultsDialog.java>:[60,30]
package br.com.digilabs.jqplot does not exist
[ERROR] <https://builds.apache.org/job/openmeetings/ws/openmeetings-web/src/main/java/org/apache/openmeetings/web/room/poll/PollResultsDialog.java>:[61,30]
package br.com.digilabs.jqplot does not exist
[ERROR] <https://builds.apache.org/job/openmeetings/ws/openmeetings-web/src/main/java/org/apache/openmeetings/web/room/poll/PollResultsDialog.java>:[62,36]
package br.com.digilabs.jqplot.chart does not exist
[ERROR] <https://builds.apache.org/job/openmeetings/ws/openmeetings-web/src/main/java/org/apache/openmeetings/web/room/poll/PollResultsDialog.java>:[63,36]
package br.com.digilabs.jqplot.chart does not exist
[ERROR] <https://builds.apache.org/job/openmeetings/ws/openmeetings-web/src/main/java/org/apache/openmeetings/web/room/poll/PollResultsDialog.java>:[64,39]
package br.com.digilabs.jqplot.elements does not exist
[ERROR] <https://builds.apache.org/job/openmeetings/ws/openmeetings-web/src/main/java/org/apache/openmeetings/web/room/poll/PollResultsDialog.java>:[65,39]
package br.com.digilabs.jqplot.elements does not exist
[ERROR] <https://builds.apache.org/job/openmeetings/ws/openmeetings-web/src/main/java/org/apache/openmeetings/web/room/poll/PollResultsDialog.java>:[66,39]
package br.com.digilabs.jqplot.elements does not exist
[ERROR] <https://builds.apache.org/job/openmeetings/ws/openmeetings-web/src/main/java/org/apache/openmeetings/web/room/poll/PollResultsDialog.java>:[148,41]
cannot find symbol
  symbol:   class Chart
  location: class org.apache.openmeetings.web.room.poll.PollResultsDialog
[ERROR] <https://builds.apache.org/job/openmeetings/ws/openmeetings-web/src/main/java/org/apache/openmeetings/web/room/poll/PollResultsDialog.java>:[240,24]
cannot find symbol
  symbol:   class PieChart
  location: class org.apache.openmeetings.web.room.poll.PollResultsDialog
[ERROR] <https://builds.apache.org/job/openmeetings/ws/openmeetings-web/src/main/java/org/apache/openmeetings/web/room/poll/PollResultsDialog.java>:[262,24]
cannot find symbol
  symbol:   class BarChart
  location: class org.apache.openmeetings.web.room.poll.PollResultsDialog
[INFO] 27 errors 
[INFO] -------------------------------------------------------------
[INFO] ------------------------------------------------------------------------
[INFO] Reactor Summary:
[INFO] 
[INFO] Openmeetings ....................................... SUCCESS [01:33 min]
[INFO] Openmeetings Util .................................. SUCCESS [03:57 min]
[INFO] Openmeetings DB .................................... SUCCESS [ 19.146 s]
[INFO] Openmeetings Core .................................. SUCCESS [ 20.042 s]
[INFO] Openmeetings Install ............................... SUCCESS [ 15.783 s]
[INFO] Openmeetings Service ............................... SUCCESS [ 17.440 s]
[INFO] Openmeetings Webservices ........................... SUCCESS [01:01 min]
[INFO] Openmeetings Web ................................... FAILURE [ 28.498 s]
[INFO] Openmeetings Flash ................................. SKIPPED
[INFO] Openmeetings Screen Sharing applet ................. SKIPPED
[INFO] Openmeetings Server ................................ SKIPPED
[INFO] ------------------------------------------------------------------------
[INFO] BUILD FAILURE
[INFO] ------------------------------------------------------------------------
[INFO] Total time: 08:39 min
[INFO] Finished at: 2017-08-14T10:32:02+00:00
[INFO] Final Memory: 101M/1066M
[INFO] ------------------------------------------------------------------------
[ERROR] Failed to execute goal org.apache.maven.plugins:maven-compiler-plugin:3.6.1:compile
(default-compile) on project openmeetings-web: Compilation failure: Compilation failure:
[ERROR] <https://builds.apache.org/job/openmeetings/ws/openmeetings-web/src/main/java/org/apache/openmeetings/web/room/SwfPanel.java>:[59,26]
package com.hazelcast.core does not exist
[ERROR] <https://builds.apache.org/job/openmeetings/ws/openmeetings-web/src/main/java/org/apache/openmeetings/web/app/Application.java>:[132,28]
package com.hazelcast.config does not exist
[ERROR] <https://builds.apache.org/job/openmeetings/ws/openmeetings-web/src/main/java/org/apache/openmeetings/web/app/Application.java>:[133,26]
package com.hazelcast.core does not exist
[ERROR] <https://builds.apache.org/job/openmeetings/ws/openmeetings-web/src/main/java/org/apache/openmeetings/web/app/Application.java>:[134,26]
package com.hazelcast.core does not exist
[ERROR] <https://builds.apache.org/job/openmeetings/ws/openmeetings-web/src/main/java/org/apache/openmeetings/web/app/Application.java>:[135,26]
package com.hazelcast.core does not exist
[ERROR] <https://builds.apache.org/job/openmeetings/ws/openmeetings-web/src/main/java/org/apache/openmeetings/web/app/Application.java>:[136,26]
package com.hazelcast.core does not exist
[ERROR] <https://builds.apache.org/job/openmeetings/ws/openmeetings-web/src/main/java/org/apache/openmeetings/web/app/Application.java>:[137,26]
package com.hazelcast.core does not exist
[ERROR] <https://builds.apache.org/job/openmeetings/ws/openmeetings-web/src/main/java/org/apache/openmeetings/web/app/Application.java>:[138,26]
package com.hazelcast.core does not exist
[ERROR] <https://builds.apache.org/job/openmeetings/ws/openmeetings-web/src/main/java/org/apache/openmeetings/web/app/Application.java>:[139,26]
package com.hazelcast.core does not exist
[ERROR] <https://builds.apache.org/job/openmeetings/ws/openmeetings-web/src/main/java/org/apache/openmeetings/web/app/Application.java>:[140,26]
package com.hazelcast.core does not exist
[ERROR] <https://builds.apache.org/job/openmeetings/ws/openmeetings-web/src/main/java/org/apache/openmeetings/web/app/Application.java>:[141,26]
package com.hazelcast.core does not exist
[ERROR] <https://builds.apache.org/job/openmeetings/ws/openmeetings-web/src/main/java/org/apache/openmeetings/web/app/Application.java>:[166,23]
cannot find symbol
[ERROR] symbol:   class HazelcastInstance
[ERROR] location: class org.apache.openmeetings.web.app.Application
[ERROR] <https://builds.apache.org/job/openmeetings/ws/openmeetings-web/src/main/java/org/apache/openmeetings/web/app/Application.java>:[167,17]
cannot find symbol
[ERROR] symbol:   class ITopic
[ERROR] location: class org.apache.openmeetings.web.app.Application
[ERROR] <https://builds.apache.org/job/openmeetings/ws/openmeetings-web/src/main/java/org/apache/openmeetings/web/app/Application.java>:[860,21]
cannot find symbol
[ERROR] symbol:   class Member
[ERROR] location: class org.apache.openmeetings.web.app.Application
[ERROR] <https://builds.apache.org/job/openmeetings/ws/openmeetings-web/src/main/java/org/apache/openmeetings/web/room/SwfPanel.java>:[175,68]
cannot find symbol
[ERROR] symbol:   class Member
[ERROR] location: class org.apache.openmeetings.web.room.SwfPanel
[ERROR] <https://builds.apache.org/job/openmeetings/ws/openmeetings-web/src/main/java/org/apache/openmeetings/web/room/poll/PollResultsDialog.java>:[58,30]
package br.com.digilabs.jqplot does not exist
[ERROR] <https://builds.apache.org/job/openmeetings/ws/openmeetings-web/src/main/java/org/apache/openmeetings/web/room/poll/PollResultsDialog.java>:[59,30]
package br.com.digilabs.jqplot does not exist
[ERROR] <https://builds.apache.org/job/openmeetings/ws/openmeetings-web/src/main/java/org/apache/openmeetings/web/room/poll/PollResultsDialog.java>:[60,30]
package br.com.digilabs.jqplot does not exist
[ERROR] <https://builds.apache.org/job/openmeetings/ws/openmeetings-web/src/main/java/org/apache/openmeetings/web/room/poll/PollResultsDialog.java>:[61,30]
package br.com.digilabs.jqplot does not exist
[ERROR] <https://builds.apache.org/job/openmeetings/ws/openmeetings-web/src/main/java/org/apache/openmeetings/web/room/poll/PollResultsDialog.java>:[62,36]
package br.com.digilabs.jqplot.chart does not exist
[ERROR] <https://builds.apache.org/job/openmeetings/ws/openmeetings-web/src/main/java/org/apache/openmeetings/web/room/poll/PollResultsDialog.java>:[63,36]
package br.com.digilabs.jqplot.chart does not exist
[ERROR] <https://builds.apache.org/job/openmeetings/ws/openmeetings-web/src/main/java/org/apache/openmeetings/web/room/poll/PollResultsDialog.java>:[64,39]
package br.com.digilabs.jqplot.elements does not exist
[ERROR] <https://builds.apache.org/job/openmeetings/ws/openmeetings-web/src/main/java/org/apache/openmeetings/web/room/poll/PollResultsDialog.java>:[65,39]
package br.com.digilabs.jqplot.elements does not exist
[ERROR] <https://builds.apache.org/job/openmeetings/ws/openmeetings-web/src/main/java/org/apache/openmeetings/web/room/poll/PollResultsDialog.java>:[66,39]
package br.com.digilabs.jqplot.elements does not exist
[ERROR] <https://builds.apache.org/job/openmeetings/ws/openmeetings-web/src/main/java/org/apache/openmeetings/web/room/poll/PollResultsDialog.java>:[148,41]
cannot find symbol
[ERROR] symbol:   class Chart
[ERROR] location: class org.apache.openmeetings.web.room.poll.PollResultsDialog
[ERROR] <https://builds.apache.org/job/openmeetings/ws/openmeetings-web/src/main/java/org/apache/openmeetings/web/room/poll/PollResultsDialog.java>:[240,24]
cannot find symbol
[ERROR] symbol:   class PieChart
[ERROR] location: class org.apache.openmeetings.web.room.poll.PollResultsDialog
[ERROR] <https://builds.apache.org/job/openmeetings/ws/openmeetings-web/src/main/java/org/apache/openmeetings/web/room/poll/PollResultsDialog.java>:[262,24]
cannot find symbol
[ERROR] symbol:   class BarChart
[ERROR] location: class org.apache.openmeetings.web.room.poll.PollResultsDialog
[ERROR] -> [Help 1]
[ERROR] 
[ERROR] To see the full stack trace of the errors, re-run Maven with the -e switch.
[ERROR] Re-run Maven using the -X switch to enable full debug logging.
[ERROR] 
[ERROR] For more information about the errors and possible solutions, please read the following
articles:
[ERROR] [Help 1] http://cwiki.apache.org/confluence/display/MAVEN/MojoFailureException
[ERROR] 
[ERROR] After correcting the problems, you can resume the build with the command
[ERROR]   mvn <goals> -rf :openmeetings-web
[JENKINS] Archiving <https://builds.apache.org/job/openmeetings/ws/openmeetings-server/pom.xml>
to org.apache.openmeetings/openmeetings-server/4.0.0-SNAPSHOT/openmeetings-server-4.0.0-SNAPSHOT.pom
[JENKINS] Archiving <https://builds.apache.org/job/openmeetings/ws/openmeetings-screenshare/pom.xml>
to org.apache.openmeetings/openmeetings-screenshare/4.0.0-SNAPSHOT/openmeetings-screenshare-4.0.0-SNAPSHOT.pom
[JENKINS] Archiving <https://builds.apache.org/job/openmeetings/ws/openmeetings-util/pom.xml>
to org.apache.openmeetings/openmeetings-util/4.0.0-SNAPSHOT/openmeetings-util-4.0.0-SNAPSHOT.pom
[JENKINS] Archiving <https://builds.apache.org/job/openmeetings/ws/openmeetings-util/target/openmeetings-util-4.0.0-SNAPSHOT.jar>
to org.apache.openmeetings/openmeetings-util/4.0.0-SNAPSHOT/openmeetings-util-4.0.0-SNAPSHOT.jar
[JENKINS] Archiving <https://builds.apache.org/job/openmeetings/ws/openmeetings-util/target/openmeetings-util-4.0.0-SNAPSHOT-tests.jar>
to org.apache.openmeetings/openmeetings-util/4.0.0-SNAPSHOT/openmeetings-util-4.0.0-SNAPSHOT-tests.jar
[JENKINS] Archiving <https://builds.apache.org/job/openmeetings/ws/openmeetings-install/pom.xml>
to org.apache.openmeetings/openmeetings-install/4.0.0-SNAPSHOT/openmeetings-install-4.0.0-SNAPSHOT.pom
[JENKINS] Archiving <https://builds.apache.org/job/openmeetings/ws/openmeetings-install/target/openmeetings-install-4.0.0-SNAPSHOT.jar>
to org.apache.openmeetings/openmeetings-install/4.0.0-SNAPSHOT/openmeetings-install-4.0.0-SNAPSHOT.jar
[JENKINS] Archiving <https://builds.apache.org/job/openmeetings/ws/openmeetings-service/pom.xml>
to org.apache.openmeetings/openmeetings-service/4.0.0-SNAPSHOT/openmeetings-service-4.0.0-SNAPSHOT.pom
[JENKINS] Archiving <https://builds.apache.org/job/openmeetings/ws/openmeetings-service/target/openmeetings-service-4.0.0-SNAPSHOT.jar>
to org.apache.openmeetings/openmeetings-service/4.0.0-SNAPSHOT/openmeetings-service-4.0.0-SNAPSHOT.jar
[JENKINS] Archiving <https://builds.apache.org/job/openmeetings/ws/pom.xml> to org.apache.openmeetings/openmeetings-parent/4.0.0-SNAPSHOT/openmeetings-parent-4.0.0-SNAPSHOT.pom
[JENKINS] Archiving <https://builds.apache.org/job/openmeetings/ws/target/openmeetings-parent-4.0.0-SNAPSHOT-site.xml>
to org.apache.openmeetings/openmeetings-parent/4.0.0-SNAPSHOT/openmeetings-parent-4.0.0-SNAPSHOT-site.xml
[JENKINS] Archiving <https://builds.apache.org/job/openmeetings/ws/openmeetings-db/pom.xml>
to org.apache.openmeetings/openmeetings-db/4.0.0-SNAPSHOT/openmeetings-db-4.0.0-SNAPSHOT.pom
[JENKINS] Archiving <https://builds.apache.org/job/openmeetings/ws/openmeetings-db/target/openmeetings-db-4.0.0-SNAPSHOT.jar>
to org.apache.openmeetings/openmeetings-db/4.0.0-SNAPSHOT/openmeetings-db-4.0.0-SNAPSHOT.jar
[JENKINS] Archiving <https://builds.apache.org/job/openmeetings/ws/openmeetings-web/pom.xml>
to org.apache.openmeetings/openmeetings-web/4.0.0-SNAPSHOT/openmeetings-web-4.0.0-SNAPSHOT.pom
[JENKINS] Archiving <https://builds.apache.org/job/openmeetings/ws/openmeetings-webservice/pom.xml>
to org.apache.openmeetings/openmeetings-webservice/4.0.0-SNAPSHOT/openmeetings-webservice-4.0.0-SNAPSHOT.pom
[JENKINS] Archiving <https://builds.apache.org/job/openmeetings/ws/openmeetings-webservice/target/openmeetings-webservice-4.0.0-SNAPSHOT.jar>
to org.apache.openmeetings/openmeetings-webservice/4.0.0-SNAPSHOT/openmeetings-webservice-4.0.0-SNAPSHOT.jar
[JENKINS] Archiving <https://builds.apache.org/job/openmeetings/ws/openmeetings-core/pom.xml>
to org.apache.openmeetings/openmeetings-core/4.0.0-SNAPSHOT/openmeetings-core-4.0.0-SNAPSHOT.pom
[JENKINS] Archiving <https://builds.apache.org/job/openmeetings/ws/openmeetings-core/target/openmeetings-core-4.0.0-SNAPSHOT.jar>
to org.apache.openmeetings/openmeetings-core/4.0.0-SNAPSHOT/openmeetings-core-4.0.0-SNAPSHOT.jar
[JENKINS] Archiving <https://builds.apache.org/job/openmeetings/ws/openmeetings-core/target/openmeetings-core-4.0.0-SNAPSHOT-tests.jar>
to org.apache.openmeetings/openmeetings-core/4.0.0-SNAPSHOT/openmeetings-core-4.0.0-SNAPSHOT-tests.jar
[JENKINS] Archiving <https://builds.apache.org/job/openmeetings/ws/openmeetings-flash/pom.xml>
to org.apache.openmeetings/openmeetings-flash/4.0.0-SNAPSHOT/openmeetings-flash-4.0.0-SNAPSHOT.pom
Sending e-mails to: dev@openmeetings.apache.org
channel stopped
Archiving artifacts
[Fast Archiver] Compressed 225.52 MB of artifacts by 100.0% relative to #1788
Not sending mail to unregistered user solomax666@gmail.com

Mime
View raw message