openmeetings-dev mailing list archives

Site index · List index
Message view « Date » · « Thread »
Top « Date » · « Thread »
From Apache Jenkins Server <jenk...@builds.apache.org>
Subject Build failed in Jenkins: openmeetings #1756
Date Wed, 02 Aug 2017 09:15:13 GMT
See <https://builds.apache.org/job/openmeetings/1756/display/redirect?page=changes>

Changes:

[solomax666] [OPENMEETINGS-1677] html5 wb should work as expected

------------------------------------------
Started by an SCM change
[EnvInject] - Loading node environment variables.
Building remotely on H22 (couchdbtest ubuntu xenial) in workspace <https://builds.apache.org/job/openmeetings/ws/>
 > git rev-parse --is-inside-work-tree # timeout=10
Fetching changes from the remote Git repository
 > git config remote.origin.url https://git-wip-us.apache.org/repos/asf/openmeetings.git
# timeout=10
Fetching upstream changes from https://git-wip-us.apache.org/repos/asf/openmeetings.git
 > git --version # timeout=10
 > git fetch --tags --progress https://git-wip-us.apache.org/repos/asf/openmeetings.git
+refs/heads/*:refs/remotes/origin/*
 > git rev-parse refs/remotes/origin/master^{commit} # timeout=10
 > git rev-parse refs/remotes/origin/origin/master^{commit} # timeout=10
Checking out Revision 22d0528d65e1904fb4177e74cc7243a883554d24 (refs/remotes/origin/master)
Commit message: "[OPENMEETINGS-1677] html5 wb should work as expected"
 > git config core.sparsecheckout # timeout=10
 > git checkout -f 22d0528d65e1904fb4177e74cc7243a883554d24
 > git rev-list 0e6b60a88a6181ad28ecc823c00ccc1ddff611bb # timeout=10
Parsing POMs
Modules changed, recalculating dependency graph
Established TCP socket on 44622
maven33-agent.jar already up to date
maven33-interceptor.jar already up to date
maven3-interceptor-commons.jar already up to date
[openmeetings] $ /home/jenkins/tools/java/latest1.8/bin/java -Xmx2g -Xms512m -XX:MaxMetaspaceSize=512m
-cp /home/jenkins/jenkins-slave/maven33-agent.jar:/home/jenkins/tools/maven/apache-maven-3.3.9/boot/plexus-classworlds-2.5.2.jar:/home/jenkins/tools/maven/apache-maven-3.3.9/conf/logging
jenkins.maven3.agent.Maven33Main /home/jenkins/tools/maven/apache-maven-3.3.9 /home/jenkins/jenkins-slave/slave.jar
/home/jenkins/jenkins-slave/maven33-interceptor.jar /home/jenkins/jenkins-slave/maven3-interceptor-commons.jar
44622
<===[JENKINS REMOTING CAPACITY]===>   channel started
Executing Maven:  -B -f <https://builds.apache.org/job/openmeetings/ws/pom.xml> -Dmaven.repo.local=/home/jenkins/jenkins-slave/maven-repositories/0
clean install -PallModules,Jenkins
[INFO] Scanning for projects...
[INFO] ------------------------------------------------------------------------
[INFO] Reactor Build Order:
[INFO] 
[INFO] Openmeetings
[INFO] Openmeetings Util
[INFO] Openmeetings DB
[INFO] Openmeetings Core
[INFO] Openmeetings Install
[INFO] Openmeetings Service
[INFO] Openmeetings Webservices
[INFO] Openmeetings Web
[INFO] Openmeetings Flash
[INFO] Openmeetings Screen Sharing applet
[INFO] Openmeetings Server
[INFO]                                                                         
[INFO] ------------------------------------------------------------------------
[INFO] Building Openmeetings 4.0.0-SNAPSHOT
[INFO] ------------------------------------------------------------------------
[INFO] 
[INFO] --- maven-clean-plugin:3.0.0:clean (default-clean) @ openmeetings-parent ---
[INFO] Deleting <https://builds.apache.org/job/openmeetings/ws/target>
[INFO] 
[INFO] --- buildnumber-maven-plugin:1.4:create (default) @ openmeetings-parent ---
[INFO] Executing: /bin/sh -c cd '<https://builds.apache.org/job/openmeetings/ws/'> &&
'git' 'rev-parse' '--verify' 'HEAD'
[INFO] Working directory: <https://builds.apache.org/job/openmeetings/ws/>
[INFO] Storing buildNumber: 22d0528d65e1904fb4177e74cc7243a883554d24 at timestamp: 1501665239067
[WARNING] Cannot get the branch information from the git repository: 
Detecting the current branch failed: fatal: ref HEAD is not a symbolic ref

[INFO] Executing: /bin/sh -c cd '<https://builds.apache.org/job/openmeetings/ws/'> &&
'git' 'rev-parse' '--verify' 'HEAD'
[INFO] Working directory: <https://builds.apache.org/job/openmeetings/ws/>
[INFO] Storing buildScmBranch: UNKNOWN
[INFO] 
[INFO] --- apache-rat-plugin:0.12:check (default) @ openmeetings-parent ---
[INFO] Added 1 additional default licenses.
[INFO] Enabled default license matchers.
[INFO] Added 1 custom approved licenses.
[INFO] Will parse SCM ignores for exclusions...
[INFO] Parsing exclusions from <https://builds.apache.org/job/openmeetings/ws/.gitignore>
[INFO] Finished adding exclusions from SCM ignore files.
[INFO] 76 implicit excludes (use -debug for more details).
[INFO] Exclude: **/*.mp3
[INFO] 10 resources included (use -debug for more details)
[INFO] Rat check: Summary over all files. Unapproved: 2, unknown: 2, generated: 0, approved:
3 licenses.
[INFO] ------------------------------------------------------------------------
[INFO] Reactor Summary:
[INFO] 
[INFO] Openmeetings ....................................... FAILURE [  4.505 s]
[INFO] Openmeetings Util .................................. SKIPPED
[INFO] Openmeetings DB .................................... SKIPPED
[INFO] Openmeetings Core .................................. SKIPPED
[INFO] Openmeetings Install ............................... SKIPPED
[INFO] Openmeetings Service ............................... SKIPPED
[INFO] Openmeetings Webservices ........................... SKIPPED
[INFO] Openmeetings Web ................................... SKIPPED
[INFO] Openmeetings Flash ................................. SKIPPED
[INFO] Openmeetings Screen Sharing applet ................. SKIPPED
[INFO] Openmeetings Server ................................ SKIPPED
[INFO] ------------------------------------------------------------------------
[INFO] BUILD FAILURE
[INFO] ------------------------------------------------------------------------
[INFO] Total time: 16.394 s
[INFO] Finished at: 2017-08-02T09:14:10+00:00
[INFO] Final Memory: 25M/583M
[INFO] ------------------------------------------------------------------------
[ERROR] Failed to execute goal org.apache.rat:apache-rat-plugin:0.12:check (default) on project
openmeetings-parent: Too many files with unapproved license: 2 See RAT report in: <https://builds.apache.org/job/openmeetings/ws/target/rat.txt>
-> [Help 1]
[ERROR] 
[ERROR] To see the full stack trace of the errors, re-run Maven with the -e switch.
[ERROR] Re-run Maven using the -X switch to enable full debug logging.
[ERROR] 
[ERROR] For more information about the errors and possible solutions, please read the following
articles:
[ERROR] [Help 1] http://cwiki.apache.org/confluence/display/MAVEN/MojoFailureException
[JENKINS] Archiving <https://builds.apache.org/job/openmeetings/ws/openmeetings-server/pom.xml>
to org.apache.openmeetings/openmeetings-server/4.0.0-SNAPSHOT/openmeetings-server-4.0.0-SNAPSHOT.pom
[JENKINS] Archiving <https://builds.apache.org/job/openmeetings/ws/openmeetings-screenshare/pom.xml>
to org.apache.openmeetings/openmeetings-screenshare/4.0.0-SNAPSHOT/openmeetings-screenshare-4.0.0-SNAPSHOT.pom
[JENKINS] Archiving <https://builds.apache.org/job/openmeetings/ws/openmeetings-util/pom.xml>
to org.apache.openmeetings/openmeetings-util/4.0.0-SNAPSHOT/openmeetings-util-4.0.0-SNAPSHOT.pom
[JENKINS] Archiving <https://builds.apache.org/job/openmeetings/ws/openmeetings-install/pom.xml>
to org.apache.openmeetings/openmeetings-install/4.0.0-SNAPSHOT/openmeetings-install-4.0.0-SNAPSHOT.pom
[JENKINS] Archiving <https://builds.apache.org/job/openmeetings/ws/openmeetings-service/pom.xml>
to org.apache.openmeetings/openmeetings-service/4.0.0-SNAPSHOT/openmeetings-service-4.0.0-SNAPSHOT.pom
[JENKINS] Archiving <https://builds.apache.org/job/openmeetings/ws/pom.xml> to org.apache.openmeetings/openmeetings-parent/4.0.0-SNAPSHOT/openmeetings-parent-4.0.0-SNAPSHOT.pom
[JENKINS] Archiving <https://builds.apache.org/job/openmeetings/ws/openmeetings-db/pom.xml>
to org.apache.openmeetings/openmeetings-db/4.0.0-SNAPSHOT/openmeetings-db-4.0.0-SNAPSHOT.pom
[JENKINS] Archiving <https://builds.apache.org/job/openmeetings/ws/openmeetings-web/pom.xml>
to org.apache.openmeetings/openmeetings-web/4.0.0-SNAPSHOT/openmeetings-web-4.0.0-SNAPSHOT.pom
[JENKINS] Archiving <https://builds.apache.org/job/openmeetings/ws/openmeetings-webservice/pom.xml>
to org.apache.openmeetings/openmeetings-webservice/4.0.0-SNAPSHOT/openmeetings-webservice-4.0.0-SNAPSHOT.pom
[JENKINS] Archiving <https://builds.apache.org/job/openmeetings/ws/openmeetings-core/pom.xml>
to org.apache.openmeetings/openmeetings-core/4.0.0-SNAPSHOT/openmeetings-core-4.0.0-SNAPSHOT.pom
[JENKINS] Archiving <https://builds.apache.org/job/openmeetings/ws/openmeetings-flash/pom.xml>
to org.apache.openmeetings/openmeetings-flash/4.0.0-SNAPSHOT/openmeetings-flash-4.0.0-SNAPSHOT.pom
Sending e-mails to: dev@openmeetings.apache.org
channel stopped
Archiving artifacts
Not sending mail to unregistered user solomax666@gmail.com

Mime
View raw message