openmeetings-dev mailing list archives

Site index · List index
Message view « Date » · « Thread »
Top « Date » · « Thread »
From Apache Jenkins Server <jenk...@builds.apache.org>
Subject Build failed in Jenkins: Openmeetings 3.3.x #121
Date Tue, 08 Aug 2017 06:15:25 GMT
See <https://builds.apache.org/job/Openmeetings%203.3.x/121/display/redirect?page=changes>

Changes:

[solomax666] [OPENMEETINGS-1677] screen-sharing is fixed

------------------------------------------
[...truncated 172.08 KB...]
[INFO] 
[INFO] --- maven-compiler-plugin:3.6.1:compile (default-compile) @ openmeetings-webservice
---
[INFO] Changes detected - recompiling the module!
[INFO] Compiling 19 source files to <https://builds.apache.org/job/Openmeetings%203.3.x/ws/openmeetings-webservice/target/classes>
[INFO] 
[INFO] --- maven-resources-plugin:3.0.2:testResources (default-testResources) @ openmeetings-webservice
---
[INFO] Using 'UTF-8' encoding to copy filtered resources.
[INFO] skip non existing resourceDirectory <https://builds.apache.org/job/Openmeetings%203.3.x/ws/openmeetings-webservice/src/test/resources>
[INFO] Copying 3 resources
[INFO] 
[INFO] --- maven-compiler-plugin:3.6.1:testCompile (default-testCompile) @ openmeetings-webservice
---
[INFO] No sources to compile
[INFO] 
[INFO] --- maven-surefire-plugin:2.20:test (default-test) @ openmeetings-webservice ---
[JENKINS] Recording test results
[INFO] 
[INFO] --- maven-jar-plugin:3.0.2:jar (default-jar) @ openmeetings-webservice ---
[INFO] Building jar: <https://builds.apache.org/job/Openmeetings%203.3.x/ws/openmeetings-webservice/target/openmeetings-webservice-3.3.1-SNAPSHOT.jar>
[INFO] 
[INFO] --- maven-site-plugin:3.3:attach-descriptor (attach-descriptor) @ openmeetings-webservice
---
[INFO] 
[INFO] --- maven-install-plugin:2.5.2:install (default-install) @ openmeetings-webservice
---
[INFO] Installing <https://builds.apache.org/job/Openmeetings%203.3.x/ws/openmeetings-webservice/target/openmeetings-webservice-3.3.1-SNAPSHOT.jar>
to /home/jenkins/jenkins-slave/maven-repositories/0/org/apache/openmeetings/openmeetings-webservice/3.3.1-SNAPSHOT/openmeetings-webservice-3.3.1-SNAPSHOT.jar
[INFO] Installing <https://builds.apache.org/job/Openmeetings%203.3.x/ws/openmeetings-webservice/pom.xml>
to /home/jenkins/jenkins-slave/maven-repositories/0/org/apache/openmeetings/openmeetings-webservice/3.3.1-SNAPSHOT/openmeetings-webservice-3.3.1-SNAPSHOT.pom
[INFO]                                                                         
[INFO] ------------------------------------------------------------------------
[INFO] Building Openmeetings Web 3.3.1-SNAPSHOT
[INFO] ------------------------------------------------------------------------
[INFO] Downloading: http://repository.apache.org/snapshots/org/apache/wicket/wicket-request/8.0.0-SNAPSHOT/maven-metadata.xml
[INFO] Downloading: https://repository.apache.org/content/repositories/snapshots/org/apache/wicket/wicket-request/8.0.0-SNAPSHOT/maven-metadata.xml
[INFO] Downloading: http://oss.sonatype.org/content/repositories/snapshots/org/apache/wicket/wicket-request/8.0.0-SNAPSHOT/maven-metadata.xml
[INFO] Downloading: https://repository.apache.org/content/groups/snapshots/org/apache/wicket/wicket-request/8.0.0-SNAPSHOT/maven-metadata.xml
[INFO] Downloaded: http://repository.apache.org/snapshots/org/apache/wicket/wicket-request/8.0.0-SNAPSHOT/maven-metadata.xml
(2 KB at 3.3 KB/sec)
[INFO] Downloading: http://oss.sonatype.org/content/repositories/snapshots/org/apache/wicket/wicket-request/8.0.0-SNAPSHOT/maven-metadata.xml
[INFO] Downloaded: https://repository.apache.org/content/repositories/snapshots/org/apache/wicket/wicket-request/8.0.0-SNAPSHOT/maven-metadata.xml
(2 KB at 2.0 KB/sec)
[INFO] Downloaded: https://repository.apache.org/content/groups/snapshots/org/apache/wicket/wicket-request/8.0.0-SNAPSHOT/maven-metadata.xml
(2 KB at 2.0 KB/sec)
[INFO] Downloading: http://repository.apache.org/snapshots/org/apache/wicket/wicket-util/8.0.0-SNAPSHOT/maven-metadata.xml
[INFO] Downloading: https://repository.apache.org/content/groups/snapshots/org/apache/wicket/wicket-util/8.0.0-SNAPSHOT/maven-metadata.xml
[INFO] Downloading: http://oss.sonatype.org/content/repositories/snapshots/org/apache/wicket/wicket-util/8.0.0-SNAPSHOT/maven-metadata.xml
[INFO] Downloading: https://repository.apache.org/content/repositories/snapshots/org/apache/wicket/wicket-util/8.0.0-SNAPSHOT/maven-metadata.xml
[INFO] Downloading: http://oss.sonatype.org/content/repositories/snapshots/org/apache/wicket/wicket-util/8.0.0-SNAPSHOT/maven-metadata.xml
[INFO] Downloaded: http://repository.apache.org/snapshots/org/apache/wicket/wicket-util/8.0.0-SNAPSHOT/maven-metadata.xml
(2 KB at 3.9 KB/sec)
[INFO] Downloaded: https://repository.apache.org/content/repositories/snapshots/org/apache/wicket/wicket-util/8.0.0-SNAPSHOT/maven-metadata.xml
(2 KB at 2.7 KB/sec)
[INFO] Downloaded: https://repository.apache.org/content/groups/snapshots/org/apache/wicket/wicket-util/8.0.0-SNAPSHOT/maven-metadata.xml
(2 KB at 2.7 KB/sec)
[INFO] Downloading: http://repository.apache.org/snapshots/org/seleniumhq/selenium/selenium-api/maven-metadata.xml
[INFO] Downloading: https://repository.apache.org/content/groups/snapshots/org/seleniumhq/selenium/selenium-api/maven-metadata.xml
[INFO] Downloading: http://oss.sonatype.org/content/repositories/snapshots/org/seleniumhq/selenium/selenium-api/maven-metadata.xml
[INFO] Downloading: https://dl.bintray.com/openmeetings/maven/org/seleniumhq/selenium/selenium-api/maven-metadata.xml
[INFO] Downloading: https://repo.maven.apache.org/maven2/org/seleniumhq/selenium/selenium-api/maven-metadata.xml
[INFO] Downloaded: https://repo.maven.apache.org/maven2/org/seleniumhq/selenium/selenium-api/maven-metadata.xml
(3 KB at 34.9 KB/sec)
[INFO] Downloaded: http://oss.sonatype.org/content/repositories/snapshots/org/seleniumhq/selenium/selenium-api/maven-metadata.xml
(372 B at 0.9 KB/sec)
[INFO] Downloading: https://repository.apache.org/content/groups/snapshots/org/seleniumhq/selenium/selenium-support/maven-metadata.xml
[INFO] Downloading: http://oss.sonatype.org/content/repositories/snapshots/org/seleniumhq/selenium/selenium-support/maven-metadata.xml
[INFO] Downloading: https://dl.bintray.com/openmeetings/maven/org/seleniumhq/selenium/selenium-support/maven-metadata.xml
[INFO] Downloading: http://repository.apache.org/snapshots/org/seleniumhq/selenium/selenium-support/maven-metadata.xml
[INFO] Downloading: https://repo.maven.apache.org/maven2/org/seleniumhq/selenium/selenium-support/maven-metadata.xml
[INFO] Downloaded: https://repo.maven.apache.org/maven2/org/seleniumhq/selenium/selenium-support/maven-metadata.xml
(4 KB at 181.4 KB/sec)
[INFO] Downloaded: http://oss.sonatype.org/content/repositories/snapshots/org/seleniumhq/selenium/selenium-support/maven-metadata.xml
(376 B at 1.1 KB/sec)
[INFO] Downloading: http://oss.sonatype.org/content/repositories/snapshots/org/wicketstuff/wicketstuff-dashboard-core/8.0.0-SNAPSHOT/wicketstuff-dashboard-core-8.0.0-20170807.170711-127.jar
[INFO] Downloading: http://oss.sonatype.org/content/repositories/snapshots/org/wicketstuff/wicketstuff-datastore-hazelcast/8.0.0-SNAPSHOT/wicketstuff-datastore-hazelcast-8.0.0-20170807.163511-181.jar
[INFO] Downloading: http://oss.sonatype.org/content/repositories/snapshots/org/wicketstuff/wicketstuff-datastore-common/8.0.0-SNAPSHOT/wicketstuff-datastore-common-8.0.0-20170807.163448-183.jar
[INFO] Downloading: http://oss.sonatype.org/content/repositories/snapshots/org/wicketstuff/wicketstuff-urlfragment/8.0.0-SNAPSHOT/wicketstuff-urlfragment-8.0.0-20170807.170221-141.jar
[INFO] Downloading: http://oss.sonatype.org/content/repositories/snapshots/org/wicketstuff/wicketstuff-select2/8.0.0-SNAPSHOT/wicketstuff-select2-8.0.0-20170807.170453-129.jar
[INFO] Downloaded: http://oss.sonatype.org/content/repositories/snapshots/org/wicketstuff/wicketstuff-datastore-common/8.0.0-SNAPSHOT/wicketstuff-datastore-common-8.0.0-20170807.163448-183.jar
(8 KB at 14.5 KB/sec)
[INFO] Downloading: http://oss.sonatype.org/content/repositories/snapshots/org/wicketstuff/jqplot/8.0.0-SNAPSHOT/jqplot-8.0.0-20170807.163215-278.jar
[INFO] Downloaded: http://oss.sonatype.org/content/repositories/snapshots/org/wicketstuff/wicketstuff-datastore-hazelcast/8.0.0-SNAPSHOT/wicketstuff-datastore-hazelcast-8.0.0-20170807.163511-181.jar
(5 KB at 8.6 KB/sec)
[INFO] Downloaded: http://oss.sonatype.org/content/repositories/snapshots/org/wicketstuff/wicketstuff-dashboard-core/8.0.0-SNAPSHOT/wicketstuff-dashboard-core-8.0.0-20170807.170711-127.jar
(130 KB at 255.0 KB/sec)
[INFO] Downloaded: http://oss.sonatype.org/content/repositories/snapshots/org/wicketstuff/wicketstuff-urlfragment/8.0.0-SNAPSHOT/wicketstuff-urlfragment-8.0.0-20170807.170221-141.jar
(18 KB at 31.3 KB/sec)
[INFO] Downloaded: http://oss.sonatype.org/content/repositories/snapshots/org/wicketstuff/wicketstuff-select2/8.0.0-SNAPSHOT/wicketstuff-select2-8.0.0-20170807.170453-129.jar
(180 KB at 248.9 KB/sec)
[INFO] Downloaded: http://oss.sonatype.org/content/repositories/snapshots/org/wicketstuff/jqplot/8.0.0-SNAPSHOT/jqplot-8.0.0-20170807.163215-278.jar
(393 KB at 429.0 KB/sec)
[INFO] 
[INFO] --- maven-clean-plugin:3.0.0:clean (default-clean) @ openmeetings-web ---
[INFO] Deleting <https://builds.apache.org/job/Openmeetings%203.3.x/ws/openmeetings-web/target>
[INFO] 
[INFO] --- buildnumber-maven-plugin:1.4:create (default) @ openmeetings-web ---
[INFO] 
[INFO] --- apache-rat-plugin:0.12:check (default) @ openmeetings-web ---
[INFO] Added 1 additional default licenses.
[INFO] Enabled default license matchers.
[INFO] Added 1 custom approved licenses.
[INFO] Will parse SCM ignores for exclusions...
[INFO] Finished adding exclusions from SCM ignore files.
[INFO] 61 implicit excludes (use -debug for more details).
[INFO] Exclude: **/*.mp3
[INFO] 648 resources included (use -debug for more details)
[INFO] Rat check: Summary over all files. Unapproved: 0, unknown: 0, generated: 0, approved:
451 licenses.
[INFO] 
[INFO] --- maven-remote-resources-plugin:1.5:process (process-resource-bundles) @ openmeetings-web
---
[INFO] Downloading: http://oss.sonatype.org/content/repositories/snapshots/org/wicketstuff/datastores-parent/8.0.0-SNAPSHOT/datastores-parent-8.0.0-20170807.163433-185.pom
[INFO] Downloaded: http://oss.sonatype.org/content/repositories/snapshots/org/wicketstuff/datastores-parent/8.0.0-SNAPSHOT/datastores-parent-8.0.0-20170807.163433-185.pom
(0 B at 0.0 KB/sec)
[INFO] Downloading: http://oss.sonatype.org/content/repositories/snapshots/org/wicketstuff/wicketstuff-core/8.0.0-SNAPSHOT/wicketstuff-core-8.0.0-20170807.162956-300.pom
[INFO] Downloaded: http://oss.sonatype.org/content/repositories/snapshots/org/wicketstuff/wicketstuff-core/8.0.0-SNAPSHOT/wicketstuff-core-8.0.0-20170807.162956-300.pom
(0 B at 0.0 KB/sec)
[INFO] Downloading: http://oss.sonatype.org/content/repositories/snapshots/org/wicketstuff/wicketstuff-select2-parent/8.0.0-SNAPSHOT/wicketstuff-select2-parent-8.0.0-20170807.170441-129.pom
[INFO] Downloaded: http://oss.sonatype.org/content/repositories/snapshots/org/wicketstuff/wicketstuff-select2-parent/8.0.0-SNAPSHOT/wicketstuff-select2-parent-8.0.0-20170807.170441-129.pom
(0 B at 0.0 KB/sec)
[INFO] Downloading: http://oss.sonatype.org/content/repositories/snapshots/org/wicketstuff/wicketstuff-urlfragment-parent/8.0.0-SNAPSHOT/wicketstuff-urlfragment-parent-8.0.0-20170807.170207-142.pom
[INFO] Downloaded: http://oss.sonatype.org/content/repositories/snapshots/org/wicketstuff/wicketstuff-urlfragment-parent/8.0.0-SNAPSHOT/wicketstuff-urlfragment-parent-8.0.0-20170807.170207-142.pom
(0 B at 0.0 KB/sec)
[INFO] Downloading: http://oss.sonatype.org/content/repositories/snapshots/org/wicketstuff/jqplot-parent/8.0.0-SNAPSHOT/jqplot-parent-8.0.0-20170807.163155-282.pom
[INFO] Downloaded: http://oss.sonatype.org/content/repositories/snapshots/org/wicketstuff/jqplot-parent/8.0.0-SNAPSHOT/jqplot-parent-8.0.0-20170807.163155-282.pom
(0 B at 0.0 KB/sec)
[INFO] Downloading: http://oss.sonatype.org/content/repositories/snapshots/org/wicketstuff/wicketstuff-dashboard-parent/8.0.0-SNAPSHOT/wicketstuff-dashboard-parent-8.0.0-20170807.170703-126.pom
[INFO] Downloaded: http://oss.sonatype.org/content/repositories/snapshots/org/wicketstuff/wicketstuff-dashboard-parent/8.0.0-SNAPSHOT/wicketstuff-dashboard-parent-8.0.0-20170807.170703-126.pom
(0 B at 0.0 KB/sec)
[INFO] 
[INFO] --- maven-site-plugin:3.3:site (generate-site) @ openmeetings-web ---
[INFO] configuring report plugin org.apache.maven.plugins:maven-project-info-reports-plugin:2.9
[INFO] configuring report plugin org.apache.maven.plugins:maven-surefire-report-plugin:2.20
[INFO] configuring report plugin org.apache.rat:apache-rat-plugin:0.12
[INFO] Parent project loaded from repository: org.apache:apache:pom:18
[INFO] Relativizing decoration links with respect to project URL: http://openmeetings.apache.org/openmeetings-web
[INFO] Rendering site with lt.velykis.maven.skins:reflow-maven-skin:jar:1.1.1 skin.
[INFO] Generating "About" report    --- maven-project-info-reports-plugin:2.9
[INFO] Generating "CI Management" report    --- maven-project-info-reports-plugin:2.9
[INFO] Generating "Dependencies" report    --- maven-project-info-reports-plugin:2.9
[INFO] Generating "Dependency Convergence" report    --- maven-project-info-reports-plugin:2.9
[INFO] Generating "Dependency Management" report    --- maven-project-info-reports-plugin:2.9
[INFO] Generating "Distribution Management" report    --- maven-project-info-reports-plugin:2.9
[INFO] Generating "Issue Management" report    --- maven-project-info-reports-plugin:2.9
[INFO] Generating "Licenses" report    --- maven-project-info-reports-plugin:2.9
[INFO] Generating "Mailing Lists" report    --- maven-project-info-reports-plugin:2.9
[INFO] Generating "Plugin Management" report    --- maven-project-info-reports-plugin:2.9
[INFO] Generating "Plugins" report    --- maven-project-info-reports-plugin:2.9
[INFO] Generating "Team" report    --- maven-project-info-reports-plugin:2.9
[INFO] Generating "Source Code Management" report    --- maven-project-info-reports-plugin:2.9
[INFO] Generating "Summary" report    --- maven-project-info-reports-plugin:2.9
[INFO] Generating "Surefire Report" report    --- maven-surefire-report-plugin:2.20
[WARNING] Unable to locate Test Source XRef to link to - DISABLED
[INFO] Generating "Rat Report" report    --- apache-rat-plugin:0.12
[INFO] Enabled default license matchers.
[INFO] Will parse SCM ignores for exclusions...
[INFO] Finished adding exclusions from SCM ignore files.
[INFO] 61 implicit excludes (use -debug for more details).
[INFO] No excludes explicitly specified.
[INFO] 649 resources included (use -debug for more details)
Compiler warnings:
  WARNING:  'org.apache.xerces.jaxp.SAXParserImpl: Property 'http://javax.xml.XMLConstants/property/accessExternalDTD'
is not recognized.'
[JENKINS] Archiving site from <https://builds.apache.org/job/Openmeetings%203.3.x/ws/openmeetings-web/target/site>
to /x1/jenkins/jenkins-home/jobs/Openmeetings 3.3.x/site/openmeetings-web
[INFO] 
[INFO] --- maven-antrun-plugin:1.8:run (select-db) @ openmeetings-web ---
[INFO] Executing tasks

main:
     [copy] Copying 1 file to <https://builds.apache.org/job/Openmeetings%203.3.x/ws/openmeetings-web/target/generated-res>
[INFO] Executed tasks
[INFO] 
[INFO] --- maven-resources-plugin:3.0.2:resources (default-resources) @ openmeetings-web ---
[INFO] Using 'UTF-8' encoding to copy filtered resources.
[INFO] skip non existing resourceDirectory <https://builds.apache.org/job/Openmeetings%203.3.x/ws/openmeetings-web/src/main/resources>
[INFO] Copying 3 resources
[INFO] 
[INFO] --- minify-maven-plugin:1.7.6:minify (theme-minify) @ openmeetings-web ---
[INFO] Starting CSS task:
[INFO] Processing source file [general.css].
[INFO] Processing source file [activities.css].
[INFO] Processing source file [admin.css].
[INFO] Processing source file [calendar.css].
[INFO] Processing source file [chat.css].
[INFO] Processing source file [menu.css].
[INFO] Processing source file [room.css].
[INFO] Processing source file [tree.css].
[INFO] Processing source file [wb.css].
[INFO] Creating the merged file [theme.css].
[INFO] Creating the minified file [theme.min.css].
[INFO] Uncompressed size: 43061 bytes.
[INFO] Compressed size: 30737 bytes minified (6403 bytes gzipped).
[INFO] 
[INFO] Starting JavaScript task:
[INFO] 
[INFO] --- minify-maven-plugin:1.7.6:minify (theme-rtl-minify) @ openmeetings-web ---
[INFO] Starting CSS task:
[INFO] Processing source file [general-rtl.css].
[INFO] Creating the merged file [theme-rtl.css].
[INFO] Creating the minified file [theme-rtl.min.css].
[INFO] Uncompressed size: 2481 bytes.
[INFO] Compressed size: 1405 bytes minified (461 bytes gzipped).
[INFO] 
[INFO] Starting JavaScript task:
[INFO] 
[INFO] --- maven-compiler-plugin:3.6.1:compile (default-compile) @ openmeetings-web ---
[INFO] Changes detected - recompiling the module!
[INFO] Compiling 208 source files to <https://builds.apache.org/job/Openmeetings%203.3.x/ws/openmeetings-web/target/classes>
[INFO] -------------------------------------------------------------
[ERROR] COMPILATION ERROR : 
[INFO] -------------------------------------------------------------
[ERROR] <https://builds.apache.org/job/Openmeetings%203.3.x/ws/openmeetings-web/src/main/java/org/apache/openmeetings/web/room/menu/StartSharingButton.java>:[106,44]
cannot find symbol
  symbol:   variable c
  location: class org.apache.openmeetings.web.room.menu.StartSharingButton
[INFO] 1 error
[INFO] -------------------------------------------------------------
[INFO] ------------------------------------------------------------------------
[INFO] Reactor Summary:
[INFO] 
[INFO] Openmeetings ....................................... SUCCESS [01:45 min]
[INFO] Openmeetings Util .................................. SUCCESS [04:08 min]
[INFO] Openmeetings DB .................................... SUCCESS [ 21.292 s]
[INFO] Openmeetings Core .................................. SUCCESS [ 20.980 s]
[INFO] Openmeetings Install ............................... SUCCESS [ 17.100 s]
[INFO] Openmeetings Service ............................... SUCCESS [ 17.904 s]
[INFO] Openmeetings Webservices ........................... SUCCESS [ 51.281 s]
[INFO] Openmeetings Web ................................... FAILURE [ 38.887 s]
[INFO] Openmeetings Flash ................................. SKIPPED
[INFO] Openmeetings Screen Sharing applet ................. SKIPPED
[INFO] Openmeetings Server ................................ SKIPPED
[INFO] ------------------------------------------------------------------------
[INFO] BUILD FAILURE
[INFO] ------------------------------------------------------------------------
[INFO] Total time: 09:08 min
[INFO] Finished at: 2017-08-08T06:13:00+00:00
[INFO] Final Memory: 99M/964M
[INFO] ------------------------------------------------------------------------
Waiting for Jenkins to finish collecting data
[ERROR] Failed to execute goal org.apache.maven.plugins:maven-compiler-plugin:3.6.1:compile
(default-compile) on project openmeetings-web: Compilation failure
[ERROR] <https://builds.apache.org/job/Openmeetings%203.3.x/ws/openmeetings-web/src/main/java/org/apache/openmeetings/web/room/menu/StartSharingButton.java>:[106,44]
cannot find symbol
[ERROR] symbol:   variable c
[ERROR] location: class org.apache.openmeetings.web.room.menu.StartSharingButton
[ERROR] -> [Help 1]
[ERROR] 
[ERROR] To see the full stack trace of the errors, re-run Maven with the -e switch.
[ERROR] Re-run Maven using the -X switch to enable full debug logging.
[ERROR] 
[ERROR] For more information about the errors and possible solutions, please read the following
articles:
[ERROR] [Help 1] http://cwiki.apache.org/confluence/display/MAVEN/MojoFailureException
[ERROR] 
[ERROR] After correcting the problems, you can resume the build with the command
[ERROR]   mvn <goals> -rf :openmeetings-web
[JENKINS] Archiving <https://builds.apache.org/job/Openmeetings%203.3.x/ws/openmeetings-server/pom.xml>
to org.apache.openmeetings/openmeetings-server/3.3.1-SNAPSHOT/openmeetings-server-3.3.1-SNAPSHOT.pom
[JENKINS] Archiving <https://builds.apache.org/job/Openmeetings%203.3.x/ws/openmeetings-screenshare/pom.xml>
to org.apache.openmeetings/openmeetings-screenshare/3.3.1-SNAPSHOT/openmeetings-screenshare-3.3.1-SNAPSHOT.pom
[JENKINS] Archiving <https://builds.apache.org/job/Openmeetings%203.3.x/ws/openmeetings-util/pom.xml>
to org.apache.openmeetings/openmeetings-util/3.3.1-SNAPSHOT/openmeetings-util-3.3.1-SNAPSHOT.pom
[JENKINS] Archiving <https://builds.apache.org/job/Openmeetings%203.3.x/ws/openmeetings-util/target/openmeetings-util-3.3.1-SNAPSHOT.jar>
to org.apache.openmeetings/openmeetings-util/3.3.1-SNAPSHOT/openmeetings-util-3.3.1-SNAPSHOT.jar
[JENKINS] Archiving <https://builds.apache.org/job/Openmeetings%203.3.x/ws/openmeetings-util/target/openmeetings-util-3.3.1-SNAPSHOT-tests.jar>
to org.apache.openmeetings/openmeetings-util/3.3.1-SNAPSHOT/openmeetings-util-3.3.1-SNAPSHOT-tests.jar
[JENKINS] Archiving <https://builds.apache.org/job/Openmeetings%203.3.x/ws/openmeetings-install/pom.xml>
to org.apache.openmeetings/openmeetings-install/3.3.1-SNAPSHOT/openmeetings-install-3.3.1-SNAPSHOT.pom
[JENKINS] Archiving <https://builds.apache.org/job/Openmeetings%203.3.x/ws/openmeetings-install/target/openmeetings-install-3.3.1-SNAPSHOT.jar>
to org.apache.openmeetings/openmeetings-install/3.3.1-SNAPSHOT/openmeetings-install-3.3.1-SNAPSHOT.jar
[JENKINS] Archiving <https://builds.apache.org/job/Openmeetings%203.3.x/ws/openmeetings-service/pom.xml>
to org.apache.openmeetings/openmeetings-service/3.3.1-SNAPSHOT/openmeetings-service-3.3.1-SNAPSHOT.pom
[JENKINS] Archiving <https://builds.apache.org/job/Openmeetings%203.3.x/ws/openmeetings-service/target/openmeetings-service-3.3.1-SNAPSHOT.jar>
to org.apache.openmeetings/openmeetings-service/3.3.1-SNAPSHOT/openmeetings-service-3.3.1-SNAPSHOT.jar
[JENKINS] Archiving <https://builds.apache.org/job/Openmeetings%203.3.x/ws/pom.xml>
to org.apache.openmeetings/openmeetings-parent/3.3.1-SNAPSHOT/openmeetings-parent-3.3.1-SNAPSHOT.pom
[JENKINS] Archiving <https://builds.apache.org/job/Openmeetings%203.3.x/ws/target/openmeetings-parent-3.3.1-SNAPSHOT-site.xml>
to org.apache.openmeetings/openmeetings-parent/3.3.1-SNAPSHOT/openmeetings-parent-3.3.1-SNAPSHOT-site.xml
[Fast Archiver] Compressed 33.92 KB of artifacts by 94.4% relative to #120
[JENKINS] Archiving <https://builds.apache.org/job/Openmeetings%203.3.x/ws/openmeetings-db/pom.xml>
to org.apache.openmeetings/openmeetings-db/3.3.1-SNAPSHOT/openmeetings-db-3.3.1-SNAPSHOT.pom
[JENKINS] Archiving <https://builds.apache.org/job/Openmeetings%203.3.x/ws/openmeetings-db/target/openmeetings-db-3.3.1-SNAPSHOT.jar>
to org.apache.openmeetings/openmeetings-db/3.3.1-SNAPSHOT/openmeetings-db-3.3.1-SNAPSHOT.jar
[JENKINS] Archiving <https://builds.apache.org/job/Openmeetings%203.3.x/ws/openmeetings-web/pom.xml>
to org.apache.openmeetings/openmeetings-web/3.3.1-SNAPSHOT/openmeetings-web-3.3.1-SNAPSHOT.pom
[JENKINS] Archiving <https://builds.apache.org/job/Openmeetings%203.3.x/ws/openmeetings-webservice/pom.xml>
to org.apache.openmeetings/openmeetings-webservice/3.3.1-SNAPSHOT/openmeetings-webservice-3.3.1-SNAPSHOT.pom
[JENKINS] Archiving <https://builds.apache.org/job/Openmeetings%203.3.x/ws/openmeetings-webservice/target/openmeetings-webservice-3.3.1-SNAPSHOT.jar>
to org.apache.openmeetings/openmeetings-webservice/3.3.1-SNAPSHOT/openmeetings-webservice-3.3.1-SNAPSHOT.jar
[JENKINS] Archiving <https://builds.apache.org/job/Openmeetings%203.3.x/ws/openmeetings-core/pom.xml>
to org.apache.openmeetings/openmeetings-core/3.3.1-SNAPSHOT/openmeetings-core-3.3.1-SNAPSHOT.pom
[JENKINS] Archiving <https://builds.apache.org/job/Openmeetings%203.3.x/ws/openmeetings-core/target/openmeetings-core-3.3.1-SNAPSHOT.jar>
to org.apache.openmeetings/openmeetings-core/3.3.1-SNAPSHOT/openmeetings-core-3.3.1-SNAPSHOT.jar
[JENKINS] Archiving <https://builds.apache.org/job/Openmeetings%203.3.x/ws/openmeetings-core/target/openmeetings-core-3.3.1-SNAPSHOT-tests.jar>
to org.apache.openmeetings/openmeetings-core/3.3.1-SNAPSHOT/openmeetings-core-3.3.1-SNAPSHOT-tests.jar
[JENKINS] Archiving <https://builds.apache.org/job/Openmeetings%203.3.x/ws/openmeetings-flash/pom.xml>
to org.apache.openmeetings/openmeetings-flash/3.3.1-SNAPSHOT/openmeetings-flash-3.3.1-SNAPSHOT.pom
Not sending mail to unregistered user solomax666@gmail.com
Sending e-mails to: dev@openmeetings.apache.org
channel stopped
Archiving artifacts
[Fast Archiver] Compressed 223.78 MB of artifacts by 100.0% relative to #120
Not sending mail to unregistered user solomax666@gmail.com

Mime
View raw message