openmeetings-dev mailing list archives

Site index · List index
Message view « Date » · « Thread »
Top « Date » · « Thread »
From Susheel Jalali <Susheel.Jal...@Coscend.com>
Subject 3.1.2 Build Error, OM-DB Dependencies Missing
Date Tue, 31 May 2016 19:27:34 GMT
Dear OpenMeetings Developers,

We are seeking your assistance with compilation failure error we are 
getting with the nightly build of 3.1.2.  We are using original source 
code with no customizations introduced in it.  Running “mvn clean 
install” command where pom.xml is gives the following DB download error.

Error
------

|[ERROR] Failed to execute goal on project openmeetings-db: Could not 
resolve dependencies for project 
org.apache.openmeetings:openmeetings-db:jar:3.1.2-SNAPSHOT: Failure to 
find org.apache.openmeetings:openmeetings-util:jar:3.1.2-SNAPSHOT in 
https://repository.apache.org/content/groups/snapshots was cached in the 
local repository, resolution will not be reattempted until the update 
interval of apache-snapshots has elapsed or updates are forced -> [Help 1]|

||

Possible cause
--------------------
Based on our investigation of error log (see below) and Web search, this 
db error seems to originate from ~/openmeetings-db/pom.xml

        <parent>
<groupId>org.apache.openmeetings</groupId>
<artifactId>openmeetings-parent</artifactId>
               <version>3.1.2-SNAPSHOT</version>
               <relativePath>..</relativePath>
        </parent>

Environment:  All OpenMeetings dependencies (from 3.0.7), Apache Maven 
3.3.9, Java 1.7.0_76, MariaDB 10.0.16

=======
Error log
--------------

|[INFO] 
 >>>>>>>>>>>>>>>>>>>>>>>>>>>>>>>>>>>>>>>>>>>>>>>>>>>>>>>>>>>>>>>>>>>>>>>>||
||[INFO] Forking Openmeetings DB 3.1.2-SNAPSHOT||
||[INFO] 
 >>>>>>>>>>>>>>>>>>>>>>>>>>>>>>>>>>>>>>>>>>>>>>>>>>>>>>>>>>>>>>>>>>>>>>>>||
||[INFO] 
------------------------------------------------------------------------||
||[INFO] Reactor Summary:||
||[INFO]||
||[INFO] Openmeetings ....................................... FAILURE [ 
14.467 s]||
||[INFO] Openmeetings Util .................................. SKIPPED||
||[INFO] Openmeetings DB .................................... SKIPPED||
||[INFO] Openmeetings Core .................................. SKIPPED||
||[INFO] Openmeetings Install ............................... SKIPPED||
||[INFO] Openmeetings Service ............................... SKIPPED||
||[INFO] Openmeetings Webservices ........................... SKIPPED||
||[INFO] Openmeetings Web ................................... SKIPPED||
||[INFO] Openmeetings Flash ................................. SKIPPED||
||[INFO] Openmeetings Screen Sharing applet ................. SKIPPED||
||[INFO] Openmeetings Server ................................ SKIPPED||
||[INFO] 
------------------------------------------------------------------------||
||[INFO] BUILD FAILURE||
||[INFO] 
------------------------------------------------------------------------||
||[INFO] Total time: 16.406 s||
||[INFO] Finished at: 2016-05-31T13:17:35-05:00||
||[INFO] Final Memory: 74M/1088M||
||[INFO] 
------------------------------------------------------------------------||
||[ERROR] Failed to execute goal on project openmeetings-db: Could not 
resolve dependencies for project 
org.apache.openmeetings:openmeetings-db:jar:3.1.2-SNAPSHOT: Failure to 
find org.apache.openmeetings:openmeetings-util:jar:3.1.2-SNAPSHOT in 
https://repository.apache.org/content/groups/snapshots was cached in the 
local repository, resolution will not be reattempted until the update 
interval of apache-snapshots has elapsed or updates are forced -> [Help 1]||
|||

Thank you.

Sincerely,

Susheel Jalali

Coscend Communications Solutions
www.Coscend.com
----------------------------------------------------------------
CONFIDENTIALITY NOTICE: See 'Confidentiality Notice Regarding E-mail 
Messages from Coscend Communications Solutions' posted at: 
http://www.Coscend.com/Terms_and_Conditions.html


Mime
  • Unnamed multipart/alternative (inline, None, 0 bytes)
View raw message