openmeetings-dev mailing list archives

Site index · List index
Message view « Date » · « Thread »
Top « Date » · « Thread »
From Apache Jenkins Server <jenk...@builds.apache.org>
Subject Build failed in Jenkins: OpenMeetingsMaven #1
Date Sun, 04 May 2014 22:20:05 GMT
See <https://builds.apache.org/job/OpenMeetingsMaven/1/>

------------------------------------------
[...truncated 4895 lines...]
Downloading: http://red5.googlecode.com/svn/repository/org/seleniumhq/selenium/selenium-htmlunit-driver/2.41.0/selenium-htmlunit-driver-2.41.0.pom
Downloading: http://repository.sonatype.org/content/groups/flexgroup/org/seleniumhq/selenium/selenium-htmlunit-driver/2.41.0/selenium-htmlunit-driver-2.41.0.pom
Downloading: http://repo.maven.apache.org/maven2/org/seleniumhq/selenium/selenium-htmlunit-driver/2.41.0/selenium-htmlunit-driver-2.41.0.pom
Downloaded: http://repo.maven.apache.org/maven2/org/seleniumhq/selenium/selenium-htmlunit-driver/2.41.0/selenium-htmlunit-driver-2.41.0.pom
(3 KB at 82.5 KB/sec)
Downloading: http://red5.googlecode.com/svn/repository/org/seleniumhq/selenium/selenium-firefox-driver/2.41.0/selenium-firefox-driver-2.41.0.pom
Downloading: http://repository.sonatype.org/content/groups/flexgroup/org/seleniumhq/selenium/selenium-firefox-driver/2.41.0/selenium-firefox-driver-2.41.0.pom
Downloading: http://repo.maven.apache.org/maven2/org/seleniumhq/selenium/selenium-firefox-driver/2.41.0/selenium-firefox-driver-2.41.0.pom
Downloaded: http://repo.maven.apache.org/maven2/org/seleniumhq/selenium/selenium-firefox-driver/2.41.0/selenium-firefox-driver-2.41.0.pom
(4 KB at 121.2 KB/sec)
Downloading: http://red5.googlecode.com/svn/repository/org/seleniumhq/selenium/selenium-ie-driver/2.41.0/selenium-ie-driver-2.41.0.pom
Downloading: http://repository.sonatype.org/content/groups/flexgroup/org/seleniumhq/selenium/selenium-ie-driver/2.41.0/selenium-ie-driver-2.41.0.pom
Downloading: http://repo.maven.apache.org/maven2/org/seleniumhq/selenium/selenium-ie-driver/2.41.0/selenium-ie-driver-2.41.0.pom
Downloaded: http://repo.maven.apache.org/maven2/org/seleniumhq/selenium/selenium-ie-driver/2.41.0/selenium-ie-driver-2.41.0.pom
(4 KB at 115.1 KB/sec)
Downloading: http://red5.googlecode.com/svn/repository/org/seleniumhq/selenium/selenium-safari-driver/2.41.0/selenium-safari-driver-2.41.0.pom
Downloading: http://repository.sonatype.org/content/groups/flexgroup/org/seleniumhq/selenium/selenium-safari-driver/2.41.0/selenium-safari-driver-2.41.0.pom
Downloading: http://repo.maven.apache.org/maven2/org/seleniumhq/selenium/selenium-safari-driver/2.41.0/selenium-safari-driver-2.41.0.pom
Downloaded: http://repo.maven.apache.org/maven2/org/seleniumhq/selenium/selenium-safari-driver/2.41.0/selenium-safari-driver-2.41.0.pom
(4 KB at 111.3 KB/sec)
Downloading: http://red5.googlecode.com/svn/repository/org/seleniumhq/selenium/selenium-support/2.41.0/selenium-support-2.41.0.pom
Downloading: http://repository.sonatype.org/content/groups/flexgroup/org/seleniumhq/selenium/selenium-support/2.41.0/selenium-support-2.41.0.pom
Downloading: http://repo.maven.apache.org/maven2/org/seleniumhq/selenium/selenium-support/2.41.0/selenium-support-2.41.0.pom
Downloaded: http://repo.maven.apache.org/maven2/org/seleniumhq/selenium/selenium-support/2.41.0/selenium-support-2.41.0.pom
(3 KB at 88.6 KB/sec)
Downloading: http://red5.googlecode.com/svn/repository/org/springframework/spring-orm/4.0.3.RELEASE/spring-orm-4.0.3.RELEASE.jar
Downloading: http://red5.googlecode.com/svn/repository/org/springframework/spring-jdbc/4.0.3.RELEASE/spring-jdbc-4.0.3.RELEASE.jar
Downloading: http://red5.googlecode.com/svn/repository/org/springframework/spring-webmvc/4.0.3.RELEASE/spring-webmvc-4.0.3.RELEASE.jar
Downloading: http://red5.googlecode.com/svn/repository/ro/fortsoft/wicket/dashboard/wicket-dashboard-core/0.10/wicket-dashboard-core-0.10.jar
Downloading: http://red5.googlecode.com/svn/repository/org/apache/wicket/wicket-extensions/6.15.0/wicket-extensions-6.15.0.jar
Downloading: http://red5.googlecode.com/svn/repository/org/apache/wicket/wicket-auth-roles/6.15.0/wicket-auth-roles-6.15.0.jar
Downloading: http://red5.googlecode.com/svn/repository/org/apache/wicket/wicket-native-websocket-core/6.15.0/wicket-native-websocket-core-6.15.0.jar
Downloading: http://red5.googlecode.com/svn/repository/org/apache/wicket/wicket-native-websocket-tomcat/6.15.0/wicket-native-websocket-tomcat-6.15.0.jar
Downloading: http://red5.googlecode.com/svn/repository/org/apache/wicket/wicket-devutils/6.15.0/wicket-devutils-6.15.0.jar
Downloading: http://red5.googlecode.com/svn/repository/org/apache/wicket/wicket-datetime/6.15.0/wicket-datetime-6.15.0.jar
Downloading: http://red5.googlecode.com/svn/repository/com/googlecode/wicket-jquery-ui/wicket-jquery-ui-core/6.15.0/wicket-jquery-ui-core-6.15.0.jar
Downloading: http://red5.googlecode.com/svn/repository/com/googlecode/wicket-jquery-ui/wicket-jquery-ui/6.15.0/wicket-jquery-ui-6.15.0.jar
Downloading: http://red5.googlecode.com/svn/repository/com/googlecode/wicket-jquery-ui/wicket-jquery-ui-calendar/6.15.0/wicket-jquery-ui-calendar-6.15.0.jar
Downloading: http://red5.googlecode.com/svn/repository/com/googlecode/wicket-jquery-ui/wicket-jquery-ui-plugins/6.15.0/wicket-jquery-ui-plugins-6.15.0.jar
Downloading: http://red5.googlecode.com/svn/repository/org/wicketstuff/wicketstuff-urlfragment/6.15.0/wicketstuff-urlfragment-6.15.0.jar
Downloading: http://red5.googlecode.com/svn/repository/org/slf4j/slf4j-log4j12/1.6.2/slf4j-log4j12-1.6.2.jar
Downloading: http://red5.googlecode.com/svn/repository/org/wicketstuff/wicketstuff-html5/6.15.0/wicketstuff-html5-6.15.0.jar
Downloading: http://red5.googlecode.com/svn/repository/com/github/svenmeier/wicket-dnd/wicket-dnd/0.6.0/wicket-dnd-0.6.0.jar
Downloading: http://red5.googlecode.com/svn/repository/org/seleniumhq/selenium/selenium-java/2.41.0/selenium-java-2.41.0.jar
Downloading: http://red5.googlecode.com/svn/repository/org/seleniumhq/selenium/selenium-chrome-driver/2.41.0/selenium-chrome-driver-2.41.0.jar
Downloading: http://red5.googlecode.com/svn/repository/org/seleniumhq/selenium/selenium-remote-driver/2.41.0/selenium-remote-driver-2.41.0.jar
Downloading: http://red5.googlecode.com/svn/repository/org/seleniumhq/selenium/selenium-htmlunit-driver/2.41.0/selenium-htmlunit-driver-2.41.0.jar
Downloading: http://red5.googlecode.com/svn/repository/org/seleniumhq/selenium/selenium-firefox-driver/2.41.0/selenium-firefox-driver-2.41.0.jar
Downloading: http://red5.googlecode.com/svn/repository/org/seleniumhq/selenium/selenium-ie-driver/2.41.0/selenium-ie-driver-2.41.0.jar
Downloading: http://red5.googlecode.com/svn/repository/org/seleniumhq/selenium/selenium-safari-driver/2.41.0/selenium-safari-driver-2.41.0.jar
Downloading: http://red5.googlecode.com/svn/repository/org/seleniumhq/selenium/selenium-support/2.41.0/selenium-support-2.41.0.jar
Downloading: http://red5.googlecode.com/svn/repository/org/seleniumhq/selenium/selenium-api/2.41.0/selenium-api-2.41.0.jar
Downloading: http://repository.sonatype.org/content/groups/flexgroup/org/springframework/spring-orm/4.0.3.RELEASE/spring-orm-4.0.3.RELEASE.jar
Downloading: http://repository.sonatype.org/content/groups/flexgroup/org/springframework/spring-jdbc/4.0.3.RELEASE/spring-jdbc-4.0.3.RELEASE.jar
Downloading: http://repository.sonatype.org/content/groups/flexgroup/org/springframework/spring-webmvc/4.0.3.RELEASE/spring-webmvc-4.0.3.RELEASE.jar
Downloading: http://repository.sonatype.org/content/groups/flexgroup/ro/fortsoft/wicket/dashboard/wicket-dashboard-core/0.10/wicket-dashboard-core-0.10.jar
Downloading: http://repository.sonatype.org/content/groups/flexgroup/org/apache/wicket/wicket-extensions/6.15.0/wicket-extensions-6.15.0.jar
Downloading: http://repository.sonatype.org/content/groups/flexgroup/org/apache/wicket/wicket-auth-roles/6.15.0/wicket-auth-roles-6.15.0.jar
Downloading: http://repository.sonatype.org/content/groups/flexgroup/org/apache/wicket/wicket-native-websocket-core/6.15.0/wicket-native-websocket-core-6.15.0.jar
Downloading: http://repository.sonatype.org/content/groups/flexgroup/org/apache/wicket/wicket-native-websocket-tomcat/6.15.0/wicket-native-websocket-tomcat-6.15.0.jar
Downloading: http://repository.sonatype.org/content/groups/flexgroup/org/apache/wicket/wicket-devutils/6.15.0/wicket-devutils-6.15.0.jar
Downloading: http://repository.sonatype.org/content/groups/flexgroup/org/apache/wicket/wicket-datetime/6.15.0/wicket-datetime-6.15.0.jar
Downloading: http://repository.sonatype.org/content/groups/flexgroup/com/googlecode/wicket-jquery-ui/wicket-jquery-ui-core/6.15.0/wicket-jquery-ui-core-6.15.0.jar
Downloading: http://repository.sonatype.org/content/groups/flexgroup/com/googlecode/wicket-jquery-ui/wicket-jquery-ui/6.15.0/wicket-jquery-ui-6.15.0.jar
Downloading: http://repository.sonatype.org/content/groups/flexgroup/com/googlecode/wicket-jquery-ui/wicket-jquery-ui-calendar/6.15.0/wicket-jquery-ui-calendar-6.15.0.jar
Downloading: http://repository.sonatype.org/content/groups/flexgroup/com/googlecode/wicket-jquery-ui/wicket-jquery-ui-plugins/6.15.0/wicket-jquery-ui-plugins-6.15.0.jar
Downloading: http://repository.sonatype.org/content/groups/flexgroup/org/wicketstuff/wicketstuff-urlfragment/6.15.0/wicketstuff-urlfragment-6.15.0.jar
Downloading: http://repository.sonatype.org/content/groups/flexgroup/org/slf4j/slf4j-log4j12/1.6.2/slf4j-log4j12-1.6.2.jar
Downloading: http://repository.sonatype.org/content/groups/flexgroup/org/wicketstuff/wicketstuff-html5/6.15.0/wicketstuff-html5-6.15.0.jar
Downloading: http://repository.sonatype.org/content/groups/flexgroup/com/github/svenmeier/wicket-dnd/wicket-dnd/0.6.0/wicket-dnd-0.6.0.jar
Downloading: http://repository.sonatype.org/content/groups/flexgroup/org/seleniumhq/selenium/selenium-java/2.41.0/selenium-java-2.41.0.jar
Downloading: http://repository.sonatype.org/content/groups/flexgroup/org/seleniumhq/selenium/selenium-chrome-driver/2.41.0/selenium-chrome-driver-2.41.0.jar
Downloading: http://repository.sonatype.org/content/groups/flexgroup/org/seleniumhq/selenium/selenium-remote-driver/2.41.0/selenium-remote-driver-2.41.0.jar
Downloading: http://repository.sonatype.org/content/groups/flexgroup/org/seleniumhq/selenium/selenium-htmlunit-driver/2.41.0/selenium-htmlunit-driver-2.41.0.jar
Downloading: http://repository.sonatype.org/content/groups/flexgroup/org/seleniumhq/selenium/selenium-firefox-driver/2.41.0/selenium-firefox-driver-2.41.0.jar
Downloading: http://repository.sonatype.org/content/groups/flexgroup/org/seleniumhq/selenium/selenium-ie-driver/2.41.0/selenium-ie-driver-2.41.0.jar
Downloading: http://repository.sonatype.org/content/groups/flexgroup/org/seleniumhq/selenium/selenium-safari-driver/2.41.0/selenium-safari-driver-2.41.0.jar
Downloading: http://repository.sonatype.org/content/groups/flexgroup/org/seleniumhq/selenium/selenium-support/2.41.0/selenium-support-2.41.0.jar
Downloading: http://repository.sonatype.org/content/groups/flexgroup/org/seleniumhq/selenium/selenium-api/2.41.0/selenium-api-2.41.0.jar
Downloading: http://repo.maven.apache.org/maven2/org/springframework/spring-orm/4.0.3.RELEASE/spring-orm-4.0.3.RELEASE.jar
Downloading: http://repo.maven.apache.org/maven2/org/springframework/spring-jdbc/4.0.3.RELEASE/spring-jdbc-4.0.3.RELEASE.jar
Downloading: http://repo.maven.apache.org/maven2/org/springframework/spring-webmvc/4.0.3.RELEASE/spring-webmvc-4.0.3.RELEASE.jar
Downloading: http://repo.maven.apache.org/maven2/ro/fortsoft/wicket/dashboard/wicket-dashboard-core/0.10/wicket-dashboard-core-0.10.jar
Downloading: http://repo.maven.apache.org/maven2/org/apache/wicket/wicket-extensions/6.15.0/wicket-extensions-6.15.0.jar
Downloaded: http://repo.maven.apache.org/maven2/org/springframework/spring-orm/4.0.3.RELEASE/spring-orm-4.0.3.RELEASE.jar
(359 KB at 8332.4 KB/sec)
Downloading: http://repo.maven.apache.org/maven2/org/apache/wicket/wicket-auth-roles/6.15.0/wicket-auth-roles-6.15.0.jar
Downloaded: http://repo.maven.apache.org/maven2/org/apache/wicket/wicket-auth-roles/6.15.0/wicket-auth-roles-6.15.0.jar
(49 KB at 1391.2 KB/sec)
Downloading: http://repo.maven.apache.org/maven2/org/apache/wicket/wicket-native-websocket-core/6.15.0/wicket-native-websocket-core-6.15.0.jar
Downloaded: http://repo.maven.apache.org/maven2/org/springframework/spring-jdbc/4.0.3.RELEASE/spring-jdbc-4.0.3.RELEASE.jar
(415 KB at 3397.7 KB/sec)
Downloading: http://repo.maven.apache.org/maven2/org/apache/wicket/wicket-native-websocket-tomcat/6.15.0/wicket-native-websocket-tomcat-6.15.0.jar
Downloaded: http://repo.maven.apache.org/maven2/org/springframework/spring-webmvc/4.0.3.RELEASE/spring-webmvc-4.0.3.RELEASE.jar
(647 KB at 3873.4 KB/sec)
Downloading: http://repo.maven.apache.org/maven2/org/apache/wicket/wicket-devutils/6.15.0/wicket-devutils-6.15.0.jar
Downloaded: http://repo.maven.apache.org/maven2/org/apache/wicket/wicket-extensions/6.15.0/wicket-extensions-6.15.0.jar
(1348 KB at 7242.4 KB/sec)
Downloading: http://repo.maven.apache.org/maven2/org/apache/wicket/wicket-datetime/6.15.0/wicket-datetime-6.15.0.jar
Downloaded: http://repo.maven.apache.org/maven2/org/apache/wicket/wicket-datetime/6.15.0/wicket-datetime-6.15.0.jar
(234 KB at 5427.2 KB/sec)
Downloading: http://repo.maven.apache.org/maven2/com/googlecode/wicket-jquery-ui/wicket-jquery-ui-core/6.15.0/wicket-jquery-ui-core-6.15.0.jar
Downloaded: http://repo.maven.apache.org/maven2/org/apache/wicket/wicket-native-websocket-core/6.15.0/wicket-native-websocket-core-6.15.0.jar
(68 KB at 308.1 KB/sec)
Downloading: http://repo.maven.apache.org/maven2/com/googlecode/wicket-jquery-ui/wicket-jquery-ui/6.15.0/wicket-jquery-ui-6.15.0.jar
Downloaded: http://repo.maven.apache.org/maven2/ro/fortsoft/wicket/dashboard/wicket-dashboard-core/0.10/wicket-dashboard-core-0.10.jar
(156 KB at 519.2 KB/sec)
Downloading: http://repo.maven.apache.org/maven2/com/googlecode/wicket-jquery-ui/wicket-jquery-ui-calendar/6.15.0/wicket-jquery-ui-calendar-6.15.0.jar
Downloaded: http://repo.maven.apache.org/maven2/org/apache/wicket/wicket-devutils/6.15.0/wicket-devutils-6.15.0.jar
(111 KB at 681.3 KB/sec)
Downloading: http://repo.maven.apache.org/maven2/com/googlecode/wicket-jquery-ui/wicket-jquery-ui-plugins/6.15.0/wicket-jquery-ui-plugins-6.15.0.jar
Downloaded: http://repo.maven.apache.org/maven2/com/googlecode/wicket-jquery-ui/wicket-jquery-ui/6.15.0/wicket-jquery-ui-6.15.0.jar
(234 KB at 2165.2 KB/sec)
Downloading: http://repo.maven.apache.org/maven2/org/wicketstuff/wicketstuff-urlfragment/6.15.0/wicketstuff-urlfragment-6.15.0.jar
Downloaded: http://repo.maven.apache.org/maven2/com/googlecode/wicket-jquery-ui/wicket-jquery-ui-core/6.15.0/wicket-jquery-ui-core-6.15.0.jar
(220 KB at 840.3 KB/sec)
Downloading: http://repo.maven.apache.org/maven2/org/slf4j/slf4j-log4j12/1.6.2/slf4j-log4j12-1.6.2.jar
Downloaded: http://repo.maven.apache.org/maven2/org/slf4j/slf4j-log4j12/1.6.2/slf4j-log4j12-1.6.2.jar
(10 KB at 366.3 KB/sec)
Downloading: http://repo.maven.apache.org/maven2/org/wicketstuff/wicketstuff-html5/6.15.0/wicketstuff-html5-6.15.0.jar
Downloaded: http://repo.maven.apache.org/maven2/org/apache/wicket/wicket-native-websocket-tomcat/6.15.0/wicket-native-websocket-tomcat-6.15.0.jar
(14 KB at 31.4 KB/sec)
Downloading: http://repo.maven.apache.org/maven2/com/github/svenmeier/wicket-dnd/wicket-dnd/0.6.0/wicket-dnd-0.6.0.jar
Downloaded: http://repo.maven.apache.org/maven2/com/googlecode/wicket-jquery-ui/wicket-jquery-ui-plugins/6.15.0/wicket-jquery-ui-plugins-6.15.0.jar
(159 KB at 526.4 KB/sec)
Downloading: http://repo.maven.apache.org/maven2/org/seleniumhq/selenium/selenium-java/2.41.0/selenium-java-2.41.0.jar
Downloaded: http://repo.maven.apache.org/maven2/org/seleniumhq/selenium/selenium-java/2.41.0/selenium-java-2.41.0.jar
(381 KB at 6919.4 KB/sec)
Downloading: http://repo.maven.apache.org/maven2/org/seleniumhq/selenium/selenium-chrome-driver/2.41.0/selenium-chrome-driver-2.41.0.jar
Downloaded: http://repo.maven.apache.org/maven2/org/wicketstuff/wicketstuff-urlfragment/6.15.0/wicketstuff-urlfragment-6.15.0.jar
(20 KB at 67.7 KB/sec)
Downloading: http://repo.maven.apache.org/maven2/org/seleniumhq/selenium/selenium-remote-driver/2.41.0/selenium-remote-driver-2.41.0.jar
Downloaded: http://repo.maven.apache.org/maven2/org/seleniumhq/selenium/selenium-chrome-driver/2.41.0/selenium-chrome-driver-2.41.0.jar
(11 KB at 403.8 KB/sec)
Downloading: http://repo.maven.apache.org/maven2/org/seleniumhq/selenium/selenium-htmlunit-driver/2.41.0/selenium-htmlunit-driver-2.41.0.jar
Downloaded: http://repo.maven.apache.org/maven2/org/seleniumhq/selenium/selenium-htmlunit-driver/2.41.0/selenium-htmlunit-driver-2.41.0.jar
(58 KB at 1841.6 KB/sec)
Downloading: http://repo.maven.apache.org/maven2/org/seleniumhq/selenium/selenium-firefox-driver/2.41.0/selenium-firefox-driver-2.41.0.jar
Downloaded: http://repo.maven.apache.org/maven2/org/seleniumhq/selenium/selenium-remote-driver/2.41.0/selenium-remote-driver-2.41.0.jar
(241 KB at 4915.4 KB/sec)
Downloading: http://repo.maven.apache.org/maven2/org/seleniumhq/selenium/selenium-ie-driver/2.41.0/selenium-ie-driver-2.41.0.jar
Downloaded: http://repo.maven.apache.org/maven2/org/wicketstuff/wicketstuff-html5/6.15.0/wicketstuff-html5-6.15.0.jar
(24 KB at 97.9 KB/sec)
Downloading: http://repo.maven.apache.org/maven2/org/seleniumhq/selenium/selenium-safari-driver/2.41.0/selenium-safari-driver-2.41.0.jar
Downloaded: http://repo.maven.apache.org/maven2/org/seleniumhq/selenium/selenium-ie-driver/2.41.0/selenium-ie-driver-2.41.0.jar
(11 KB at 406.5 KB/sec)
Downloading: http://repo.maven.apache.org/maven2/org/seleniumhq/selenium/selenium-support/2.41.0/selenium-support-2.41.0.jar
Downloaded: http://repo.maven.apache.org/maven2/com/github/svenmeier/wicket-dnd/wicket-dnd/0.6.0/wicket-dnd-0.6.0.jar
(37 KB at 153.1 KB/sec)
Downloading: http://repo.maven.apache.org/maven2/org/seleniumhq/selenium/selenium-api/2.41.0/selenium-api-2.41.0.jar
Downloaded: http://repo.maven.apache.org/maven2/com/googlecode/wicket-jquery-ui/wicket-jquery-ui-calendar/6.15.0/wicket-jquery-ui-calendar-6.15.0.jar
(98 KB at 187.7 KB/sec)
Downloaded: http://repo.maven.apache.org/maven2/org/seleniumhq/selenium/selenium-support/2.41.0/selenium-support-2.41.0.jar
(133 KB at 2700.0 KB/sec)
Downloaded: http://repo.maven.apache.org/maven2/org/seleniumhq/selenium/selenium-safari-driver/2.41.0/selenium-safari-driver-2.41.0.jar
(273 KB at 3731.8 KB/sec)
Downloaded: http://repo.maven.apache.org/maven2/org/seleniumhq/selenium/selenium-api/2.41.0/selenium-api-2.41.0.jar
(142 KB at 1121.5 KB/sec)
Downloaded: http://repo.maven.apache.org/maven2/org/seleniumhq/selenium/selenium-firefox-driver/2.41.0/selenium-firefox-driver-2.41.0.jar
(2440 KB at 11399.7 KB/sec)
[INFO] 
[INFO] --- maven-remote-resources-plugin:1.2.1:process (default) @ openmeetings-web ---
Downloading: http://red5.googlecode.com/svn/repository/com/googlecode/mp4parser/isoparser/1.0-RC-19-SNAPSHOT/isoparser-1.0-RC-19-SNAPSHOT.pom
Downloading: http://repository.sonatype.org/content/groups/flexgroup/com/googlecode/mp4parser/isoparser/1.0-RC-19-SNAPSHOT/isoparser-1.0-RC-19-SNAPSHOT.pom
Downloading: http://repository.apache.org/snapshots/com/googlecode/mp4parser/isoparser/1.0-RC-19-SNAPSHOT/isoparser-1.0-RC-19-SNAPSHOT.pom
Downloading: http://red5.googlecode.com/svn/repository/org/asteriskjava/asterisk-java/1.0.0.CI-SNAPSHOT/asterisk-java-1.0.0.CI-SNAPSHOT.pom
Downloading: http://repository.sonatype.org/content/groups/flexgroup/org/asteriskjava/asterisk-java/1.0.0.CI-SNAPSHOT/asterisk-java-1.0.0.CI-SNAPSHOT.pom
Downloading: http://repository.apache.org/snapshots/org/asteriskjava/asterisk-java/1.0.0.CI-SNAPSHOT/asterisk-java-1.0.0.CI-SNAPSHOT.pom
Downloading: http://red5.googlecode.com/svn/repository/org/smslib/smslib/3.5.4/smslib-3.5.4.pom
Downloading: http://repository.sonatype.org/content/groups/flexgroup/org/smslib/smslib/3.5.4/smslib-3.5.4.pom
Downloading: http://repo.maven.apache.org/maven2/org/smslib/smslib/3.5.4/smslib-3.5.4.pom
[INFO] 
[INFO] --- maven-resources-plugin:2.6:resources (default-resources) @ openmeetings-web ---
[INFO] Using 'UTF-8' encoding to copy filtered resources.
[INFO] skip non existing resourceDirectory <https://builds.apache.org/job/OpenMeetingsMaven/ws/openmeetings-web/src/main/resources>
[INFO] Copying 3 resources
[INFO] 
[INFO] --- maven-resources-plugin:2.6:copy-resources (copy-web-templates) @ openmeetings-web
---
[INFO] Using 'UTF-8' encoding to copy filtered resources.
[INFO] Copying 6 resources
[INFO] 
[INFO] --- maven-antrun-plugin:1.7:run (move-openjpa-resources) @ openmeetings-web ---
[INFO] Executing tasks

main:
     [copy] Copying 246 files to <https://builds.apache.org/job/OpenMeetingsMaven/ws/openmeetings-web/target/test-root>
     [copy] Copied 30 empty directories to 2 empty directories under <https://builds.apache.org/job/OpenMeetingsMaven/ws/openmeetings-web/target/test-root>
     [copy] Copying 1 file to <https://builds.apache.org/job/OpenMeetingsMaven/ws/openmeetings-web/target/openmeetings-web-3.1.0-SNAPSHOT/WEB-INF/classes/META-INF>
[INFO] Executed tasks
[INFO] 
[INFO] --- maven-compiler-plugin:2.5.1:compile (default-compile) @ openmeetings-web ---
[INFO] Compiling 133 source files to <https://builds.apache.org/job/OpenMeetingsMaven/ws/openmeetings-web/target/classes>
[INFO] 
[INFO] --- maven-resources-plugin:2.6:testResources (default-testResources) @ openmeetings-web
---
[INFO] Using 'UTF-8' encoding to copy filtered resources.
[INFO] Copying 11 resources
[INFO] Copying 3 resources
[INFO] 
[INFO] --- wagon-maven-plugin:1.0-beta-5:download (download-test-data) @ openmeetings-web
---
Downloading: http://repository.sonatype.org/content/groups/flexgroup/org/apache/maven/maven-compat/2.2.1/maven-compat-2.2.1.pom
Downloading: http://repo.maven.apache.org/maven2/org/apache/maven/maven-compat/2.2.1/maven-compat-2.2.1.pom
Downloaded: http://repo.maven.apache.org/maven2/org/apache/maven/maven-compat/2.2.1/maven-compat-2.2.1.pom
(4 KB at 128.4 KB/sec)
[INFO] Scanning remote file system: https://openmeetings.googlecode.com/svn/repository ...
[WARNING] Failed to getClass for org.codehaus.mojo.webstart.JnlpMojo
[INFO] ------------------------------------------------------------------------
[INFO] Reactor Summary:
[INFO] 
[INFO] Openmeetings Parent ............................... SUCCESS [5.455s]
[INFO] Openmeetings Util ................................. SUCCESS [22.904s]
[INFO] Openmeetings DB ................................... SUCCESS [13.930s]
[INFO] Openmeetings Install .............................. SUCCESS [3.079s]
[INFO] Openmeetings Core ................................. SUCCESS [33.269s]
[INFO] Openmeetings Flash ................................ SUCCESS [1:25.086s]
[INFO] Openmeetings Screen Sharing applet ................ FAILURE [2:18.526s]
[INFO] Openmeetings Service .............................. SKIPPED
[INFO] Openmeetings Webservices .......................... SKIPPED
[INFO] Openmeetings Web .................................. SKIPPED
[INFO] ------------------------------------------------------------------------
[INFO] BUILD FAILURE
[INFO] ------------------------------------------------------------------------
[INFO] Total time: 5:11.062s
[INFO] Finished at: Sun May 04 22:19:42 UTC 2014
[INFO] Final Memory: 71M/359M
[INFO] ------------------------------------------------------------------------
Waiting for Jenkins to finish collecting data
[ERROR] Failed to execute goal org.codehaus.mojo:wagon-maven-plugin:1.0-beta-5:download (download-test-data)
on project openmeetings-web: Execution download-test-data of goal org.codehaus.mojo:wagon-maven-plugin:1.0-beta-5:download
failed: A required class was missing while executing org.codehaus.mojo:wagon-maven-plugin:1.0-beta-5:download:
org/apache/commons/io/IOUtils
[ERROR] -----------------------------------------------------
[ERROR] realm =    plugin>org.codehaus.mojo:wagon-maven-plugin:1.0-beta-5
[ERROR] strategy = org.codehaus.plexus.classworlds.strategy.SelfFirstStrategy
[ERROR] urls[0] = file:/home/jenkins/jenkins-slave/maven-repositories/0/org/codehaus/mojo/wagon-maven-plugin/1.0-beta-5/wagon-maven-plugin-1.0-beta-5.jar
[ERROR] urls[1] = file:/home/jenkins/jenkins-slave/maven-repositories/0/org/codehaus/plexus/plexus-interpolation/1.11/plexus-interpolation-1.11.jar
[ERROR] urls[2] = file:/home/jenkins/jenkins-slave/maven-repositories/0/backport-util-concurrent/backport-util-concurrent/3.1/backport-util-concurrent-3.1.jar
[ERROR] urls[3] = file:/home/jenkins/jenkins-slave/maven-repositories/0/org/slf4j/slf4j-jdk14/1.5.6/slf4j-jdk14-1.5.6.jar
[ERROR] urls[4] = file:/home/jenkins/jenkins-slave/maven-repositories/0/org/slf4j/slf4j-api/1.5.6/slf4j-api-1.5.6.jar
[ERROR] urls[5] = file:/home/jenkins/jenkins-slave/maven-repositories/0/org/slf4j/jcl-over-slf4j/1.5.6/jcl-over-slf4j-1.5.6.jar
[ERROR] urls[6] = file:/home/jenkins/jenkins-slave/maven-repositories/0/org/apache/maven/reporting/maven-reporting-api/2.2.1/maven-reporting-api-2.2.1.jar
[ERROR] urls[7] = file:/home/jenkins/jenkins-slave/maven-repositories/0/org/apache/maven/doxia/doxia-sink-api/1.1/doxia-sink-api-1.1.jar
[ERROR] urls[8] = file:/home/jenkins/jenkins-slave/maven-repositories/0/org/apache/maven/doxia/doxia-logging-api/1.1/doxia-logging-api-1.1.jar
[ERROR] urls[9] = file:/home/jenkins/jenkins-slave/maven-repositories/0/org/codehaus/plexus/plexus-interactivity-api/1.0-alpha-4/plexus-interactivity-api-1.0-alpha-4.jar
[ERROR] urls[10] = file:/home/jenkins/jenkins-slave/maven-repositories/0/org/sonatype/plexus/plexus-sec-dispatcher/1.3/plexus-sec-dispatcher-1.3.jar
[ERROR] urls[11] = file:/home/jenkins/jenkins-slave/maven-repositories/0/org/sonatype/plexus/plexus-cipher/1.4/plexus-cipher-1.4.jar
[ERROR] urls[12] = file:/home/jenkins/jenkins-slave/maven-repositories/0/commons-cli/commons-cli/1.2/commons-cli-1.2.jar
[ERROR] urls[13] = file:/home/jenkins/jenkins-slave/maven-repositories/0/org/codehaus/plexus/plexus-utils/1.5.6/plexus-utils-1.5.6.jar
[ERROR] urls[14] = file:/home/jenkins/jenkins-slave/maven-repositories/0/org/apache/maven/shared/file-management/1.2.1/file-management-1.2.1.jar
[ERROR] urls[15] = file:/home/jenkins/jenkins-slave/maven-repositories/0/org/apache/maven/shared/maven-shared-io/1.1/maven-shared-io-1.1.jar
[ERROR] Number of foreign imports: 1
[ERROR] import: Entry[import  from realm ClassRealm[project>org.apache.openmeetings:openmeetings-parent:3.1.0-SNAPSHOT,
parent: ClassRealm[maven.api, parent: null]]]
[ERROR] 
[ERROR] -----------------------------------------------------: org.apache.commons.io.IOUtils
[ERROR] -> [Help 1]
[ERROR] 
[ERROR] To see the full stack trace of the errors, re-run Maven with the -e switch.
[ERROR] Re-run Maven using the -X switch to enable full debug logging.
[ERROR] 
[ERROR] For more information about the errors and possible solutions, please read the following
articles:
[ERROR] [Help 1] http://cwiki.apache.org/confluence/display/MAVEN/PluginContainerException
[ERROR] 
[ERROR] After correcting the problems, you can resume the build with the command
[ERROR]   mvn <goals> -rf :openmeetings-web
[JENKINS] Archiving <https://builds.apache.org/job/OpenMeetingsMaven/ws/openmeetings-screenshare/pom.xml>
to org.apache.openmeetings/openmeetings-screenshare/3.1.0-SNAPSHOT/openmeetings-screenshare-3.1.0-SNAPSHOT.pom
[JENKINS] Archiving <https://builds.apache.org/job/OpenMeetingsMaven/ws/openmeetings-install/pom.xml>
to org.apache.openmeetings/openmeetings-install/3.1.0-SNAPSHOT/openmeetings-install-3.1.0-SNAPSHOT.pom
[JENKINS] Archiving <https://builds.apache.org/job/OpenMeetingsMaven/ws/openmeetings-install/target/openmeetings-install-3.1.0-SNAPSHOT.jar>
to org.apache.openmeetings/openmeetings-install/3.1.0-SNAPSHOT/openmeetings-install-3.1.0-SNAPSHOT.jar
[JENKINS] Archiving <https://builds.apache.org/job/OpenMeetingsMaven/ws/openmeetings-install/target/openmeetings-install-3.1.0-SNAPSHOT-tests.jar>
to org.apache.openmeetings/openmeetings-install/3.1.0-SNAPSHOT/openmeetings-install-3.1.0-SNAPSHOT-tests.jar
[JENKINS] Archiving <https://builds.apache.org/job/OpenMeetingsMaven/ws/openmeetings-service/pom.xml>
to org.apache.openmeetings/openmeetings-service/3.1.0-SNAPSHOT/openmeetings-service-3.1.0-SNAPSHOT.pom
[JENKINS] Archiving <https://builds.apache.org/job/OpenMeetingsMaven/ws/openmeetings-util/pom.xml>
to org.apache.openmeetings/openmeetings-util/3.1.0-SNAPSHOT/openmeetings-util-3.1.0-SNAPSHOT.pom
[JENKINS] Archiving <https://builds.apache.org/job/OpenMeetingsMaven/ws/openmeetings-util/target/openmeetings-util-3.1.0-SNAPSHOT.jar>
to org.apache.openmeetings/openmeetings-util/3.1.0-SNAPSHOT/openmeetings-util-3.1.0-SNAPSHOT.jar
[JENKINS] Archiving <https://builds.apache.org/job/OpenMeetingsMaven/ws/openmeetings-util/target/openmeetings-util-3.1.0-SNAPSHOT-tests.jar>
to org.apache.openmeetings/openmeetings-util/3.1.0-SNAPSHOT/openmeetings-util-3.1.0-SNAPSHOT-tests.jar
[JENKINS] Archiving <https://builds.apache.org/job/OpenMeetingsMaven/ws/pom.xml> to
org.apache.openmeetings/openmeetings-parent/3.1.0-SNAPSHOT/openmeetings-parent-3.1.0-SNAPSHOT.pom
[JENKINS] Archiving <https://builds.apache.org/job/OpenMeetingsMaven/ws/target/openmeetings-parent-3.1.0-SNAPSHOT-tests.jar>
to org.apache.openmeetings/openmeetings-parent/3.1.0-SNAPSHOT/openmeetings-parent-3.1.0-SNAPSHOT-tests.jar
[JENKINS] Archiving <https://builds.apache.org/job/OpenMeetingsMaven/ws/openmeetings-db/pom.xml>
to org.apache.openmeetings/openmeetings-db/3.1.0-SNAPSHOT/openmeetings-db-3.1.0-SNAPSHOT.pom
[JENKINS] Archiving <https://builds.apache.org/job/OpenMeetingsMaven/ws/openmeetings-db/target/openmeetings-db-3.1.0-SNAPSHOT.jar>
to org.apache.openmeetings/openmeetings-db/3.1.0-SNAPSHOT/openmeetings-db-3.1.0-SNAPSHOT.jar
[JENKINS] Archiving <https://builds.apache.org/job/OpenMeetingsMaven/ws/openmeetings-db/target/openmeetings-db-3.1.0-SNAPSHOT-tests.jar>
to org.apache.openmeetings/openmeetings-db/3.1.0-SNAPSHOT/openmeetings-db-3.1.0-SNAPSHOT-tests.jar
[JENKINS] Archiving <https://builds.apache.org/job/OpenMeetingsMaven/ws/openmeetings-web/pom.xml>
to org.apache.openmeetings/openmeetings-web/3.1.0-SNAPSHOT/openmeetings-web-3.1.0-SNAPSHOT.pom
[JENKINS] Archiving <https://builds.apache.org/job/OpenMeetingsMaven/ws/openmeetings-webservice/pom.xml>
to org.apache.openmeetings/openmeetings-webservice/3.1.0-SNAPSHOT/openmeetings-webservice-3.1.0-SNAPSHOT.pom
[JENKINS] Archiving <https://builds.apache.org/job/OpenMeetingsMaven/ws/openmeetings-core/pom.xml>
to org.apache.openmeetings/openmeetings-core/3.1.0-SNAPSHOT/openmeetings-core-3.1.0-SNAPSHOT.pom
[JENKINS] Archiving <https://builds.apache.org/job/OpenMeetingsMaven/ws/openmeetings-core/target/openmeetings-core-3.1.0-SNAPSHOT.jar>
to org.apache.openmeetings/openmeetings-core/3.1.0-SNAPSHOT/openmeetings-core-3.1.0-SNAPSHOT.jar
[JENKINS] Archiving <https://builds.apache.org/job/OpenMeetingsMaven/ws/openmeetings-core/target/openmeetings-core-3.1.0-SNAPSHOT-tests.jar>
to org.apache.openmeetings/openmeetings-core/3.1.0-SNAPSHOT/openmeetings-core-3.1.0-SNAPSHOT-tests.jar
[JENKINS] Archiving <https://builds.apache.org/job/OpenMeetingsMaven/ws/openmeetings-flash/pom.xml>
to org.apache.openmeetings/openmeetings-flash/3.1.0-SNAPSHOT/openmeetings-flash-3.1.0-SNAPSHOT.pom
[JENKINS] Archiving <https://builds.apache.org/job/OpenMeetingsMaven/ws/openmeetings-flash/target/openmeetings-flash-3.1.0-SNAPSHOT-tests.jar>
to org.apache.openmeetings/openmeetings-flash/3.1.0-SNAPSHOT/openmeetings-flash-3.1.0-SNAPSHOT-tests.jar
Sending e-mails to: dev@openmeetings.apache.org
channel stopped

Mime
View raw message