openmeetings-dev mailing list archives

Site index · List index
Message view « Date » · « Thread »
Top « Date » · « Thread »
From Apache Jenkins Server <jenk...@builds.apache.org>
Subject Build failed in Jenkins: Openmeetings #812
Date Tue, 06 May 2014 06:34:38 GMT
See <https://builds.apache.org/job/openmeetings/812/changes>

Changes:

[solomax] [OPENMEETINGS-940] correct version of smslib is used

------------------------------------------
[...truncated 2214 lines...]
A         openmeetings-screenshare
A         openmeetings-screenshare/src
A         openmeetings-screenshare/src/main
A         openmeetings-screenshare/src/main/java
A         openmeetings-screenshare/src/main/java/org
A         openmeetings-screenshare/src/main/java/org/apache
A         openmeetings-screenshare/src/main/java/org/apache/openmeetings
A         openmeetings-screenshare/src/main/java/org/apache/openmeetings/screen
AU        openmeetings-screenshare/src/main/java/org/apache/openmeetings/screen/up.png
AU        openmeetings-screenshare/src/main/java/org/apache/openmeetings/screen/play.png
AU        openmeetings-screenshare/src/main/java/org/apache/openmeetings/screen/stop.png
AU        openmeetings-screenshare/src/main/java/org/apache/openmeetings/screen/down.png
A         openmeetings-screenshare/src/main/java/org/apache/openmeetings/screen/webstart
A         openmeetings-screenshare/src/main/java/org/apache/openmeetings/screen/webstart/CaptureScreen.java
A         openmeetings-screenshare/src/main/java/org/apache/openmeetings/screen/webstart/gui
A         openmeetings-screenshare/src/main/java/org/apache/openmeetings/screen/webstart/gui/ScreenKeyListener.java
AU        openmeetings-screenshare/src/main/java/org/apache/openmeetings/screen/webstart/gui/ScreenMouseListener.java
AU        openmeetings-screenshare/src/main/java/org/apache/openmeetings/screen/webstart/gui/ScreenWidthMouseListener.java
AU        openmeetings-screenshare/src/main/java/org/apache/openmeetings/screen/webstart/gui/ScreenSharerFrame.java
AU        openmeetings-screenshare/src/main/java/org/apache/openmeetings/screen/webstart/gui/BlankArea.java
A         openmeetings-screenshare/src/main/java/org/apache/openmeetings/screen/webstart/gui/MouseListenerable.java
AU        openmeetings-screenshare/src/main/java/org/apache/openmeetings/screen/webstart/gui/ScreenXMouseListener.java
A         openmeetings-screenshare/src/main/java/org/apache/openmeetings/screen/webstart/gui/NumberSpinner.java
AU        openmeetings-screenshare/src/main/java/org/apache/openmeetings/screen/webstart/gui/ScreenHeightMouseListener.java
AU        openmeetings-screenshare/src/main/java/org/apache/openmeetings/screen/webstart/gui/ScreenYMouseListener.java
A         openmeetings-screenshare/src/main/java/org/apache/openmeetings/screen/webstart/gui/ScreenDimensions.java
AU        openmeetings-screenshare/src/main/java/org/apache/openmeetings/screen/webstart/RTMPScreenShare.java
A         openmeetings-screenshare/src/main/java/org/apache/openmeetings/screen/webstart/ScreenV1Encoder.java
A         openmeetings-screenshare/src/main/java/org/apache/openmeetings/screen/webstart/AudioTone.java
A         openmeetings-screenshare/src/main/java/org/apache/openmeetings/screen/webstart/IScreenEncoder.java
A         openmeetings-screenshare/src/main/java/org/apache/openmeetings/screen/webstart/RTMPClientPublish.java
A         openmeetings-screenshare/src/main/java/org/apache/openmeetings/screen/webstart/RTMPSScreenShare.java
AU        openmeetings-screenshare/src/main/java/org/apache/openmeetings/screen/webstart/RTMPTScreenShare.java
A         openmeetings-screenshare/src/main/java/org/apache/openmeetings/screen/webstart/BaseScreenEncoder.java
A         openmeetings-screenshare/src/main/java/org/apache/openmeetings/screen/webstart/CoreScreenShare.java
A         openmeetings-screenshare/src/main/java/org/apache/openmeetings/screen/webstart/IScreenShare.java
AU        openmeetings-screenshare/src/main/java/org/apache/openmeetings/screen/previous.png
AU        openmeetings-screenshare/src/main/java/org/apache/openmeetings/screen/next.png
A         openmeetings-screenshare/src/main/jnlp
A         openmeetings-screenshare/src/main/jnlp/resources
AU        openmeetings-screenshare/src/main/jnlp/resources/icon.jpg
AU        openmeetings-screenshare/src/main/jnlp/resources/splashicon.jpg
A         openmeetings-screenshare/src/main/jnlp/templates
A         openmeetings-screenshare/src/main/jnlp/templates/template.jnlp
A         openmeetings-screenshare/src/main/resources
A         openmeetings-screenshare/src/main/resources/logback.xsd
A         openmeetings-screenshare/src/main/resources/logback.xml
A         openmeetings-screenshare/pom.xml
 U        .
At revision 1592663
Unpacking http://archive.apache.org/dist/maven/binaries/apache-maven-3.2.1-bin.zip to /home/jenkins/jenkins-slave/tools/hudson.tasks.Maven_MavenInstallation/maven-3.2.1
on ubuntu5
[singlewebapp] $ /home/jenkins/jenkins-slave/tools/hudson.tasks.Maven_MavenInstallation/maven-3.2.1/bin/mvn
clean install -pl openmeetings-screenshare -am
[INFO] Scanning for projects...
[WARNING] 
[WARNING] Some problems were encountered while building the effective model for org.apache.openmeetings:openmeetings-web:war:3.1.0-SNAPSHOT
[WARNING] 'build.plugins.plugin.(groupId:artifactId)' must be unique but found duplicate declaration
of plugin org.apache.maven.plugins:maven-antrun-plugin @ line 244, column 12
[WARNING] 
[WARNING] It is highly recommended to fix these problems because they threaten the stability
of your build.
[WARNING] 
[WARNING] For this reason, future Maven versions might no longer support building such malformed
projects.
[WARNING] 
[INFO] ------------------------------------------------------------------------
[INFO] Reactor Build Order:
[INFO] 
[INFO] Openmeetings Parent
[INFO] Openmeetings Screen Sharing applet
[INFO] 
[INFO] Using the builder org.apache.maven.lifecycle.internal.builder.singlethreaded.SingleThreadedBuilder
with a thread count of 1
[INFO]                                                                         
[INFO] ------------------------------------------------------------------------
[INFO] Building Openmeetings Parent 3.1.0-SNAPSHOT
[INFO] ------------------------------------------------------------------------
[INFO] 
[INFO] --- maven-clean-plugin:2.4.1:clean (default-clean) @ openmeetings-parent ---
[INFO] 
[INFO] --- maven-remote-resources-plugin:1.2.1:process (default) @ openmeetings-parent ---
[INFO] 
[INFO] --- maven-site-plugin:3.3:attach-descriptor (attach-descriptor) @ openmeetings-parent
---
[INFO] 
[INFO] --- maven-jar-plugin:2.4:test-jar (default) @ openmeetings-parent ---
[WARNING] JAR will be empty - no content was marked for inclusion!
[INFO] Building jar: <https://builds.apache.org/job/openmeetings/ws/singlewebapp/target/openmeetings-parent-3.1.0-SNAPSHOT-tests.jar>
[INFO] 
[INFO] --- maven-install-plugin:2.3.1:install (default-install) @ openmeetings-parent ---
[INFO] Installing <https://builds.apache.org/job/openmeetings/ws/singlewebapp/pom.xml>
to /home/jenkins/.m2/repository/org/apache/openmeetings/openmeetings-parent/3.1.0-SNAPSHOT/openmeetings-parent-3.1.0-SNAPSHOT.pom
[INFO] Installing <https://builds.apache.org/job/openmeetings/ws/singlewebapp/target/openmeetings-parent-3.1.0-SNAPSHOT-tests.jar>
to /home/jenkins/.m2/repository/org/apache/openmeetings/openmeetings-parent/3.1.0-SNAPSHOT/openmeetings-parent-3.1.0-SNAPSHOT-tests.jar
[INFO]                                                                         
[INFO] ------------------------------------------------------------------------
[INFO] Building Openmeetings Screen Sharing applet 3.1.0-SNAPSHOT
[INFO] ------------------------------------------------------------------------
Downloading: http://repository.sonatype.org/content/groups/flexgroup/com/google/code/maven-replacer-plugin/replacer/1.5.3/replacer-1.5.3.pom

Downloading: http://repo.maven.apache.org/maven2/com/google/code/maven-replacer-plugin/replacer/1.5.3/replacer-1.5.3.pom
2/6 KB   
6/6 KB   
6/6 KB   
         
Downloaded: http://repo.maven.apache.org/maven2/com/google/code/maven-replacer-plugin/replacer/1.5.3/replacer-1.5.3.pom
(6 KB at 26.7 KB/sec)
Downloading: http://repository.sonatype.org/content/groups/flexgroup/com/google/code/maven-replacer-plugin/replacer/1.5.3/replacer-1.5.3.jar
         
Downloading: http://repo.maven.apache.org/maven2/com/google/code/maven-replacer-plugin/replacer/1.5.3/replacer-1.5.3.jar
2/39 KB   
6/39 KB   
10/39 KB   
14/39 KB   
14/39 KB   
17/39 KB   
21/39 KB   
25/39 KB   
29/39 KB   
33/39 KB   
35/39 KB   
39/39 KB   
           
Downloaded: http://repo.maven.apache.org/maven2/com/google/code/maven-replacer-plugin/replacer/1.5.3/replacer-1.5.3.jar
(39 KB at 185.4 KB/sec)
Downloading: http://repository.sonatype.org/content/groups/flexgroup/org/codehaus/mojo/webstart-maven-plugin/1.0-beta-6/webstart-maven-plugin-1.0-beta-6.pom
           
Downloading: http://repo.maven.apache.org/maven2/org/codehaus/mojo/webstart-maven-plugin/1.0-beta-6/webstart-maven-plugin-1.0-beta-6.pom
2/11 KB    
6/11 KB   
10/11 KB   
11/11 KB   
           
Downloaded: http://repo.maven.apache.org/maven2/org/codehaus/mojo/webstart-maven-plugin/1.0-beta-6/webstart-maven-plugin-1.0-beta-6.pom
(11 KB at 95.5 KB/sec)
Downloading: http://repository.sonatype.org/content/groups/flexgroup/org/codehaus/mojo/webstart/1.0-beta-6/webstart-1.0-beta-6.pom
           
Downloading: http://repo.maven.apache.org/maven2/org/codehaus/mojo/webstart/1.0-beta-6/webstart-1.0-beta-6.pom
2/14 KB    
6/14 KB   
10/14 KB   
14/14 KB   
14/14 KB   
           
Downloaded: http://repo.maven.apache.org/maven2/org/codehaus/mojo/webstart/1.0-beta-6/webstart-1.0-beta-6.pom
(14 KB at 122.4 KB/sec)
Downloading: http://repository.sonatype.org/content/groups/flexgroup/org/codehaus/mojo/webstart-maven-plugin/1.0-beta-6/webstart-maven-plugin-1.0-beta-6.jar
           
Downloading: http://repo.maven.apache.org/maven2/org/codehaus/mojo/webstart-maven-plugin/1.0-beta-6/webstart-maven-plugin-1.0-beta-6.jar
4/136 KB   
8/136 KB   
12/136 KB   
16/136 KB   
20/136 KB   
21/136 KB   
24/136 KB   
28/136 KB   
32/136 KB   
36/136 KB   
40/136 KB   
44/136 KB   
46/136 KB   
50/136 KB   
50/136 KB   
53/136 KB   
56/136 KB   
60/136 KB   
64/136 KB   
68/136 KB   
72/136 KB   
76/136 KB   
80/136 KB   
82/136 KB   
86/136 KB   
90/136 KB   
94/136 KB   
98/136 KB   
102/136 KB   
106/136 KB   
110/136 KB   
112/136 KB   
116/136 KB   
120/136 KB   
124/136 KB   
128/136 KB   
132/136 KB   
136/136 KB   
             
Downloaded: http://repo.maven.apache.org/maven2/org/codehaus/mojo/webstart-maven-plugin/1.0-beta-6/webstart-maven-plugin-1.0-beta-6.jar
(136 KB at 435.1 KB/sec)
Downloading: http://repository.sonatype.org/content/groups/flexgroup/org/codehaus/mojo/truezip-maven-plugin/1.2/truezip-maven-plugin-1.2.pom
             
Downloading: http://repo.maven.apache.org/maven2/org/codehaus/mojo/truezip-maven-plugin/1.2/truezip-maven-plugin-1.2.pom
3/4 KB       
4/4 KB   
         
Downloaded: http://repo.maven.apache.org/maven2/org/codehaus/mojo/truezip-maven-plugin/1.2/truezip-maven-plugin-1.2.pom
(4 KB at 17.6 KB/sec)
Downloading: http://repository.sonatype.org/content/groups/flexgroup/org/codehaus/mojo/truezip/1.2/truezip-1.2.pom
         
Downloading: http://repo.maven.apache.org/maven2/org/codehaus/mojo/truezip/1.2/truezip-1.2.pom
4/6 KB   
6/6 KB   
         
Downloaded: http://repo.maven.apache.org/maven2/org/codehaus/mojo/truezip/1.2/truezip-1.2.pom
(6 KB at 30.7 KB/sec)
Downloading: http://repository.sonatype.org/content/groups/flexgroup/org/codehaus/mojo/mojo-parent/33/mojo-parent-33.pom
         
Downloading: http://repo.maven.apache.org/maven2/org/codehaus/mojo/mojo-parent/33/mojo-parent-33.pom
2/26 KB   
6/26 KB   
10/26 KB   
14/26 KB   
18/26 KB   
22/26 KB   
26/26 KB   
26/26 KB   
           
Downloaded: http://repo.maven.apache.org/maven2/org/codehaus/mojo/mojo-parent/33/mojo-parent-33.pom
(26 KB at 232.9 KB/sec)
Downloading: http://repository.sonatype.org/content/groups/flexgroup/org/codehaus/mojo/truezip-maven-plugin/1.2/truezip-maven-plugin-1.2.jar
           
Downloading: http://repo.maven.apache.org/maven2/org/codehaus/mojo/truezip-maven-plugin/1.2/truezip-maven-plugin-1.2.jar
4/27 KB    
8/27 KB   
12/27 KB   
16/27 KB   
20/27 KB   
24/27 KB   
27/27 KB   
           
Downloaded: http://repo.maven.apache.org/maven2/org/codehaus/mojo/truezip-maven-plugin/1.2/truezip-maven-plugin-1.2.jar
(27 KB at 237.0 KB/sec)
Downloading: http://repository.sonatype.org/content/groups/flexgroup/org/apache/maven/plugins/maven-jarsigner-plugin/1.3.2/maven-jarsigner-plugin-1.3.2.pom
           
Downloading: http://repo.maven.apache.org/maven2/org/apache/maven/plugins/maven-jarsigner-plugin/1.3.2/maven-jarsigner-plugin-1.3.2.pom
4/8 KB     
8/8 KB   
8/8 KB   
         
Downloaded: http://repo.maven.apache.org/maven2/org/apache/maven/plugins/maven-jarsigner-plugin/1.3.2/maven-jarsigner-plugin-1.3.2.pom
(8 KB at 73.0 KB/sec)
Downloading: http://repository.sonatype.org/content/groups/flexgroup/org/apache/maven/plugins/maven-jarsigner-plugin/1.3.2/maven-jarsigner-plugin-1.3.2.jar
         
Downloading: http://repo.maven.apache.org/maven2/org/apache/maven/plugins/maven-jarsigner-plugin/1.3.2/maven-jarsigner-plugin-1.3.2.jar
         
[INFO] ------------------------------------------------------------------------
[INFO] Reactor Summary:
[INFO] 
[INFO] Openmeetings Parent ............................... SUCCESS [  4.688 s]
[INFO] Openmeetings Screen Sharing applet ................ FAILURE [  3.883 s]
[INFO] ------------------------------------------------------------------------
[INFO] BUILD FAILURE
[INFO] ------------------------------------------------------------------------
[INFO] Total time: 10.071 s
[INFO] Finished at: 2014-05-06T06:34:37+00:00
[INFO] Final Memory: 16M/110M
[INFO] ------------------------------------------------------------------------
[ERROR] Plugin org.apache.maven.plugins:maven-jarsigner-plugin:1.3.2 or one of its dependencies
could not be resolved: Could not find artifact org.apache.maven.plugins:maven-jarsigner-plugin:jar:1.3.2
in flex-mojos-plugin-repository (http://repository.sonatype.org/content/groups/flexgroup)
-> [Help 1]
[ERROR] 
[ERROR] To see the full stack trace of the errors, re-run Maven with the -e switch.
[ERROR] Re-run Maven using the -X switch to enable full debug logging.
[ERROR] 
[ERROR] For more information about the errors and possible solutions, please read the following
articles:
[ERROR] [Help 1] http://cwiki.apache.org/confluence/display/MAVEN/PluginResolutionException
Build step 'Invoke top-level Maven targets' marked build as failure
Archiving artifacts

Mime
View raw message