openmeetings-dev mailing list archives

Site index · List index
Message view « Date » · « Thread »
Top « Date » · « Thread »
From Apache Jenkins Server <jenk...@builds.apache.org>
Subject Build failed in Jenkins: Openmeetings #810
Date Mon, 05 May 2014 04:02:21 GMT
See <https://builds.apache.org/job/openmeetings/810/changes>

Changes:

[solomax] [OPENMEETINGS-940] quick build is improved

[solomax] [OPENMEETINGS-940] quick build is added

[solomax] [OPENMEETINGS-940] OM server is prepared all files are placed as usual

[solomax] [OPENMEETINGS-940] some build optimisations

[sebawagner] OPENMEETINGS-940 - core was not build the test-jar file, that was referenced
by the openmeetings-web module

[solomax] [OPENMEETINGS-940] Red5 server is downloaded

[solomax] Logging is improved; Full message size in recording log is increased

------------------------------------------
[...truncated 17978 lines...]
1975/2440 KB   972/1096 KB   
1979/2440 KB   972/1096 KB   
1983/2440 KB   972/1096 KB   
1987/2440 KB   972/1096 KB   
1991/2440 KB   972/1096 KB   
1995/2440 KB   972/1096 KB   
1999/2440 KB   972/1096 KB   
2003/2440 KB   972/1096 KB   
2007/2440 KB   972/1096 KB   
2011/2440 KB   972/1096 KB   
2015/2440 KB   972/1096 KB   
2019/2440 KB   972/1096 KB   
2023/2440 KB   972/1096 KB   
2027/2440 KB   972/1096 KB   
2031/2440 KB   972/1096 KB   
2035/2440 KB   972/1096 KB   
2039/2440 KB   972/1096 KB   
2043/2440 KB   972/1096 KB   
2047/2440 KB   972/1096 KB   
2051/2440 KB   972/1096 KB   
2055/2440 KB   972/1096 KB   
2059/2440 KB   972/1096 KB   
2063/2440 KB   972/1096 KB   
2067/2440 KB   972/1096 KB   
2071/2440 KB   972/1096 KB   
2075/2440 KB   972/1096 KB   
2077/2440 KB   972/1096 KB   
2077/2440 KB   976/1096 KB   
2077/2440 KB   980/1096 KB   
2077/2440 KB   984/1096 KB   
2077/2440 KB   988/1096 KB   
2077/2440 KB   992/1096 KB   
2077/2440 KB   996/1096 KB   
2077/2440 KB   996/1096 KB   
2077/2440 KB   998/1096 KB   
2077/2440 KB   1002/1096 KB   
2077/2440 KB   1006/1096 KB   
2077/2440 KB   1010/1096 KB   
2077/2440 KB   1014/1096 KB   
2077/2440 KB   1018/1096 KB   
2077/2440 KB   1022/1096 KB   
2077/2440 KB   1026/1096 KB   
2077/2440 KB   1030/1096 KB   
2077/2440 KB   1034/1096 KB   
2077/2440 KB   1038/1096 KB   
2077/2440 KB   1042/1096 KB   
2077/2440 KB   1046/1096 KB   
2077/2440 KB   1050/1096 KB   
2077/2440 KB   1054/1096 KB   
2077/2440 KB   1058/1096 KB   
2077/2440 KB   1062/1096 KB   
2077/2440 KB   1066/1096 KB   
2077/2440 KB   1070/1096 KB   
2077/2440 KB   1074/1096 KB   
2077/2440 KB   1078/1096 KB   
2077/2440 KB   1082/1096 KB   
2077/2440 KB   1086/1096 KB   
2077/2440 KB   1090/1096 KB   
2077/2440 KB   1094/1096 KB   
2077/2440 KB   1096/1096 KB   
2079/2440 KB   1096/1096 KB   
2082/2440 KB   1096/1096 KB   
2084/2440 KB   1096/1096 KB   
2088/2440 KB   1096/1096 KB   
2092/2440 KB   1096/1096 KB   
2096/2440 KB   1096/1096 KB   
2100/2440 KB   1096/1096 KB   
2104/2440 KB   1096/1096 KB   
2108/2440 KB   1096/1096 KB   
2112/2440 KB   1096/1096 KB   
2116/2440 KB   1096/1096 KB   
2120/2440 KB   1096/1096 KB   
2124/2440 KB   1096/1096 KB   
2128/2440 KB   1096/1096 KB   
2132/2440 KB   1096/1096 KB   
2136/2440 KB   1096/1096 KB   
2140/2440 KB   1096/1096 KB   
2144/2440 KB   1096/1096 KB   
2148/2440 KB   1096/1096 KB   
2152/2440 KB   1096/1096 KB   
2156/2440 KB   1096/1096 KB   
2160/2440 KB   1096/1096 KB   
2164/2440 KB   1096/1096 KB   
2168/2440 KB   1096/1096 KB   
2172/2440 KB   1096/1096 KB   
2176/2440 KB   1096/1096 KB   
2180/2440 KB   1096/1096 KB   
2184/2440 KB   1096/1096 KB   
2188/2440 KB   1096/1096 KB   
2192/2440 KB   1096/1096 KB   
2196/2440 KB   1096/1096 KB   
2200/2440 KB   1096/1096 KB   
2204/2440 KB   1096/1096 KB   
2208/2440 KB   1096/1096 KB   
2212/2440 KB   1096/1096 KB   
2216/2440 KB   1096/1096 KB   
2220/2440 KB   1096/1096 KB   
2224/2440 KB   1096/1096 KB   
2228/2440 KB   1096/1096 KB   
2232/2440 KB   1096/1096 KB   
2236/2440 KB   1096/1096 KB   
2240/2440 KB   1096/1096 KB   
2244/2440 KB   1096/1096 KB   
2248/2440 KB   1096/1096 KB   
2252/2440 KB   1096/1096 KB   
2256/2440 KB   1096/1096 KB   
2260/2440 KB   1096/1096 KB   
2264/2440 KB   1096/1096 KB   
2268/2440 KB   1096/1096 KB   
2272/2440 KB   1096/1096 KB   
2276/2440 KB   1096/1096 KB   
2280/2440 KB   1096/1096 KB   
2284/2440 KB   1096/1096 KB   
2288/2440 KB   1096/1096 KB   
2292/2440 KB   1096/1096 KB   
2294/2440 KB   1096/1096 KB   
2298/2440 KB   1096/1096 KB   
2302/2440 KB   1096/1096 KB   
2306/2440 KB   1096/1096 KB   
2310/2440 KB   1096/1096 KB   
2314/2440 KB   1096/1096 KB   
2316/2440 KB   1096/1096 KB   
2320/2440 KB   1096/1096 KB   
2324/2440 KB   1096/1096 KB   
2326/2440 KB   1096/1096 KB   
2330/2440 KB   1096/1096 KB   
2334/2440 KB   1096/1096 KB   
2338/2440 KB   1096/1096 KB   
2340/2440 KB   1096/1096 KB   
2344/2440 KB   1096/1096 KB   
2345/2440 KB   1096/1096 KB   
2346/2440 KB   1096/1096 KB   
2349/2440 KB   1096/1096 KB   
2353/2440 KB   1096/1096 KB   
2354/2440 KB   1096/1096 KB   
2357/2440 KB   1096/1096 KB   
2361/2440 KB   1096/1096 KB   
2362/2440 KB   1096/1096 KB   
2366/2440 KB   1096/1096 KB   
2370/2440 KB   1096/1096 KB   
2374/2440 KB   1096/1096 KB   
2378/2440 KB   1096/1096 KB   
2382/2440 KB   1096/1096 KB   
2386/2440 KB   1096/1096 KB   
2390/2440 KB   1096/1096 KB   
2394/2440 KB   1096/1096 KB   
2398/2440 KB   1096/1096 KB   
2402/2440 KB   1096/1096 KB   
2406/2440 KB   1096/1096 KB   
2410/2440 KB   1096/1096 KB   
2414/2440 KB   1096/1096 KB   
2418/2440 KB   1096/1096 KB   
2422/2440 KB   1096/1096 KB   
2426/2440 KB   1096/1096 KB   
2430/2440 KB   1096/1096 KB   
2434/2440 KB   1096/1096 KB   
2438/2440 KB   1096/1096 KB   
2440/2440 KB   1096/1096 KB   
                              
Downloaded: http://repo.maven.apache.org/maven2/io/netty/netty/3.5.2.Final/netty-3.5.2.Final.jar
(1096 KB at 8234.2 KB/sec)
                              
Downloaded: http://repo.maven.apache.org/maven2/org/seleniumhq/selenium/selenium-firefox-driver/2.41.0/selenium-firefox-driver-2.41.0.jar
(2440 KB at 9068.9 KB/sec)
[INFO] 
[INFO] --- maven-clean-plugin:2.4.1:clean (default-clean) @ openmeetings-web ---
[INFO] 
[INFO] --- maven-remote-resources-plugin:1.2.1:process (default) @ openmeetings-web ---
[INFO] 
[INFO] --- maven-resources-plugin:2.6:resources (default-resources) @ openmeetings-web ---
[INFO] Using 'UTF-8' encoding to copy filtered resources.
[INFO] skip non existing resourceDirectory /x1/jenkins/jenkins-slave/workspace/openmeetings/singlewebapp/openmeetings-web/src/main/resources
[INFO] Copying 3 resources
[INFO] 
[INFO] --- maven-resources-plugin:2.6:copy-resources (copy-web-templates) @ openmeetings-web
---
[INFO] Using 'UTF-8' encoding to copy filtered resources.
[INFO] Copying 6 resources
[INFO] 
[INFO] --- maven-antrun-plugin:1.7:run (move-openjpa-resources) @ openmeetings-web ---
[INFO] Executing tasks

main:
     [copy] Copying 246 files to /x1/jenkins/jenkins-slave/workspace/openmeetings/singlewebapp/openmeetings-web/target/test-root
     [copy] Copied 30 empty directories to 2 empty directories under /x1/jenkins/jenkins-slave/workspace/openmeetings/singlewebapp/openmeetings-web/target/test-root
     [copy] Copying 1 file to /x1/jenkins/jenkins-slave/workspace/openmeetings/singlewebapp/openmeetings-web/target/openmeetings-web-3.1.0-SNAPSHOT/WEB-INF/classes/META-INF
[INFO] Executed tasks
[INFO] 
[INFO] --- maven-compiler-plugin:2.5.1:compile (default-compile) @ openmeetings-web ---
[INFO] Compiling 133 source files to /x1/jenkins/jenkins-slave/workspace/openmeetings/singlewebapp/openmeetings-web/target/classes
[INFO] 
[INFO] --- maven-resources-plugin:2.6:testResources (default-testResources) @ openmeetings-web
---
[INFO] Using 'UTF-8' encoding to copy filtered resources.
[INFO] Copying 11 resources
[INFO] Copying 3 resources
[INFO] 
[INFO] --- wagon-maven-plugin:1.0-beta-5:download (download-test-data) @ openmeetings-web
---
[INFO] Scanning remote file system: https://openmeetings.googlecode.com/svn/repository ...
[INFO] ------------------------------------------------------------------------
[INFO] Reactor Summary:
[INFO] 
[INFO] Openmeetings Parent ............................... SUCCESS [1.237s]
[INFO] Openmeetings Util ................................. SUCCESS [6.311s]
[INFO] Openmeetings DB ................................... SUCCESS [14.072s]
[INFO] Openmeetings Install .............................. SUCCESS [1.296s]
[INFO] Openmeetings Core ................................. SUCCESS [13.463s]
[INFO] Openmeetings Service .............................. SUCCESS [1.606s]
[INFO] Openmeetings Webservices .......................... SUCCESS [10.717s]
[INFO] Openmeetings Web .................................. FAILURE [23.031s]
[INFO] ------------------------------------------------------------------------
[INFO] BUILD FAILURE
[INFO] ------------------------------------------------------------------------
[INFO] Total time: 1:12.559s
[INFO] Finished at: Mon May 05 04:02:21 UTC 2014
[INFO] Final Memory: 52M/303M
[INFO] ------------------------------------------------------------------------
[ERROR] Failed to execute goal org.codehaus.mojo:wagon-maven-plugin:1.0-beta-5:download (download-test-data)
on project openmeetings-web: Execution download-test-data of goal org.codehaus.mojo:wagon-maven-plugin:1.0-beta-5:download
failed: A required class was missing while executing org.codehaus.mojo:wagon-maven-plugin:1.0-beta-5:download:
org/apache/commons/io/IOUtils
[ERROR] -----------------------------------------------------
[ERROR] realm =    plugin>org.codehaus.mojo:wagon-maven-plugin:1.0-beta-5
[ERROR] strategy = org.codehaus.plexus.classworlds.strategy.SelfFirstStrategy
[ERROR] urls[0] = file:/home/jenkins/.m2/repository/org/codehaus/mojo/wagon-maven-plugin/1.0-beta-5/wagon-maven-plugin-1.0-beta-5.jar
[ERROR] urls[1] = file:/home/jenkins/.m2/repository/org/codehaus/plexus/plexus-interpolation/1.11/plexus-interpolation-1.11.jar
[ERROR] urls[2] = file:/home/jenkins/.m2/repository/backport-util-concurrent/backport-util-concurrent/3.1/backport-util-concurrent-3.1.jar
[ERROR] urls[3] = file:/home/jenkins/.m2/repository/org/slf4j/slf4j-jdk14/1.5.6/slf4j-jdk14-1.5.6.jar
[ERROR] urls[4] = file:/home/jenkins/.m2/repository/org/slf4j/slf4j-api/1.5.6/slf4j-api-1.5.6.jar
[ERROR] urls[5] = file:/home/jenkins/.m2/repository/org/slf4j/jcl-over-slf4j/1.5.6/jcl-over-slf4j-1.5.6.jar
[ERROR] urls[6] = file:/home/jenkins/.m2/repository/org/apache/maven/reporting/maven-reporting-api/2.2.1/maven-reporting-api-2.2.1.jar
[ERROR] urls[7] = file:/home/jenkins/.m2/repository/org/apache/maven/doxia/doxia-sink-api/1.1/doxia-sink-api-1.1.jar
[ERROR] urls[8] = file:/home/jenkins/.m2/repository/org/apache/maven/doxia/doxia-logging-api/1.1/doxia-logging-api-1.1.jar
[ERROR] urls[9] = file:/home/jenkins/.m2/repository/org/codehaus/plexus/plexus-interactivity-api/1.0-alpha-4/plexus-interactivity-api-1.0-alpha-4.jar
[ERROR] urls[10] = file:/home/jenkins/.m2/repository/org/sonatype/plexus/plexus-sec-dispatcher/1.3/plexus-sec-dispatcher-1.3.jar
[ERROR] urls[11] = file:/home/jenkins/.m2/repository/org/sonatype/plexus/plexus-cipher/1.4/plexus-cipher-1.4.jar
[ERROR] urls[12] = file:/home/jenkins/.m2/repository/commons-cli/commons-cli/1.2/commons-cli-1.2.jar
[ERROR] urls[13] = file:/home/jenkins/.m2/repository/org/codehaus/plexus/plexus-utils/1.5.6/plexus-utils-1.5.6.jar
[ERROR] urls[14] = file:/home/jenkins/.m2/repository/org/apache/maven/shared/file-management/1.2.1/file-management-1.2.1.jar
[ERROR] urls[15] = file:/home/jenkins/.m2/repository/org/apache/maven/shared/maven-shared-io/1.1/maven-shared-io-1.1.jar
[ERROR] Number of foreign imports: 1
[ERROR] import: Entry[import  from realm ClassRealm[project>org.apache.openmeetings:openmeetings-parent:3.1.0-SNAPSHOT,
parent: ClassRealm[maven.api, parent: null]]]
[ERROR] 
[ERROR] -----------------------------------------------------: org.apache.commons.io.IOUtils
[ERROR] -> [Help 1]
[ERROR] 
[ERROR] To see the full stack trace of the errors, re-run Maven with the -e switch.
[ERROR] Re-run Maven using the -X switch to enable full debug logging.
[ERROR] 
[ERROR] For more information about the errors and possible solutions, please read the following
articles:
[ERROR] [Help 1] http://cwiki.apache.org/confluence/display/MAVEN/PluginContainerException
[ERROR] 
[ERROR] After correcting the problems, you can resume the build with the command
[ERROR]   mvn <goals> -rf :openmeetings-web
Build step 'Invoke top-level Maven targets' marked build as failure
Archiving artifacts

Mime
View raw message