openmeetings-dev mailing list archives

Site index · List index
Message view « Date » · « Thread »
Top « Date » · « Thread »
From Apache Jenkins Server <jenk...@builds.apache.org>
Subject Build failed in Jenkins: Openmeetings #422
Date Tue, 26 Mar 2013 00:22:39 GMT
See <https://builds.apache.org/job/openmeetings/422/changes>

Changes:

[solomax] Build: dist-bin target is modified to run jUnit tests on each build

[solomax] [OPENMEETINGS-460] typos are fixed

[solomax] [OPENMEETINGS-586] Import: ownerId is replaces with actual ownerId

[solomax] HTML5: AjaxTimerBehavior is added to the calendar to perform auto-refresh every
10 seconds

------------------------------------------
[...truncated 8262 lines...]
	---------------------------------------------------------------------
[ivy:retrieve] :: retrieving :: apache#openmeetings
[ivy:retrieve] 	confs: [openlaszlo46]
[ivy:retrieve] 	1 artifacts copied, 0 already retrieved (115937kB/452ms)

compile.laszlo.main.debug.as3:

-compile.flash:
     [java] Compiling: main.as3.lzx to maindebug.as3.swf11.swf

compile.laszlo.main.as3:

-compile.flash:
     [java] Compiling: main.as3.lzx to main.as3.swf11.swf

-retrieve-openlaszlo:

-check-ivy-installed:

-download-ivy:

-install-ivy:

-retrieve:
     [echo] Ivy conf name: openlaszlo, destination: <https://builds.apache.org/job/openmeetings/ws/singlewebapp/build/openlaszlo>
[ivy:resolve] :: Apache Ivy 2.3.0 - 20130110142753 :: http://ant.apache.org/ivy/ ::
[ivy:resolve] :: loading settings :: file = <https://builds.apache.org/job/openmeetings/ws/singlewebapp/ivysettings.xml>
[ivy:resolve] :: resolving dependencies :: apache#openmeetings;working@vesta.apache.org [not
transitive]
[ivy:resolve] 	confs: [openlaszlo]
[ivy:resolve] 	found openlaszlo#openlaszlo;4.9 in googlecode
[ivy:resolve] downloading http://openlaszlo-openmeetings-integration.googlecode.com/svn/repository/openlaszlo-4.9.tgz
...
[ivy:resolve] .................................................................................................................................................................................................................................................................................................................................................................................................................................................................................................................................................................................................................................................................................................................................................................................................................................................................................................................................................................................................................................................................................................................................................................................................................................................................................................................................................................................................................................................................................................................................................................................................................................................................................................................................................................................................................................................................................................................................................................................................................................................................................................................................................................................................................................................................................................................................................................................................................................................................................................................................................................................................................................................................................................................................................................................................................................................................................................................................................................................................................................................................................................................................................................................................................................................................................................................................................................................................................................................................................................................................................................................................................................................................................................................................................................................................................................................................................................................................................................................................................................................................................................................................................................................................................................................................................................................................................................................................................................................................................................................................................................................................................................................................................................................................................................................................................................................................................................................................................................................................................................................................................................................................................................................................................................................................................................................................................................................................................................................................................................................................................................................................................................................................................................................................................................................................................................................................................
[ivy:resolve] .....................................................................................................................................................................................................................................................................................................................................
(42221kB)

-extract-tgz:
     [echo] Going to extract /home/hudson/.ivy2/cache/openlaszlo/openlaszlo/tgzs/openlaszlo-4.9.tgz
to the <https://builds.apache.org/job/openmeetings/ws/singlewebapp/build>
    [untar] Expanding: /home/hudson/.ivy2/cache/openlaszlo/openlaszlo/tgzs/openlaszlo-4.9.tgz
into <https://builds.apache.org/job/openmeetings/ws/singlewebapp/build>
[ivy:resolve] 	[SUCCESSFUL ] openlaszlo#openlaszlo;4.9!openlaszlo.tgz (1880ms)
[ivy:resolve] :: resolution report :: resolve 1251ms :: artifacts dl 5798ms
	---------------------------------------------------------------------
	|                  |            modules            ||   artifacts   |
	|       conf       | number| search|dwnlded|evicted|| number|dwnlded|
	---------------------------------------------------------------------
	|    openlaszlo    |   1   |   1   |   0   |   0   ||   1   |   1   |
	---------------------------------------------------------------------
[ivy:retrieve] :: retrieving :: apache#openmeetings
[ivy:retrieve] 	confs: [openlaszlo]
[ivy:retrieve] 	1 artifacts copied, 0 already retrieved (42221kB/116ms)

compile.laszlo.main.debug:

-compile.flash:
     [java] Compiling: main.lzx to maindebug.swf8.swf
     [java] Warning: Assignment to free variable curpixel in charts/styles/strokestyle.lzx
(92)
     [java] charts/common/legend.lzx:84:62: an attribute or method named 'datapath' already
is defined on element legenditem
     [java] base/components/omcharts/ompiechart.lzx:34:46: The child node <piechartplotarea
name='plotarea'> conflicts with <attribute name='plotarea' type='expression'> of
<class name='chart'>.  Either use a different name, or if you intend the child to be
assigned to the attribute, declare the attribute type to be `node`.

compile.laszlo.main:

-compile.flash:
     [java] Compiling: main.lzx to main.swf8.swf
     [java] Warning: Assignment to free variable curpixel in charts/styles/strokestyle.lzx
(92)
     [java] charts/common/legend.lzx:84:62: an attribute or method named 'datapath' already
is defined on element legenditem
     [java] base/components/omcharts/ompiechart.lzx:34:46: The child node <piechartplotarea
name='plotarea'> conflicts with <attribute name='plotarea' type='expression'> of
<class name='chart'>.  Either use a different name, or if you intend the child to be
assigned to the attribute, declare the attribute type to be `node`.

compile.laszlo.networktesting.debug:

-compile.flash:
     [java] Compiling: networktesting.lzx to networktestingdebug.swf10.swf
     [java] cleaning working dir: /tmp/lzswf9/./build/networktesting
     [java] Executing compiler: (cd /tmp/lzswf9/./build/networktesting; <https://builds.apache.org/job/openmeetings/ws/singlewebapp/build/openlaszlo/WEB-INF/bin/mxmlc>
-load-config=<https://builds.apache.org/job/openmeetings/ws/singlewebapp/build/openlaszlo/WEB-INF/frameworks/flex-config.xml>
-compiler.show-actionscript-warnings=false -compiler.source-path+=/tmp/lzswf9/./build/networktesting
-debug=true -compiler.headless-server=true -compiler.fonts.advanced-anti-aliasing=true -output
/tmp/lzswf9/./build/networktesting/app.swf -default-size 800 600 -compiler.library-path+=<https://builds.apache.org/job/openmeetings/ws/singlewebapp/build/openlaszlo/lps/includes/lfc/LFC10-debug.swc>
-includes \$debug \$profile \$backtrace \$runtime \$swf7 \$swf8 \$as2 \$swf9 \$swf10 \$as3
\$dhtml \$j2me \$svg \$js1 -target-player=10.0.0 -static-link-runtime-shared-libraries -frame
two LzSpriteApplication -file-specs=/tmp/lzswf9/./build/networktesting/LzPreloader.as)
     [java] compiler output is Loading configuration file <https://builds.apache.org/job/openmeetings/ws/singlewebapp/build/openlaszlo/WEB-INF/frameworks/flex-config.xml>
     [java] /tmp/lzswf9/build/networktesting/app.swf (1136799 bytes)
     [java] 
     [java] compiler output:
     [java] Loading configuration file <https://builds.apache.org/job/openmeetings/ws/singlewebapp/build/openlaszlo/WEB-INF/frameworks/flex-config.xml>
     [java] /tmp/lzswf9/build/networktesting/app.swf (1136799 bytes)
     [java] 
     [java] Done executing compiler

compile.laszlo.networktesting:

-compile.flash:
     [java] Compiling: networktesting.lzx to networktesting.swf10.swf
     [java] cleaning working dir: /tmp/lzswf9/./build/networktesting
     [java] Executing compiler: (cd /tmp/lzswf9/./build/networktesting; <https://builds.apache.org/job/openmeetings/ws/singlewebapp/build/openlaszlo/WEB-INF/bin/mxmlc>
-load-config=<https://builds.apache.org/job/openmeetings/ws/singlewebapp/build/openlaszlo/WEB-INF/frameworks/flex-config.xml>
-compiler.show-actionscript-warnings=false -compiler.source-path+=/tmp/lzswf9/./build/networktesting
-compiler.headless-server=true -compiler.fonts.advanced-anti-aliasing=true -output /tmp/lzswf9/./build/networktesting/app.swf
-default-size 800 600 -compiler.library-path+=<https://builds.apache.org/job/openmeetings/ws/singlewebapp/build/openlaszlo/lps/includes/lfc/LFC10.swc>
-includes \$debug \$profile \$backtrace \$runtime \$swf7 \$swf8 \$as2 \$swf9 \$swf10 \$as3
\$dhtml \$j2me \$svg \$js1 -target-player=10.0.0 -static-link-runtime-shared-libraries -frame
two LzSpriteApplication -file-specs=/tmp/lzswf9/./build/networktesting/LzPreloader.as)
     [java] compiler output is Loading configuration file <https://builds.apache.org/job/openmeetings/ws/singlewebapp/build/openlaszlo/WEB-INF/frameworks/flex-config.xml>
     [java] /tmp/lzswf9/build/networktesting/app.swf (384626 bytes)
     [java] 
     [java] compiler output:
     [java] Loading configuration file <https://builds.apache.org/job/openmeetings/ws/singlewebapp/build/openlaszlo/WEB-INF/frameworks/flex-config.xml>
     [java] /tmp/lzswf9/build/networktesting/app.swf (384626 bytes)
     [java] 
     [java] Done executing compiler

client.only:

-copy-libraries:
     [copy] Copying 11 files to <https://builds.apache.org/job/openmeetings/ws/singlewebapp/dist/red5/lib>
     [copy] Copying 98 files to <https://builds.apache.org/job/openmeetings/ws/singlewebapp/dist/red5/webapps/openmeetings/WEB-INF/lib>

signWebStartJars:
   [genkey] Generating Key for filetest
   [genkey] Generating 1,024 bit DSA key pair and self-signed certificate (SHA1withDSA) with
a validity of 90 days
   [genkey] 	for: CN=Sebastian Wagner, OU=technology, O=openmeetings.apache.org, C=DE
   [genkey] [Storing <https://builds.apache.org/job/openmeetings/ws/singlewebapp/build/filetest.keystore]>
     [copy] Copying 20 files to <https://builds.apache.org/job/openmeetings/ws/singlewebapp/dist/red5/webapps/openmeetings/screensharing>
  [signjar] Signing JAR: <https://builds.apache.org/job/openmeetings/ws/singlewebapp/dist/red5/webapps/openmeetings/screensharing/bcprov-jdk15on-1.47.jar>
to <https://builds.apache.org/job/openmeetings/ws/singlewebapp/dist/red5/webapps/openmeetings/screensharing/bcprov-jdk15on-1.47.jar>
as filetest
  [signjar] 
  [signjar] Warning: 
  [signjar] The signer certificate will expire within six months.
  [signjar] Signing JAR: <https://builds.apache.org/job/openmeetings/ws/singlewebapp/dist/red5/webapps/openmeetings/screensharing/commons-beanutils-1.8.3.jar>
to <https://builds.apache.org/job/openmeetings/ws/singlewebapp/dist/red5/webapps/openmeetings/screensharing/commons-beanutils-1.8.3.jar>
as filetest
  [signjar] 
  [signjar] Warning: 
  [signjar] The signer certificate will expire within six months.
  [signjar] Signing JAR: <https://builds.apache.org/job/openmeetings/ws/singlewebapp/dist/red5/webapps/openmeetings/screensharing/commons-codec-1.6.jar>
to <https://builds.apache.org/job/openmeetings/ws/singlewebapp/dist/red5/webapps/openmeetings/screensharing/commons-codec-1.6.jar>
as filetest
  [signjar] 
  [signjar] Warning: 
  [signjar] The signer certificate will expire within six months.
  [signjar] Signing JAR: <https://builds.apache.org/job/openmeetings/ws/singlewebapp/dist/red5/webapps/openmeetings/screensharing/commons-collections-20040616.jar>
to <https://builds.apache.org/job/openmeetings/ws/singlewebapp/dist/red5/webapps/openmeetings/screensharing/commons-collections-20040616.jar>
as filetest
  [signjar] 
  [signjar] Warning: 
  [signjar] The signer certificate will expire within six months.
  [signjar] Signing JAR: <https://builds.apache.org/job/openmeetings/ws/singlewebapp/dist/red5/webapps/openmeetings/screensharing/commons-lang3-3.1.jar>
to <https://builds.apache.org/job/openmeetings/ws/singlewebapp/dist/red5/webapps/openmeetings/screensharing/commons-lang3-3.1.jar>
as filetest
  [signjar] 
  [signjar] Warning: 
  [signjar] The signer certificate will expire within six months.
  [signjar] Signing JAR: <https://builds.apache.org/job/openmeetings/ws/singlewebapp/dist/red5/webapps/openmeetings/screensharing/ehcache-core-2.5.0.jar>
to <https://builds.apache.org/job/openmeetings/ws/singlewebapp/dist/red5/webapps/openmeetings/screensharing/ehcache-core-2.5.0.jar>
as filetest
  [signjar] 
  [signjar] Warning: 
  [signjar] The signer certificate will expire within six months.
  [signjar] Signing JAR: <https://builds.apache.org/job/openmeetings/ws/singlewebapp/dist/red5/webapps/openmeetings/screensharing/httpclient-4.2.1.jar>
to <https://builds.apache.org/job/openmeetings/ws/singlewebapp/dist/red5/webapps/openmeetings/screensharing/httpclient-4.2.1.jar>
as filetest
  [signjar] 
  [signjar] Warning: 
  [signjar] The signer certificate will expire within six months.
  [signjar] Signing JAR: <https://builds.apache.org/job/openmeetings/ws/singlewebapp/dist/red5/webapps/openmeetings/screensharing/httpcore-4.2.1.jar>
to <https://builds.apache.org/job/openmeetings/ws/singlewebapp/dist/red5/webapps/openmeetings/screensharing/httpcore-4.2.1.jar>
as filetest
  [signjar] 
  [signjar] Warning: 
  [signjar] The signer certificate will expire within six months.
  [signjar] Signing JAR: <https://builds.apache.org/job/openmeetings/ws/singlewebapp/dist/red5/webapps/openmeetings/screensharing/jcl-over-slf4j-1.7.2.jar>
to <https://builds.apache.org/job/openmeetings/ws/singlewebapp/dist/red5/webapps/openmeetings/screensharing/jcl-over-slf4j-1.7.2.jar>
as filetest
  [signjar] 
  [signjar] Warning: 
  [signjar] The signer certificate will expire within six months.
  [signjar] Signing JAR: <https://builds.apache.org/job/openmeetings/ws/singlewebapp/dist/red5/webapps/openmeetings/screensharing/logback-classic-1.0.9.jar>
to <https://builds.apache.org/job/openmeetings/ws/singlewebapp/dist/red5/webapps/openmeetings/screensharing/logback-classic-1.0.9.jar>
as filetest
  [signjar] 
  [signjar] Warning: 
  [signjar] The signer certificate will expire within six months.
  [signjar] Signing JAR: <https://builds.apache.org/job/openmeetings/ws/singlewebapp/dist/red5/webapps/openmeetings/screensharing/logback-core-1.0.9.jar>
to <https://builds.apache.org/job/openmeetings/ws/singlewebapp/dist/red5/webapps/openmeetings/screensharing/logback-core-1.0.9.jar>
as filetest
  [signjar] 
  [signjar] Warning: 
  [signjar] The signer certificate will expire within six months.
  [signjar] Signing JAR: <https://builds.apache.org/job/openmeetings/ws/singlewebapp/dist/red5/webapps/openmeetings/screensharing/mina-core-2.0.7.jar>
to <https://builds.apache.org/job/openmeetings/ws/singlewebapp/dist/red5/webapps/openmeetings/screensharing/mina-core-2.0.7.jar>
as filetest
  [signjar] 
  [signjar] Warning: 
  [signjar] The signer certificate will expire within six months.
  [signjar] Signing JAR: <https://builds.apache.org/job/openmeetings/ws/singlewebapp/dist/red5/webapps/openmeetings/screensharing/openmeetings-screenshare-3.0.0-SNAPSHOT.jar>
to <https://builds.apache.org/job/openmeetings/ws/singlewebapp/dist/red5/webapps/openmeetings/screensharing/openmeetings-screenshare-3.0.0-SNAPSHOT.jar>
as filetest
  [signjar] 
  [signjar] Warning: 
  [signjar] The signer certificate will expire within six months.
  [signjar] Signing JAR: <https://builds.apache.org/job/openmeetings/ws/singlewebapp/dist/red5/webapps/openmeetings/screensharing/red5-client-1.0.2-SNAPSHOT.jar>
to <https://builds.apache.org/job/openmeetings/ws/singlewebapp/dist/red5/webapps/openmeetings/screensharing/red5-client-1.0.2-SNAPSHOT.jar>
as filetest
  [signjar] 
  [signjar] Warning: 
  [signjar] The signer certificate will expire within six months.
  [signjar] Signing JAR: <https://builds.apache.org/job/openmeetings/ws/singlewebapp/dist/red5/webapps/openmeetings/screensharing/red5-server.jar>
to <https://builds.apache.org/job/openmeetings/ws/singlewebapp/dist/red5/webapps/openmeetings/screensharing/red5-server.jar>
as filetest
  [signjar] 
  [signjar] Warning: 
  [signjar] The signer certificate will expire within six months.
  [signjar] Signing JAR: <https://builds.apache.org/job/openmeetings/ws/singlewebapp/dist/red5/webapps/openmeetings/screensharing/slf4j-api-1.7.2.jar>
to <https://builds.apache.org/job/openmeetings/ws/singlewebapp/dist/red5/webapps/openmeetings/screensharing/slf4j-api-1.7.2.jar>
as filetest
  [signjar] 
  [signjar] Warning: 
  [signjar] The signer certificate will expire within six months.
  [signjar] Signing JAR: <https://builds.apache.org/job/openmeetings/ws/singlewebapp/dist/red5/webapps/openmeetings/screensharing/spring-beans-3.1.1.RELEASE.jar>
to <https://builds.apache.org/job/openmeetings/ws/singlewebapp/dist/red5/webapps/openmeetings/screensharing/spring-beans-3.1.1.RELEASE.jar>
as filetest
  [signjar] 
  [signjar] Warning: 
  [signjar] The signer certificate will expire within six months.
  [signjar] Signing JAR: <https://builds.apache.org/job/openmeetings/ws/singlewebapp/dist/red5/webapps/openmeetings/screensharing/spring-context-3.1.1.RELEASE.jar>
to <https://builds.apache.org/job/openmeetings/ws/singlewebapp/dist/red5/webapps/openmeetings/screensharing/spring-context-3.1.1.RELEASE.jar>
as filetest
  [signjar] 
  [signjar] Warning: 
  [signjar] The signer certificate will expire within six months.
  [signjar] Signing JAR: <https://builds.apache.org/job/openmeetings/ws/singlewebapp/dist/red5/webapps/openmeetings/screensharing/spring-core-3.1.1.RELEASE.jar>
to <https://builds.apache.org/job/openmeetings/ws/singlewebapp/dist/red5/webapps/openmeetings/screensharing/spring-core-3.1.1.RELEASE.jar>
as filetest
  [signjar] 
  [signjar] Warning: 
  [signjar] The signer certificate will expire within six months.

dist:

-dist-test-no-clean:

test:
     [echo] Backup file backup_v_1_4_rc1_r3326.zip does not exists. Downloading ...
      [get] Getting: http://openmeetings.googlecode.com/svn/repository/backup_v_1_4_rc1_r3326.zip
      [get] To: <https://builds.apache.org/job/openmeetings/ws/singlewebapp/build/lib/junit/backups/backup_v_1_4_rc1_r3326.zip>
     [echo] Backup file backup_v_1_5_rc1_r3393.zip does not exists. Downloading ...
      [get] Getting: http://openmeetings.googlecode.com/svn/repository/backup_v_1_5_rc1_r3393.zip
      [get] To: <https://builds.apache.org/job/openmeetings/ws/singlewebapp/build/lib/junit/backups/backup_v_1_5_rc1_r3393.zip>
     [echo] Backup file backup_v_1_6_2_r3675.zip does not exists. Downloading ...
      [get] Getting: http://openmeetings.googlecode.com/svn/repository/backup_v_1_6_2_r3675.zip
      [get] To: <https://builds.apache.org/job/openmeetings/ws/singlewebapp/build/lib/junit/backups/backup_v_1_6_2_r3675.zip>
     [echo] Backup file backup_v_1_7_0_r3822.zip does not exists. Downloading ...
      [get] Getting: http://openmeetings.googlecode.com/svn/repository/backup_v_1_7_0_r3822.zip
      [get] To: <https://builds.apache.org/job/openmeetings/ws/singlewebapp/build/lib/junit/backups/backup_v_1_7_0_r3822.zip>
     [echo] Backup file backup_v_1_8_8_r4555.zip does not exists. Downloading ...
      [get] Getting: http://openmeetings.googlecode.com/svn/repository/backup_v_1_8_8_r4555.zip
      [get] To: <https://builds.apache.org/job/openmeetings/ws/singlewebapp/build/lib/junit/backups/backup_v_1_8_8_r4555.zip>
     [echo] Backup file backup_v_1_9_1_r4707.zip does not exists. Downloading ...
      [get] Getting: http://openmeetings.googlecode.com/svn/repository/backup_v_1_9_1_r4707.zip
      [get] To: <https://builds.apache.org/job/openmeetings/ws/singlewebapp/build/lib/junit/backups/backup_v_1_9_1_r4707.zip>
     [echo] Backup file backup_v_2_0_0_r1361497.zip does not exists. Downloading ...
      [get] Getting: http://openmeetings.googlecode.com/svn/repository/backup_v_2_0_0_r1361497.zip
      [get] To: <https://builds.apache.org/job/openmeetings/ws/singlewebapp/build/lib/junit/backups/backup_v_2_0_0_r1361497.zip>
    [junit] Running org.apache.openmeetings.test.TestConnection
    [junit] Tests run: 1, Failures: 0, Errors: 0, Time elapsed: 22.504 sec
    [junit] Running org.apache.openmeetings.test.backup.TestOldBackups
FATAL: hudson.remoting.RequestAbortedException: hudson.remoting.Channel$OrderlyShutdown: java.util.concurrent.TimeoutException:
Ping started on 1364257021843 hasn't completed at 1364257261843
hudson.remoting.RequestAbortedException: hudson.remoting.RequestAbortedException: hudson.remoting.Channel$OrderlyShutdown:
java.util.concurrent.TimeoutException: Ping started on 1364257021843 hasn't completed at 1364257261843
	at hudson.remoting.Request.call(Request.java:174)
	at hudson.remoting.Channel.call(Channel.java:672)
	at hudson.remoting.RemoteInvocationHandler.invoke(RemoteInvocationHandler.java:158)
	at sun.proxy.$Proxy39.join(Unknown Source)
	at hudson.Launcher$RemoteLauncher$ProcImpl.join(Launcher.java:915)
	at hudson.Launcher$ProcStarter.join(Launcher.java:360)
	at hudson.tasks.Ant.perform(Ant.java:217)
	at hudson.tasks.BuildStepMonitor$1.perform(BuildStepMonitor.java:19)
	at hudson.model.AbstractBuild$AbstractBuildExecution.perform(AbstractBuild.java:810)
	at hudson.model.Build$BuildExecution.build(Build.java:199)
	at hudson.model.Build$BuildExecution.doRun(Build.java:160)
	at hudson.model.AbstractBuild$AbstractBuildExecution.run(AbstractBuild.java:592)
	at hudson.model.Run.execute(Run.java:1568)
	at hudson.model.FreeStyleBuild.run(FreeStyleBuild.java:46)
	at hudson.model.ResourceController.execute(ResourceController.java:88)
	at hudson.model.Executor.run(Executor.java:236)
Caused by: hudson.remoting.RequestAbortedException: hudson.remoting.Channel$OrderlyShutdown:
java.util.concurrent.TimeoutException: Ping started on 1364257021843 hasn't completed at 1364257261843
	at hudson.remoting.Request.abort(Request.java:299)
	at hudson.remoting.Channel.terminate(Channel.java:732)
	at hudson.remoting.Channel$CloseCommand.execute(Channel.java:850)
	at hudson.remoting.Channel$2.handle(Channel.java:435)
	at hudson.remoting.SynchronousCommandTransport$ReaderThread.run(SynchronousCommandTransport.java:60)
Caused by: hudson.remoting.Channel$OrderlyShutdown: java.util.concurrent.TimeoutException:
Ping started on 1364257021843 hasn't completed at 1364257261843
	... 3 more
Caused by: Command close created at
	at hudson.remoting.Command.<init>(Command.java:56)
	at hudson.remoting.Channel$CloseCommand.<init>(Channel.java:844)
	at hudson.remoting.Channel$CloseCommand.<init>(Channel.java:842)
	at hudson.remoting.Channel.close(Channel.java:909)
	at hudson.slaves.ChannelPinger$1.onDead(ChannelPinger.java:110)
	at hudson.remoting.PingThread.ping(PingThread.java:120)
	at hudson.remoting.PingThread.run(PingThread.java:81)
Caused by: java.util.concurrent.TimeoutException: Ping started on 1364257021843 hasn't completed
at 1364257261843
	... 2 more

Mime
View raw message