openmeetings-dev mailing list archives

Site index · List index
Message view « Date » · « Thread »
Top « Date » · « Thread »
From Apache Jenkins Server <jenk...@builds.apache.org>
Subject Build failed in Jenkins: Openmeetings #423
Date Tue, 26 Mar 2013 03:23:36 GMT
See <https://builds.apache.org/job/openmeetings/423/>

------------------------------------------
[...truncated 8312 lines...]

signWebStartJars:
   [genkey] Generating Key for filetest
   [genkey] Generating 1,024 bit DSA key pair and self-signed certificate (SHA1withDSA) with
a validity of 90 days
   [genkey] 	for: CN=Sebastian Wagner, OU=technology, O=openmeetings.apache.org, C=DE
   [genkey] [Storing <https://builds.apache.org/job/openmeetings/ws/singlewebapp/build/filetest.keystore]>
     [copy] Copying 20 files to <https://builds.apache.org/job/openmeetings/ws/singlewebapp/dist/red5/webapps/openmeetings/screensharing>
  [signjar] Signing JAR: <https://builds.apache.org/job/openmeetings/ws/singlewebapp/dist/red5/webapps/openmeetings/screensharing/bcprov-jdk15on-1.47.jar>
to <https://builds.apache.org/job/openmeetings/ws/singlewebapp/dist/red5/webapps/openmeetings/screensharing/bcprov-jdk15on-1.47.jar>
as filetest
  [signjar] 
  [signjar] Warning: 
  [signjar] The signer certificate will expire within six months.
  [signjar] Signing JAR: <https://builds.apache.org/job/openmeetings/ws/singlewebapp/dist/red5/webapps/openmeetings/screensharing/commons-beanutils-1.8.3.jar>
to <https://builds.apache.org/job/openmeetings/ws/singlewebapp/dist/red5/webapps/openmeetings/screensharing/commons-beanutils-1.8.3.jar>
as filetest
  [signjar] 
  [signjar] Warning: 
  [signjar] The signer certificate will expire within six months.
  [signjar] Signing JAR: <https://builds.apache.org/job/openmeetings/ws/singlewebapp/dist/red5/webapps/openmeetings/screensharing/commons-codec-1.6.jar>
to <https://builds.apache.org/job/openmeetings/ws/singlewebapp/dist/red5/webapps/openmeetings/screensharing/commons-codec-1.6.jar>
as filetest
  [signjar] 
  [signjar] Warning: 
  [signjar] The signer certificate will expire within six months.
  [signjar] Signing JAR: <https://builds.apache.org/job/openmeetings/ws/singlewebapp/dist/red5/webapps/openmeetings/screensharing/commons-collections-20040616.jar>
to <https://builds.apache.org/job/openmeetings/ws/singlewebapp/dist/red5/webapps/openmeetings/screensharing/commons-collections-20040616.jar>
as filetest
  [signjar] 
  [signjar] Warning: 
  [signjar] The signer certificate will expire within six months.
  [signjar] Signing JAR: <https://builds.apache.org/job/openmeetings/ws/singlewebapp/dist/red5/webapps/openmeetings/screensharing/commons-lang3-3.1.jar>
to <https://builds.apache.org/job/openmeetings/ws/singlewebapp/dist/red5/webapps/openmeetings/screensharing/commons-lang3-3.1.jar>
as filetest
  [signjar] 
  [signjar] Warning: 
  [signjar] The signer certificate will expire within six months.
  [signjar] Signing JAR: <https://builds.apache.org/job/openmeetings/ws/singlewebapp/dist/red5/webapps/openmeetings/screensharing/ehcache-core-2.5.0.jar>
to <https://builds.apache.org/job/openmeetings/ws/singlewebapp/dist/red5/webapps/openmeetings/screensharing/ehcache-core-2.5.0.jar>
as filetest
  [signjar] 
  [signjar] Warning: 
  [signjar] The signer certificate will expire within six months.
  [signjar] Signing JAR: <https://builds.apache.org/job/openmeetings/ws/singlewebapp/dist/red5/webapps/openmeetings/screensharing/httpclient-4.2.1.jar>
to <https://builds.apache.org/job/openmeetings/ws/singlewebapp/dist/red5/webapps/openmeetings/screensharing/httpclient-4.2.1.jar>
as filetest
  [signjar] 
  [signjar] Warning: 
  [signjar] The signer certificate will expire within six months.
  [signjar] Signing JAR: <https://builds.apache.org/job/openmeetings/ws/singlewebapp/dist/red5/webapps/openmeetings/screensharing/httpcore-4.2.1.jar>
to <https://builds.apache.org/job/openmeetings/ws/singlewebapp/dist/red5/webapps/openmeetings/screensharing/httpcore-4.2.1.jar>
as filetest
  [signjar] 
  [signjar] Warning: 
  [signjar] The signer certificate will expire within six months.
  [signjar] Signing JAR: <https://builds.apache.org/job/openmeetings/ws/singlewebapp/dist/red5/webapps/openmeetings/screensharing/jcl-over-slf4j-1.7.2.jar>
to <https://builds.apache.org/job/openmeetings/ws/singlewebapp/dist/red5/webapps/openmeetings/screensharing/jcl-over-slf4j-1.7.2.jar>
as filetest
  [signjar] 
  [signjar] Warning: 
  [signjar] The signer certificate will expire within six months.
  [signjar] Signing JAR: <https://builds.apache.org/job/openmeetings/ws/singlewebapp/dist/red5/webapps/openmeetings/screensharing/logback-classic-1.0.9.jar>
to <https://builds.apache.org/job/openmeetings/ws/singlewebapp/dist/red5/webapps/openmeetings/screensharing/logback-classic-1.0.9.jar>
as filetest
  [signjar] 
  [signjar] Warning: 
  [signjar] The signer certificate will expire within six months.
  [signjar] Signing JAR: <https://builds.apache.org/job/openmeetings/ws/singlewebapp/dist/red5/webapps/openmeetings/screensharing/logback-core-1.0.9.jar>
to <https://builds.apache.org/job/openmeetings/ws/singlewebapp/dist/red5/webapps/openmeetings/screensharing/logback-core-1.0.9.jar>
as filetest
  [signjar] 
  [signjar] Warning: 
  [signjar] The signer certificate will expire within six months.
  [signjar] Signing JAR: <https://builds.apache.org/job/openmeetings/ws/singlewebapp/dist/red5/webapps/openmeetings/screensharing/mina-core-2.0.7.jar>
to <https://builds.apache.org/job/openmeetings/ws/singlewebapp/dist/red5/webapps/openmeetings/screensharing/mina-core-2.0.7.jar>
as filetest
  [signjar] 
  [signjar] Warning: 
  [signjar] The signer certificate will expire within six months.
  [signjar] Signing JAR: <https://builds.apache.org/job/openmeetings/ws/singlewebapp/dist/red5/webapps/openmeetings/screensharing/openmeetings-screenshare-3.0.0-SNAPSHOT.jar>
to <https://builds.apache.org/job/openmeetings/ws/singlewebapp/dist/red5/webapps/openmeetings/screensharing/openmeetings-screenshare-3.0.0-SNAPSHOT.jar>
as filetest
  [signjar] 
  [signjar] Warning: 
  [signjar] The signer certificate will expire within six months.
  [signjar] Signing JAR: <https://builds.apache.org/job/openmeetings/ws/singlewebapp/dist/red5/webapps/openmeetings/screensharing/red5-client-1.0.2-SNAPSHOT.jar>
to <https://builds.apache.org/job/openmeetings/ws/singlewebapp/dist/red5/webapps/openmeetings/screensharing/red5-client-1.0.2-SNAPSHOT.jar>
as filetest
  [signjar] 
  [signjar] Warning: 
  [signjar] The signer certificate will expire within six months.
  [signjar] Signing JAR: <https://builds.apache.org/job/openmeetings/ws/singlewebapp/dist/red5/webapps/openmeetings/screensharing/red5-server.jar>
to <https://builds.apache.org/job/openmeetings/ws/singlewebapp/dist/red5/webapps/openmeetings/screensharing/red5-server.jar>
as filetest
  [signjar] 
  [signjar] Warning: 
  [signjar] The signer certificate will expire within six months.
  [signjar] Signing JAR: <https://builds.apache.org/job/openmeetings/ws/singlewebapp/dist/red5/webapps/openmeetings/screensharing/slf4j-api-1.7.2.jar>
to <https://builds.apache.org/job/openmeetings/ws/singlewebapp/dist/red5/webapps/openmeetings/screensharing/slf4j-api-1.7.2.jar>
as filetest
  [signjar] 
  [signjar] Warning: 
  [signjar] The signer certificate will expire within six months.
  [signjar] Signing JAR: <https://builds.apache.org/job/openmeetings/ws/singlewebapp/dist/red5/webapps/openmeetings/screensharing/spring-beans-3.1.1.RELEASE.jar>
to <https://builds.apache.org/job/openmeetings/ws/singlewebapp/dist/red5/webapps/openmeetings/screensharing/spring-beans-3.1.1.RELEASE.jar>
as filetest
  [signjar] 
  [signjar] Warning: 
  [signjar] The signer certificate will expire within six months.
  [signjar] Signing JAR: <https://builds.apache.org/job/openmeetings/ws/singlewebapp/dist/red5/webapps/openmeetings/screensharing/spring-context-3.1.1.RELEASE.jar>
to <https://builds.apache.org/job/openmeetings/ws/singlewebapp/dist/red5/webapps/openmeetings/screensharing/spring-context-3.1.1.RELEASE.jar>
as filetest
  [signjar] 
  [signjar] Warning: 
  [signjar] The signer certificate will expire within six months.
  [signjar] Signing JAR: <https://builds.apache.org/job/openmeetings/ws/singlewebapp/dist/red5/webapps/openmeetings/screensharing/spring-core-3.1.1.RELEASE.jar>
to <https://builds.apache.org/job/openmeetings/ws/singlewebapp/dist/red5/webapps/openmeetings/screensharing/spring-core-3.1.1.RELEASE.jar>
as filetest
  [signjar] 
  [signjar] Warning: 
  [signjar] The signer certificate will expire within six months.

dist:

-dist-test-no-clean:

test:
     [echo] Backup file backup_v_1_4_rc1_r3326.zip does not exists. Downloading ...
      [get] Getting: http://openmeetings.googlecode.com/svn/repository/backup_v_1_4_rc1_r3326.zip
      [get] To: <https://builds.apache.org/job/openmeetings/ws/singlewebapp/build/lib/junit/backups/backup_v_1_4_rc1_r3326.zip>
     [echo] Backup file backup_v_1_5_rc1_r3393.zip does not exists. Downloading ...
      [get] Getting: http://openmeetings.googlecode.com/svn/repository/backup_v_1_5_rc1_r3393.zip
      [get] To: <https://builds.apache.org/job/openmeetings/ws/singlewebapp/build/lib/junit/backups/backup_v_1_5_rc1_r3393.zip>
     [echo] Backup file backup_v_1_6_2_r3675.zip does not exists. Downloading ...
      [get] Getting: http://openmeetings.googlecode.com/svn/repository/backup_v_1_6_2_r3675.zip
      [get] To: <https://builds.apache.org/job/openmeetings/ws/singlewebapp/build/lib/junit/backups/backup_v_1_6_2_r3675.zip>
     [echo] Backup file backup_v_1_7_0_r3822.zip does not exists. Downloading ...
      [get] Getting: http://openmeetings.googlecode.com/svn/repository/backup_v_1_7_0_r3822.zip
      [get] To: <https://builds.apache.org/job/openmeetings/ws/singlewebapp/build/lib/junit/backups/backup_v_1_7_0_r3822.zip>
     [echo] Backup file backup_v_1_8_8_r4555.zip does not exists. Downloading ...
      [get] Getting: http://openmeetings.googlecode.com/svn/repository/backup_v_1_8_8_r4555.zip
      [get] To: <https://builds.apache.org/job/openmeetings/ws/singlewebapp/build/lib/junit/backups/backup_v_1_8_8_r4555.zip>
     [echo] Backup file backup_v_1_9_1_r4707.zip does not exists. Downloading ...
      [get] Getting: http://openmeetings.googlecode.com/svn/repository/backup_v_1_9_1_r4707.zip
      [get] To: <https://builds.apache.org/job/openmeetings/ws/singlewebapp/build/lib/junit/backups/backup_v_1_9_1_r4707.zip>
     [echo] Backup file backup_v_2_0_0_r1361497.zip does not exists. Downloading ...
      [get] Getting: http://openmeetings.googlecode.com/svn/repository/backup_v_2_0_0_r1361497.zip
      [get] To: <https://builds.apache.org/job/openmeetings/ws/singlewebapp/build/lib/junit/backups/backup_v_2_0_0_r1361497.zip>
    [junit] Running org.apache.openmeetings.test.TestConnection
    [junit] Tests run: 1, Failures: 0, Errors: 0, Time elapsed: 0.219 sec
    [junit] Running org.apache.openmeetings.test.backup.TestOldBackups
    [junit] Tests run: 1, Failures: 0, Errors: 0, Time elapsed: 142.709 sec
    [junit] 03:23:09.165 [org.springframework.scheduling.quartz.SchedulerFactoryBean#0_QuartzSchedulerThread]
DEBUG o.quartz.core.QuartzSchedulerThread - batch acquisition of 0 triggers
    [junit] Running org.apache.openmeetings.test.calendar.TestAppointmentAddAppointment
    [junit] Tests run: 1, Failures: 0, Errors: 0, Time elapsed: 9.628 sec
    [junit] Running org.apache.openmeetings.test.calendar.TestAppointmentSchedulerTask
    [junit] Tests run: 1, Failures: 0, Errors: 0, Time elapsed: 0.029 sec
    [junit] Running org.apache.openmeetings.test.calendar.TestDatabaseStructureAppointment
    [junit] Tests run: 1, Failures: 0, Errors: 0, Time elapsed: 0.214 sec
    [junit] Running org.apache.openmeetings.test.calendar.TestDatabaseStructureAppointmentReminderTyp
    [junit] Tests run: 1, Failures: 0, Errors: 0, Time elapsed: 1.745 sec
    [junit] Running org.apache.openmeetings.test.calendar.TestDatabaseStructureCategory
    [junit] Tests run: 1, Failures: 0, Errors: 0, Time elapsed: 0.108 sec
    [junit] Running org.apache.openmeetings.test.calendar.TestDatabaseStructureGetAppointmentByRange
    [junit] Tests run: 1, Failures: 0, Errors: 0, Time elapsed: 0.134 sec
    [junit] Running org.apache.openmeetings.test.calendar.TestDatabaseStructureGetUserStart
    [junit] Tests run: 1, Failures: 0, Errors: 0, Time elapsed: 0.016 sec
    [junit] Running org.apache.openmeetings.test.calendar.TestDatabaseStructureMeetingMember
    [junit] Tests run: 1, Failures: 0, Errors: 0, Time elapsed: 0.053 sec
    [junit] Running org.apache.openmeetings.test.calendar.TestDatabaseStructureUsersSearch
    [junit] Tests run: 1, Failures: 0, Errors: 0, Time elapsed: 0.13 sec
    [junit] Running org.apache.openmeetings.test.calendar.TestGetAppointment
    [junit] Tests run: 1, Failures: 0, Errors: 0, Time elapsed: 0.03 sec
    [junit] Running org.apache.openmeetings.test.calendar.TestSendIcalMessage
    [junit] Tests run: 1, Failures: 0, Errors: 0, Time elapsed: 0.437 sec
    [junit] Running org.apache.openmeetings.test.chat.TestChatLinking
    [junit] Tests run: 1, Failures: 0, Errors: 0, Time elapsed: 0.007 sec
    [junit] Running org.apache.openmeetings.test.config.TestConfig
    [junit] Tests run: 2, Failures: 0, Errors: 0, Time elapsed: 0.089 sec
    [junit] Running org.apache.openmeetings.test.domain.TestAddGroup
    [junit] Tests run: 1, Failures: 0, Errors: 0, Time elapsed: 0.212 sec
    [junit] Running org.apache.openmeetings.test.domain.TestUserGroupAggregation
    [junit] Tests run: 1, Failures: 0, Errors: 0, Time elapsed: 0.093 sec
    [junit] Running org.apache.openmeetings.test.emotes.TestChatParsing
    [junit] Tests run: 1, Failures: 0, Errors: 0, Time elapsed: 0.017 sec
    [junit] Running org.apache.openmeetings.test.emotes.TestConvertGifs
    [junit] Tests run: 2, Failures: 0, Errors: 0, Time elapsed: 0.245 sec
    [junit] Running org.apache.openmeetings.test.gui.TestGui
    [junit] Tests run: 1, Failures: 0, Errors: 0, Time elapsed: 0.003 sec
    [junit] Running org.apache.openmeetings.test.jai.TestInterpolation
    [junit] Tests run: 1, Failures: 0, Errors: 0, Time elapsed: 0.018 sec
    [junit] Running org.apache.openmeetings.test.jai.TestSVGTextExporterArrow
    [junit] Tests run: 1, Failures: 0, Errors: 0, Time elapsed: 0.785 sec
    [junit] Running org.apache.openmeetings.test.labels.TestLabels
    [junit] Tests run: 1, Failures: 0, Errors: 0, Time elapsed: 0.765 sec
    [junit] Running org.apache.openmeetings.test.library.TestFileParser
    [junit] Tests run: 1, Failures: 0, Errors: 0, Time elapsed: 0.033 sec
    [junit] Running org.apache.openmeetings.test.navi.TestNavi
    [junit] Tests run: 1, Failures: 0, Errors: 0, Time elapsed: 1.038 sec
    [junit] Running org.apache.openmeetings.test.poll.TestClientListManager
    [junit] Tests run: 1, Failures: 0, Errors: 0, Time elapsed: 0.028 sec
    [junit] Running org.apache.openmeetings.test.poll.TestPollManagement
    [junit] Tests run: 1, Failures: 0, Errors: 0, Time elapsed: 0.058 sec
    [junit] Running org.apache.openmeetings.test.rdc.TestKeyCodesNumber
    [junit] Tests run: 1, Failures: 0, Errors: 0, Time elapsed: 0.024 sec
    [junit] Running org.apache.openmeetings.test.rdc.TestReadKeyCodesNumber
    [junit] Tests run: 2, Failures: 0, Errors: 0, Time elapsed: 0.013 sec
    [junit] Running org.apache.openmeetings.test.rss.TestRssLoader
    [junit] Tests run: 1, Failures: 0, Errors: 0, Time elapsed: 0.329 sec
    [junit] Running org.apache.openmeetings.test.session.TestDbSession
    [junit] Tests run: 1, Failures: 0, Errors: 0, Time elapsed: 1.469 sec
    [junit] Running org.apache.openmeetings.test.session.TestDbSessionGetRoomIds
    [junit] Tests run: 1, Failures: 0, Errors: 0, Time elapsed: 0.166 sec
    [junit] Running org.apache.openmeetings.test.session.TestHashMapSession
    [junit] Tests run: 1, Failures: 1, Errors: 0, Time elapsed: 0.094 sec
    [junit] TEST org.apache.openmeetings.test.session.TestHashMapSession FAILED
    [junit] Running org.apache.openmeetings.test.smoke.TestSmokeBasic
    [junit] Tests run: 1, Failures: 0, Errors: 0, Time elapsed: 0.09 sec
    [junit] Running org.apache.openmeetings.test.user.TestStateToLower
    [junit] Tests run: 1, Failures: 0, Errors: 0, Time elapsed: 0.033 sec
    [junit] Running org.apache.openmeetings.test.user.TestUserOrganisation
    [junit] Tests run: 2, Failures: 0, Errors: 0, Time elapsed: 0.345 sec
    [junit] Running org.apache.openmeetings.test.userdata.TestAuth
    [junit] Tests run: 1, Failures: 0, Errors: 0, Time elapsed: 0.063 sec
    [junit] Running org.apache.openmeetings.test.userdata.TestLogin
    [junit] Tests run: 1, Failures: 0, Errors: 0, Time elapsed: 0.246 sec
    [junit] Running org.apache.openmeetings.test.userdata.TestMD5
    [junit] Tests run: 1, Failures: 0, Errors: 0, Time elapsed: 0.003 sec
    [junit] 03:23:29.783 [Thread-2] INFO  o.s.c.s.GenericApplicationContext - Closing org.springframework.context.support.GenericApplicationContext@aeea66:
startup date [Tue Mar 26 03:20:50 UTC 2013]; root of context hierarchy
    [junit] 03:23:29.784 [Thread-2] DEBUG o.s.b.f.s.DefaultListableBeanFactory - Returning
cached instance of singleton bean 'org.springframework.scheduling.quartz.SchedulerFactoryBean#0'
    [junit] 03:23:29.784 [Thread-2] DEBUG o.s.b.f.s.DefaultListableBeanFactory - Returning
cached instance of singleton bean 'lifecycleProcessor'
    [junit] 03:23:29.784 [Thread-2] DEBUG o.s.b.f.s.DefaultListableBeanFactory - Returning
cached instance of singleton bean 'org.springframework.scheduling.quartz.SchedulerFactoryBean#0'
    [junit] 03:23:29.784 [Thread-2] DEBUG o.s.b.f.s.DefaultListableBeanFactory - Returning
cached instance of singleton bean 'lifecycleProcessor'
    [junit] 03:23:29.784 [Thread-2] INFO  o.s.c.s.DefaultLifecycleProcessor - Stopping beans
in phase 2147483647
    [junit] 03:23:29.787 [Thread-2] DEBUG o.s.c.s.DefaultLifecycleProcessor - Asking bean
'org.springframework.scheduling.quartz.SchedulerFactoryBean#0' of type [class org.springframework.scheduling.quartz.SchedulerFactoryBean]
to stop
    [junit] 03:23:29.788 [Thread-2] INFO  org.quartz.core.QuartzScheduler - Scheduler org.springframework.scheduling.quartz.SchedulerFactoryBean#0_$_NON_CLUSTERED
paused.
    [junit] 03:23:29.791 [Thread-2] DEBUG o.s.c.s.DefaultLifecycleProcessor - Bean 'org.springframework.scheduling.quartz.SchedulerFactoryBean#0'
completed its stop procedure
    [junit] 03:23:29.791 [Thread-2] INFO  o.s.b.f.s.DefaultListableBeanFactory - Destroying
singletons in org.springframework.beans.factory.support.DefaultListableBeanFactory@5c98f3:
defining beans [entityManagerFactory,transactionManager,org.springframework.orm.jpa.support.PersistenceAnnotationBeanPostProcessor#0,jpaTransactionManager,multipartResolver,org.springframework.web.servlet.mvc.method.annotation.RequestMappingHandlerMapping#0,org.springframework.format.support.FormattingConversionServiceFactoryBean#0,org.springframework.web.servlet.mvc.method.annotation.RequestMappingHandlerAdapter#0,org.springframework.web.servlet.handler.MappedInterceptor#0,org.springframework.web.servlet.mvc.method.annotation.ExceptionHandlerExceptionResolver#0,org.springframework.web.servlet.mvc.annotation.ResponseStatusExceptionResolver#0,org.springframework.web.servlet.mvc.support.DefaultHandlerExceptionResolver#0,org.springframework.web.servlet.handler.BeanNameUrlHandlerMapping,org.springframework.web.servlet.mvc.HttpRequestHandlerAdapter,org.springframework.web.servlet.mvc.SimpleControllerHandlerAdapter,org.springframework.aop.config.internalAutoProxyCreator,org.springframework.transaction.annotation.AnnotationTransactionAttributeSource#0,org.springframework.transaction.interceptor.TransactionInterceptor#0,org.springframework.transaction.config.internalTransactionAdvisor,org.springframework.context.annotation.internalConfigurationAnnotationProcessor,org.springframework.context.annotation.internalAutowiredAnnotationProcessor,org.springframework.context.annotation.internalRequiredAnnotationProcessor,org.springframework.context.annotation.internalCommonAnnotationProcessor,org.springframework.context.annotation.internalPersistenceAnnotationProcessor,importController,networkTestingController,screenController,backupImportController,uploadController,web.handler,openmeetings.SessionManager,openmeetings.EmoticonsManager,openmeetings.HashMapStore,whiteBoardObjectListManagerById,whiteBoardObjectSyncManager,openmeetings.DatabaseStore,openmeetings.ServerUtil,xmlcrm.service,printservice.service,pollservice.service,organisationservice.service,meetingmemberservice.service,languageservice.service,invitationservice.service,ldapconfigservice.service,whiteboardservice.service,userservice.service,fileservice.service,openmeetings.FileProcessor,openmeetings.FlvExplorerConverter,errorservice.service,conferenceservice.service,configservice.service,chatservice.service,calendarservice.service,flvrecorderservice.service,openmeetings.FlvRecorderConverterTask,openmeetings.FlvInterviewConverterTask,openmeetings.FlvInterviewReConverterTask,openmeetings.FlvInterviewConverter,openmeetings.FlvRecorderConverter,openmeetings.SlaveHTTPConnectionManager,openmeetings.SessionClearJob,sessionClearJob,triggerSessionClear,openmeetings.MeetingReminderJob,meetingReminderClear,triggerMeetingReminder,testSetupCleanupJob,testSetupCleanup,triggerTestSetupCleanup,mailHandler,resetSendingMailStatus,triggerResetSendingMailStatus,sendMails,triggerSendMails,org.springframework.scheduling.quartz.SchedulerFactoryBean#0,appointmentReminderTypDaoImpl,appointmentCategoryDaoImpl,roommanagement,roomDao,sipDao,organisationmanagement,organisationDao,organisationUserDao,salutationmanagement,errorManagement,navimanagement,pollManagement,omTimeZoneDaoImpl,statemanagement,fieldLanguageDaoImpl,fieldValueDaoImpl,fieldLanguagesValuesDAO,fieldmanagment,configurationDaoImpl,appointmentDao,appointmentLogic,meetingMemberLogic,sessionManagement,userManagement,roomModeratorsDao,conferenceLogDao,conferenceLogTypeDao,emailManagement,fileExplorerItemDao,flvRecordingDao,flvRecordingLogDao,flvRecordingMetaDataDao,flvRecordingMetaDeltaDao,ldapConfigDao,invitationManagement,meetingMemberDao,privateMessageFolderDao,privateMessagesDao,soapLoginDao,userContactsDao,usersDao,serverDao,chatDao,clientDao,mailMessageDao,manageCryptStyle,generateImage,generateThumbs,generatePDF,smsHandler,feedbackManagement,importInitvalues,languageImport,userImport,libraryWmlLoader,loadAtomRssFeed,authLevelManagement,generateSWF,fileUtils,ldapLoginManagement,timezoneUtil,whiteboardManagement,registerUserTemplate,feedbackTemplate,invitationTemplate,requestContactTemplate,requestContactConfirmTemplate,resetPasswordTemplate,taskExecutor,userWebService,roomWebService,fileWebService,calendarWebService,jabberWebService,serverWebService,backupExport,org.springframework.context.annotation.ConfigurationClassPostProcessor$ImportAwareBeanPostProcessor#0];
root of factory hierarchy
    [junit] 03:23:29.792 [Thread-2] DEBUG o.s.b.f.s.DefaultListableBeanFactory - Retrieved
dependent beans for bean 'importInitvalues': [org.apache.openmeetings.test.backup.TestOldBackups,
org.apache.openmeetings.test.calendar.TestAppointmentAddAppointment, org.apache.openmeetings.test.calendar.TestAppointmentSchedulerTask,
org.apache.openmeetings.test.calendar.TestDatabaseStructureAppointment, org.apache.openmeetings.test.calendar.TestDatabaseStructureAppointmentReminderTyp,
org.apache.openmeetings.test.calendar.TestDatabaseStructureCategory, org.apache.openmeetings.test.calendar.TestDatabaseStructureGetAppointmentByRange,
org.apache.openmeetings.test.calendar.TestDatabaseStructureGetUserStart, org.apache.openmeetings.test.calendar.TestDatabaseStructureMeetingMember,
org.apache.openmeetings.test.calendar.TestDatabaseStructureUsersSearch, org.apache.openmeetings.test.calendar.TestGetAppointment,
org.apache.openmeetings.test.calendar.TestSendIcalMessage, org.apache.openmeetings.test.config.TestConfig,
org.apache.openmeetings.test.domain.TestAddGroup, org.apache.openmeetings.test.domain.TestUserGroupAggregation,
org.apache.openmeetings.test.labels.TestLabels, org.apache.openmeetings.test.library.TestFileParser,
org.apache.openmeetings.test.navi.TestNavi, org.apache.openmeetings.test.poll.TestClientListManager,
org.apache.openmeetings.test.poll.TestPollManagement, org.apache.openmeetings.test.rss.TestRssLoader,
org.apache.openmeetings.test.session.TestDbSession, org.apache.openmeetings.test.session.TestDbSessionGetRoomIds,
org.apache.openmeetings.test.session.TestHashMapSession, org.apache.openmeetings.test.smoke.TestSmokeBasic,
org.apache.openmeetings.test.user.TestStateToLower, org.apache.openmeetings.test.user.TestUserOrganisation,
org.apache.openmeetings.test.userdata.TestAuth, org.apache.openmeetings.test.userdata.TestLogin]
    [junit] 03:23:29.795 [Thread-2] DEBUG o.s.b.f.s.DisposableBeanAdapter - Invoking destroy()
on bean with name 'org.springframework.scheduling.quartz.SchedulerFactoryBean#0'
    [junit] 03:23:29.795 [Thread-2] INFO  o.s.s.quartz.SchedulerFactoryBean - Shutting down
Quartz Scheduler
    [junit] 03:23:29.795 [Thread-2] INFO  org.quartz.core.QuartzScheduler - Scheduler org.springframework.scheduling.quartz.SchedulerFactoryBean#0_$_NON_CLUSTERED
shutting down.
    [junit] 03:23:29.795 [Thread-2] INFO  org.quartz.core.QuartzScheduler - Scheduler org.springframework.scheduling.quartz.SchedulerFactoryBean#0_$_NON_CLUSTERED
paused.
    [junit] 03:23:29.795 [Thread-2] DEBUG org.quartz.simpl.SimpleThreadPool - Shutting down
threadpool...
    [junit] 03:23:29.795 [Thread-2] DEBUG org.quartz.simpl.SimpleThreadPool - Shutdown of
threadpool complete.
    [junit] 03:23:29.799 [Thread-2] INFO  org.quartz.core.QuartzScheduler - Scheduler org.springframework.scheduling.quartz.SchedulerFactoryBean#0_$_NON_CLUSTERED
shutdown complete.
    [junit] 03:23:29.810 [Thread-2] DEBUG o.s.b.f.s.DefaultListableBeanFactory - Retrieved
dependent beans for bean 'sessionManagement': [userManagement, whiteboardservice.service,
flvrecorderservice.service, web.handler]
    [junit] 03:23:29.810 [Thread-2] DEBUG o.s.b.f.s.DefaultListableBeanFactory - Retrieved
dependent beans for bean 'userManagement': [whiteboardservice.service, flvrecorderservice.service,
appointmentDao, invitationManagement, meetingMemberLogic, appointmentLogic, roomModeratorsDao,
web.handler]
    [junit] 03:23:29.810 [Thread-2] DEBUG o.s.b.f.s.DefaultListableBeanFactory - Retrieved
dependent beans for bean 'whiteboardservice.service': [web.handler]
    [junit] 03:23:29.810 [Thread-2] DEBUG o.s.b.f.s.DefaultListableBeanFactory - Retrieved
dependent beans for bean 'web.handler': [userManagement, whiteboardservice.service, flvrecorderservice.service,
manageCryptStyle]
    [junit] 03:23:29.810 [Thread-2] DEBUG o.s.b.f.s.DefaultListableBeanFactory - Retrieved
dependent beans for bean 'flvrecorderservice.service': [web.handler]
    [junit] 03:23:29.810 [Thread-2] DEBUG o.s.b.f.s.DefaultListableBeanFactory - Retrieved
dependent beans for bean 'manageCryptStyle': [usersDao, openmeetings.SessionManager, invitationManagement,
sessionManagement]
    [junit] 03:23:29.810 [Thread-2] DEBUG o.s.b.f.s.DefaultListableBeanFactory - Retrieved
dependent beans for bean 'usersDao': [configurationDaoImpl, serverDao, organisationmanagement,
organisationUserDao, appointmentCategoryDaoImpl, appointmentReminderTypDaoImpl, meetingMemberDao,
appointmentDao, invitationManagement, roommanagement]
    [junit] 03:23:29.810 [Thread-2] DEBUG o.s.b.f.s.DefaultListableBeanFactory - Retrieved
dependent beans for bean 'configurationDaoImpl': [usersDao, omTimeZoneDaoImpl, fieldLanguagesValuesDAO,
fieldmanagment, emailManagement, mailHandler, roomDao, openmeetings.FlvRecorderConverter,
openmeetings.FlvInterviewConverter, generateThumbs, appointmentDao, invitationManagement,
smsHandler, invitationTemplate, timezoneUtil, appointmentLogic, roommanagement]
    [junit] 03:23:29.811 [Thread-2] DEBUG o.s.b.f.s.DefaultListableBeanFactory - Retrieved
dependent beans for bean 'omTimeZoneDaoImpl': [appointmentDao, timezoneUtil, invitationManagement,
appointmentLogic]
    [junit] 03:23:29.811 [Thread-2] DEBUG o.s.b.f.s.DefaultListableBeanFactory - Retrieved
dependent beans for bean 'appointmentDao': [meetingMemberDao, invitationManagement, appointmentLogic]
    [junit] 03:23:29.811 [Thread-2] DEBUG o.s.b.f.s.DefaultListableBeanFactory - Retrieved
dependent beans for bean 'meetingMemberDao': [appointmentDao, meetingMemberLogic, appointmentLogic]
    [junit] 03:23:29.811 [Thread-2] DEBUG o.s.b.f.s.DefaultListableBeanFactory - Retrieved
dependent beans for bean 'meetingMemberLogic': [appointmentLogic]
    [junit] 03:23:29.811 [Thread-2] DEBUG o.s.b.f.s.DefaultListableBeanFactory - Retrieved
dependent beans for bean 'appointmentLogic': [invitationManagement, meetingMemberLogic]
    [junit] 03:23:29.811 [Thread-2] DEBUG o.s.b.f.s.DefaultListableBeanFactory - Retrieved
dependent beans for bean 'invitationManagement': [meetingMemberLogic, appointmentLogic]
    [junit] 03:23:29.811 [Thread-2] DEBUG o.s.b.f.s.DefaultListableBeanFactory - Retrieved
dependent beans for bean 'fieldLanguagesValuesDAO': [fieldmanagment]
    [junit] 03:23:29.811 [Thread-2] DEBUG o.s.b.f.s.DefaultListableBeanFactory - Retrieved
dependent beans for bean 'fieldmanagment': [emailManagement, registerUserTemplate, resetPasswordTemplate,
invitationTemplate]
    [junit] 03:23:29.811 [Thread-2] DEBUG o.s.b.f.s.DefaultListableBeanFactory - Retrieved
dependent beans for bean 'roomDao': [roommanagement]
    [junit] 03:23:29.811 [Thread-2] DEBUG o.s.b.f.s.DefaultListableBeanFactory - Retrieved
dependent beans for bean 'openmeetings.FlvRecorderConverter': [openmeetings.FlvRecorderConverterTask]
    [junit] 03:23:29.811 [Thread-2] DEBUG o.s.b.f.s.DefaultListableBeanFactory - Retrieved
dependent beans for bean 'openmeetings.FlvInterviewConverter': [openmeetings.FlvInterviewConverterTask,
openmeetings.FlvInterviewReConverterTask]
    [junit] 03:23:29.812 [Thread-2] DEBUG o.s.b.f.s.DefaultListableBeanFactory - Retrieved
dependent beans for bean 'serverDao': [openmeetings.ServerUtil]
    [junit] 03:23:29.812 [Thread-2] DEBUG o.s.b.f.s.DefaultListableBeanFactory - Retrieved
dependent beans for bean 'openmeetings.ServerUtil': [openmeetings.SessionManager]
    [junit] 03:23:29.812 [Thread-2] DEBUG o.s.b.f.s.DefaultListableBeanFactory - Retrieved
dependent beans for bean 'openmeetings.SessionManager': [sessionManagement]
    [junit] 03:23:29.813 [Thread-2] DEBUG o.s.b.f.s.DisposableBeanAdapter - Invoking destroy()
on bean with name 'taskExecutor'
    [junit] 03:23:29.813 [Thread-2] INFO  o.s.s.c.ThreadPoolTaskExecutor - Shutting down ExecutorService
'taskExecutor'
    [junit] 03:23:29.813 [Thread-2] DEBUG o.s.b.f.s.DefaultListableBeanFactory - Retrieved
dependent beans for bean '(inner bean)#8': [org.springframework.web.servlet.mvc.method.annotation.ExceptionHandlerExceptionResolver#0]
    [junit] 03:23:29.814 [Thread-2] DEBUG o.s.b.f.s.DefaultListableBeanFactory - Retrieved
dependent beans for bean '(inner bean)#1': [org.springframework.web.servlet.mvc.method.annotation.RequestMappingHandlerAdapter#0]
    [junit] 03:23:29.814 [Thread-2] DEBUG o.s.b.f.s.DefaultListableBeanFactory - Retrieved
dependent beans for bean '(inner bean)': [org.springframework.web.servlet.handler.MappedInterceptor#0]
    [junit] 03:23:29.814 [Thread-2] DEBUG o.s.b.f.s.DisposableBeanAdapter - Invoking destroy()
on bean with name 'entityManagerFactory'
    [junit] 03:23:29.814 [Thread-2] INFO  o.s.o.j.LocalEntityManagerFactoryBean - Closing
JPA EntityManagerFactory for persistence unit 'openmeetings'
    [junit] Tests FAILED
[junitreport] Processing <https://builds.apache.org/job/openmeetings/ws/singlewebapp/build/junit/report/TESTS-TestSuites.xml>
to /tmp/null477843045
[junitreport] Loading stylesheet jar:file:/home/jenkins/jenkins-slave/tools/hudson.tasks.Ant_AntInstallation/ant-1.8.3/lib/ant-junit.jar!/org/apache/tools/ant/taskdefs/optional/junit/xsl/junit-frames.xsl
[junitreport] Transform time: 3900ms
[junitreport] Deleting: /tmp/null477843045

BUILD FAILED
<https://builds.apache.org/job/openmeetings/ws/singlewebapp/build.xml>:851: Errors/failures
in JUnit tests.

Total time: 16 minutes 11 seconds
Build step 'Invoke Ant' marked build as failure
Archiving artifacts

Mime
View raw message