openmeetings-dev mailing list archives

Site index · List index
Message view « Date » · « Thread »
Top « Date » · « Thread »
From Alexei Fedotov <alexei.fedo...@gmail.com>
Subject Re: Réf. : Build failed in Jenkins: Openmeetings #22
Date Mon, 02 Apr 2012 11:39:56 GMT
I've got "build back to normal" message already

--
With best regards / с наилучшими пожеланиями,
Alexei Fedotov / Алексей Федотов,
http://dataved.ru/
+7 916 562 8095



On Mon, Apr 2, 2012 at 3:35 PM, Hamdi THABET <hamdi.thabet86@gmail.com>wrote:

>     OM #23 build fail :
>
> [ivy:resolve]   ==== Apache-snapshots: tried
> [ivy:resolve]
> HTTPS://repository.Apache.org/snapshots/org/Apache/axis2/axis2<https://repository.Apache.org/snapshots/org/Apache/axis2/axis2>
> -transport-local/1.7.0-SNAPSHOT/axis2-transport-local-1.7.0-SNAPSHOT.jar
> [ivy:resolve]           [NOT FOUND  ]
> org.Apache.axis2#axis2-transport-local;1.7
> .0-SNAPSHOT!axis2-transport-local.jar(javadoc) (21025ms)
> [ivy:resolve]   ==== Apache-snapshots: tried
> [ivy:resolve]
> HTTPS://repository.Apache.org/snapshots/org/Apache/axis2/axis2<https://repository.Apache.org/snapshots/org/Apache/axis2/axis2>
>
> -transport-local/1.7.0-SNAPSHOT/axis2-transport-local-1.7.0-SNAPSHOT-javadoc.jar
>
> [ivy:resolve]           [NOT FOUND  ]
> org.Apache.axis2#axis2-transport-local;1.7
> .0-SNAPSHOT!axis2-transport-local.jar(source) (21007ms)
> [ivy:resolve]   ==== Apache-snapshots: tried
> [ivy:resolve]
> HTTPS://repository.Apache.org/snapshots/org/Apache/axis2/axis2<https://repository.Apache.org/snapshots/org/Apache/axis2/axis2>
>
> -transport-local/1.7.0-SNAPSHOT/axis2-transport-local-1.7.0-SNAPSHOT-sources.jar
>
> [ivy:resolve]           ::::::::::::::::::::::::::::::::::::::::::::::
> [ivy:resolve]           ::          UNRESOLVED DEPENDENCIES         ::
> [ivy:resolve]           ::::::::::::::::::::::::::::::::::::::::::::::
> [ivy:resolve]           :: org.Apache.axis2#mex;1.7.0-SNAPSHOT: not found
> [ivy:resolve]           :: org.Apache.axis2#axis2-jaxws;1.7.0-SNAPSHOT:
> not foun
> D
> [ivy:resolve]           ::::::::::::::::::::::::::::::::::::::::::::::
> [ivy:resolve]
> [ivy:resolve]           ::::::::::::::::::::::::::::::::::::::::::::::
> [ivy:resolve]           ::              FAILED DOWNLOADS            ::
> [ivy:resolve]           :: ^ see resolution messages for details  ^ ::
> [ivy:resolve]           ::::::::::::::::::::::::::::::::::::::::::::::
> [ivy:resolve]           ::
> org.Apache.axis2#axis2-transport-http;1.7.0-SNAPSHOT!
> Axis2-transport-http.jar(bundle)
> [ivy:resolve]           ::
> org.Apache.axis2#axis2-transport-http;1.7.0-SNAPSHOT!
> Axis2-transport-http.jar(javadoc)
> [ivy:resolve]           ::
> org.Apache.axis2#axis2-transport-http;1.7.0-SNAPSHOT!
> Axis2-transport-http.jar(source)
> [ivy:resolve]           ::
> org.Apache.axis2#axis2-transport-local;1.7.0-SNAPSHOT
> !axis2-transport-local.jar(bundle)
> [ivy:resolve]           ::
> org.Apache.axis2#axis2-transport-local;1.7.0-SNAPSHOT
> !axis2-transport-local.jar(javadoc)
> [ivy:resolve]           ::
> org.Apache.axis2#axis2-transport-local;1.7.0-SNAPSHOT
> !axis2-transport-local.jar(source)
> [ivy:resolve]           ::::::::::::::::::::::::::::::::::::::::::::::
> [ivy:resolve]
> [ivy:resolve] :::: ERRORS
> [ivy:resolve]   SERVER ERROR: Service Temporarily Unavailable URL=
> HTTPS://reposi
>
> Tory.Apache.org/snapshots/org/Apache/axis2/mex/1.7.0-SNAPSHOT/maven-metadata.XML
>
> [ivy:resolve]   SERVER ERROR: Service Temporarily Unavailable URL=
> HTTPS://reposi
>
> Tory.Apache.org/snapshots/org/Apache/axis2/mex/1.7.0-SNAPSHOT/mex-1.7.0-SNAPSHOT
> .pom
> [ivy:resolve]   SERVER ERROR: Service Temporarily Unavailable url=
> https://reposi
>
> tory.apache.org/snapshots/org/Apache/axis2/mex/1.7.0-SNAPSHOT/mex-1.7.0-SNAPSHOT
> .jar
> [ivy:resolve]   SERVER ERROR: Service Temporarily Unavailable URL=
> HTTPS://reposi
>
> Tory.Apache.org/snapshots/org/Apache/axis2/axis2-jaxws/1.7.0-SNAPSHOT/maven-meta
> Data.xml
> [ivy:resolve]   SERVER ERROR: Service Temporarily Unavailable URL=
> HTTPS://reposi
>
> Tory.Apache.org/snapshots/org/Apache/axis2/axis2-jaxws/1.7.0-SNAPSHOT/axis2-jaxw
> S-1.7.0-SNAPSHOT.pom
> [ivy:resolve]   SERVER ERROR: Service Temporarily Unavailable URL=
> HTTPS://reposi
>
> Tory.Apache.org/snapshots/org/Apache/axis2/axis2-jaxws/1.7.0-SNAPSHOT/axis2-jaxw
> S-1.7.0-SNAPSHOT.jar
> [ivy:resolve]   SERVER ERROR: Service Temporarily Unavailable URL=
> HTTPS://reposi
>
> Tory.Apache.org/snapshots/org/Apache/axis2/axis2-transport-http/1.7.0-SNAPSHOT/m
> aven-metadata.xml
> [ivy:resolve]   SERVER ERROR: Service Temporarily Unavailable url=
> https://reposi
>
> tory.apache.org/snapshots/org/apache/axis2/axis2-transport-http/1.7.0-SNAPSHOT/a
> xis2-transport-http-1.7.0-SNAPSHOT-javadoc.jar
> [ivy:resolve]   Server access Error: Network is unreachable: connect
> url=https:/
> /
> repository.apache.org/snapshots/org/apache/axis2/axis2-transport-http/1.7.0-SNA
> PSHOT/axis2-transport-http-1.7.0-SNAPSHOT.jar
> [ivy:resolve]   SERVER ERROR: Service Temporarily Unavailable url=
> https://reposi
>
> tory.apache.org/snapshots/org/apache/axis2/axis2-transport-http/1.7.0-SNAPSHOT/a
> xis2-transport-http-1.7.0-SNAPSHOT-sources.jar
> [ivy:resolve]   Server access Error: Remote host closed connection during
> handsh
> ake url=
> https://repository.apache.org/snapshots/org/apache/axis2/axis2-transport
> -local/1.7.0-SNAPSHOT/maven-metadata.xml
> [ivy:resolve]   Server access Error: Network is unreachable: connect
> url=https:/
> /
> repository.apache.org/snapshots/org/apache/axis2/axis2-transport-local/1.7.0-SN
> APSHOT/axis2-transport-local-1.7.0-SNAPSHOT.jar
> [ivy:resolve]   Server access Error: Network is unreachable: connect
> url=https:/
> /
> repository.apache.org/snapshots/org/apache/axis2/axis2-transport-local/1.7.0-SN
> APSHOT/axis2-transport-local-1.7.0-SNAPSHOT-javadoc.jar
> [ivy:resolve]   Server access Error: Network is unreachable: connect
> url=https:/
> /
> repository.apache.org/snapshots/org/apache/axis2/axis2-transport-local/1.7.0-SN
> APSHOT/axis2-transport-local-1.7.0-SNAPSHOT-sources.jar
>
> [ivy:resolve]
> [ivy:resolve] :: USE VERBOSE OR DEBUG MESSAGE LEVEL FOR MORE DETAILS
>
> BUILD FAILED
> E:\3DNI\PFE\WORK\workspace\CollabMee\build.xml:746: The following error
> occurred
>  while executing this line:
> E:\3DNI\PFE\WORK\workspace\CollabMee\build.xml:692: impossible to resolve
> depend
> encies:
>         resolve failed - see output for details
>
> Total time: 105 minutes 43 seconds
>
> E:\3DNI\PFE\WORK\workspace\CollabMee>ant -DB=postgres
> Buildfile: E:\3DNI\PFE\WORK\workspace\CollabMee\build.xml
>
> clean.classes:
>    [delete] Deleting directory
> E:\3DNI\PFE\WORK\workspace\CollabMee\build\classe
> s\openmeetings
>
> clean.dist:
>    [delete] Deleting directory E:\3DNI\PFE\WORK\workspace\CollabMee\dist
>
> clean:
>
> -java6.check:
>      [echo] Using Java 1.6.0_26 specification: 1.6
>
> prepare.mkdir:
>     [mkdir] Created dir: E:\3DNI\PFE\WORK\workspace\CollabMee\dist
>     [mkdir] Created dir:
> E:\3DNI\PFE\WORK\workspace\CollabMee\build\classes\open
> meetings
>
> -availability-check:
>
> -retrieve-svntask:
>
> -ant-task:
>
> -retrieve-red5:
>
> -retrieve-mainlibs:
>
> -retrieve-om:
>
> -retrieve-dtd-generator:
>
> -retrieve:
>      [echo] Ivy conf name: dtd, destination:
> E:\3DNI\PFE\WORK\workspace\CollabMe
> e/build/lib/dtd-generator
>
> [ivy:resolve] :: Ivy 2.2.0 - 20100923230623 :: http://ant.apache.org/ivy/::
> [ivy:resolve] :: loading settings :: file =
> E:\3DNI\PFE\WORK\workspace\CollabMee
> \ivysettings.xml
> [ivy:resolve] :: resolving dependencies ::
> apache#openmeetings;working@Hamdi [no
> t transitive]
> [ivy:resolve]   confs: [dtd]
> [ivy:resolve]   found com.thaiopensource#trang;20091111 in central
> [ivy:resolve] :: resolution report :: resolve 311ms :: artifacts dl 2ms
>
>
> ---------------------------------------------------------------------
>         |                  |            modules            ||
> artifacts   |
>         |       conf       | number| search|dwnlded|evicted||
> number|dwnlded|
>
> ---------------------------------------------------------------------
>         |        dtd       |   1   |   0   |   0   |   0   ||   1   |
> 0   |
>
> ---------------------------------------------------------------------
> [ivy:retrieve] :: retrieving :: apache#openmeetings
> [ivy:retrieve]  confs: [dtd]
> [ivy:retrieve]  1 artifacts copied, 0 already retrieved (826kB/664ms)
>
> -retrieve-junit:
>
> -retrieve:
>      [echo] Ivy conf name: junit, destination:
> E:\3DNI\PFE\WORK\workspace\Collab
> Mee/build/lib/junit
>
> [ivy:resolve] :: Ivy 2.2.0 - 20100923230623 :: http://ant.apache.org/ivy/::
> [ivy:resolve] :: loading settings :: file =
> E:\3DNI\PFE\WORK\workspace\CollabMee
> \ivysettings.xml
> [ivy:resolve] :: resolving dependencies ::
> apache#openmeetings;working@Hamdi [no
> t transitive]
> [ivy:resolve]   confs: [junit]
> [ivy:resolve]   found junit#junit;4.9 in central
> [ivy:resolve]   found
> org.springframework#org.springframework.test;3.0.6.RELEASE
>  in springsource-release
> [ivy:resolve] :: resolution report :: resolve 346ms :: artifacts dl 3ms
>
>
> ---------------------------------------------------------------------
>         |                  |            modules            ||
> artifacts   |
>         |       conf       | number| search|dwnlded|evicted||
> number|dwnlded|
>
> ---------------------------------------------------------------------
>         |       junit      |   2   |   0   |   0   |   0   ||   2   |
> 0   |
>
> ---------------------------------------------------------------------
> [ivy:retrieve] :: retrieving :: apache#openmeetings
> [ivy:retrieve]  confs: [junit]
> [ivy:retrieve]  2 artifacts copied, 0 already retrieved (443kB/335ms)
>
> resources:
>      [copy] Copying 34 files to
> E:\3DNI\PFE\WORK\workspace\CollabMee\build\class
> es\openmeetings
>
> compile.only:
>      [echo] Compile main to
> E:\3DNI\PFE\WORK\workspace\CollabMee/build/classes/o
> penmeetings
>     [javac] E:\3DNI\PFE\WORK\workspace\CollabMee\build.xml:399: warning:
> 'includ
> eantruntime' was not set, defaulting to build.sysclasspath=last; set to
> false fo
> r repeatable builds
>     [javac] Compiling 337 source files to
> E:\3DNI\PFE\WORK\workspace\CollabMee\b
> uild\classes\openmeetings
>     [javac]
> E:\3DNI\PFE\WORK\workspace\CollabMee\src\org\openmeetings\axis\servi
> ces\FileWebService.java:34: package org.apache.axiom.om does not exist
>     [javac] import org.apache.axiom.om.OMElement;
>     [javac]                           ^
>     [javac]
> E:\3DNI\PFE\WORK\workspace\CollabMee\src\org\openmeetings\axis\servi
> ces\FileWebService.java:1131: cannot find symbol
>     [javac] symbol  : class OMElement
>     [javac] location: class org.openmeetings.axis.services.FileWebService
>     [javac]     public OMElement echo(OMElement element) throws
> XMLStreamExcepti
> on {
>     [javac]                           ^
>     [javac]
> E:\3DNI\PFE\WORK\workspace\CollabMee\src\org\openmeetings\axis\servi
> ces\FileWebService.java:1131: cannot find symbol
>     [javac] symbol  : class OMElement
>     [javac] location: class org.openmeetings.axis.services.FileWebService
>     [javac]     public OMElement echo(OMElement element) throws
> XMLStreamExcepti
> on {
>     [javac]            ^
>     [javac]
> E:\3DNI\PFE\WORK\workspace\CollabMee\src\org\openmeetings\axis\servi
> ces\FileWebService.java:1146: cannot find symbol
>     [javac] symbol  : class OMElement
>     [javac] location: class org.openmeetings.axis.services.FileWebService
>     [javac]     public void ping(OMElement element) throws
> XMLStreamException {
>     [javac]                      ^
>     [javac]
> E:\3DNI\PFE\WORK\workspace\CollabMee\src\org\openmeetings\axis\servi
> ces\FileWebService.java:1153: cannot find symbol
>     [javac] symbol  : class OMElement
>     [javac] location: class org.openmeetings.axis.services.FileWebService
>     [javac]     public void pingF(OMElement element) throws AxisFault {
>     [javac]                       ^
>     [javac] Note: Starting OpenJPA Annotation Processor for Metamodel
> Generation
>
>     [javac]
> E:\3DNI\PFE\WORK\workspace\CollabMee\src\org\openmeetings\axis\servi
> ces\FileWebService.java:34: package org.apache.axiom.om does not exist
>     [javac] import org.apache.axiom.om.OMElement;
>     [javac]                           ^
>     [javac]
> E:\3DNI\PFE\WORK\workspace\CollabMee\src\org\openmeetings\axis\servi
> ces\FileWebService.java:1131: cannot find symbol
>     [javac] symbol  : class OMElement
>     [javac] location: class org.openmeetings.axis.services.FileWebService
>     [javac]     public OMElement echo(OMElement element) throws
> XMLStreamExcepti
> on {
>     [javac]                           ^
>     [javac]
> E:\3DNI\PFE\WORK\workspace\CollabMee\src\org\openmeetings\axis\servi
> ces\FileWebService.java:1131: cannot find symbol
>     [javac] symbol  : class OMElement
>     [javac] location: class org.openmeetings.axis.services.FileWebService
>     [javac]     public OMElement echo(OMElement element) throws
> XMLStreamExcepti
> on {
>     [javac]            ^
>     [javac]
> E:\3DNI\PFE\WORK\workspace\CollabMee\src\org\openmeetings\axis\servi
> ces\FileWebService.java:1146: cannot find symbol
>     [javac] symbol  : class OMElement
>     [javac] location: class org.openmeetings.axis.services.FileWebService
>     [javac]     public void ping(OMElement element) throws
> XMLStreamException {
>     [javac]                      ^
>     [javac]
> E:\3DNI\PFE\WORK\workspace\CollabMee\src\org\openmeetings\axis\servi
> ces\FileWebService.java:1153: cannot find symbol
>     [javac] symbol  : class OMElement
>     [javac] location: class org.openmeetings.axis.services.FileWebService
>     [javac]     public void pingF(OMElement element) throws AxisFault {
>     [javac]                       ^
>     [javac]
> E:\3DNI\PFE\WORK\workspace\CollabMee\src\org\openmeetings\axis\servi
> ces\FileWebService.java:34: package org.apache.axiom.om does not exist
>     [javac] import org.apache.axiom.om.OMElement;
>     [javac]                           ^
>     [javac]
> E:\3DNI\PFE\WORK\workspace\CollabMee\src\org\openmeetings\axis\servi
> ces\FileWebService.java:1131: cannot find symbol
>     [javac] symbol  : class OMElement
>     [javac] location: class org.openmeetings.axis.services.FileWebService
>     [javac]     public OMElement echo(OMElement element) throws
> XMLStreamExcepti
> on {
>     [javac]                           ^
>     [javac]
> E:\3DNI\PFE\WORK\workspace\CollabMee\src\org\openmeetings\axis\servi
> ces\FileWebService.java:1131: cannot find symbol
>     [javac] symbol  : class OMElement
>     [javac] location: class org.openmeetings.axis.services.FileWebService
>     [javac]     public OMElement echo(OMElement element) throws
> XMLStreamExcepti
> on {
>     [javac]            ^
>     [javac]
> E:\3DNI\PFE\WORK\workspace\CollabMee\src\org\openmeetings\axis\servi
> ces\FileWebService.java:1146: cannot find symbol
>     [javac] symbol  : class OMElement
>     [javac] location: class org.openmeetings.axis.services.FileWebService
>     [javac]     public void ping(OMElement element) throws
> XMLStreamException {
>     [javac]                      ^
>     [javac]
> E:\3DNI\PFE\WORK\workspace\CollabMee\src\org\openmeetings\axis\servi
> ces\FileWebService.java:1153: cannot find symbol
>     [javac] symbol  : class OMElement
>     [javac] location: class org.openmeetings.axis.services.FileWebService
>     [javac]     public void pingF(OMElement element) throws AxisFault {
>     [javac]                       ^
>     [javac]
> E:\3DNI\PFE\WORK\workspace\CollabMee\src\org\openmeetings\axis\servi
> ces\CalendarWebService.java:441: cannot access
> org.apache.axiom.soap.SOAPFault
>     [javac] class file for org.apache.axiom.soap.SOAPFault not found
>     [javac]                                     throw new AxisFault(
>     [javac]                                           ^
>     [javac]
> E:\3DNI\PFE\WORK\workspace\CollabMee\src\org\openmeetings\axis\servi
> ces\CalendarWebService.java:447: cannot access
> org.apache.axiom.soap.SOAPFaultCo
> de
>     [javac] class file for org.apache.axiom.soap.SOAPFaultCode not found
>     [javac]                             throw new AxisFault(
>     [javac]                                   ^
>     [javac] 7 errors
>
> BUILD FAILED
> E:\3DNI\PFE\WORK\workspace\CollabMee\build.xml:399: Compile failed; see
> the comp
> iler error output for details.
>
> Total time: 1 minute 32 seconds
>
>
>
>
>  *Hamdi THABET
> *Élève ingénieur en Téléinformatique (3e année)
> Maîtrisard en informatique
> Technicien en Réseau informatique et Télécoms
>  [+216] 52 72 27 25
> hamdi.thabet86@gmail.com
>  *-------Message original-------*
>
>  *De :* Apache Jenkins Server <jenkins@builds.apache.org>
> *Date :* 02/04/2012 12:04:22
> *A :* openmeetings-dev@incubator.apache.org;  seba.wagner@gmail.com
> *Sujet :* Build failed in Jenkins: Openmeetings #22
>
> See <https://builds.apache.org/job/openmeetings/22/changes>
>
> Changes:
>
> [sebawagner] OPENMEETINGS-124 add pixellock to make loading bar edges look
> better
> OPENMEETINGS-124 fix menu attribute "enabled"
>
> [sebawagner] OPENMEETINGS-124 Clean Up Splash Screen and unused resources
> in init
>
> [sebawagner] OPENMEETINGS-110 remove "navisub" table
> OPENMEETINGS-121 Share/record screen doesn't work
>
> [sebawagner] Fixes OPENMEETINGS-123 Wildcard on creating WebService docs
> doesn't work
>
> [sebawagner] Fix JUnit test to allocate more memory by default when
> running via ANT
>
> [sebawagner] OPENMEETINGS-117 Refactor Conference Coloring and Layout -
> Fixed to bring in line with the rest of the styling
>
> ------------------------------------------
> [...truncated 6676 lines...]
>   [openjpac] 1476  openmeetings  INFO   [main] openjpa.Tool - Enhancer
> running on type
> "org.openmeetings.app.persistence.beans.flvrecord.FlvRecordingLog".
>   [openjpac] 1496  openmeetings  INFO   [main] openjpa.Tool - Enhancer
> running on type
> "org.openmeetings.app.persistence.beans.files.FileExplorerItem".
>   [openjpac] 1539  openmeetings  INFO   [main] openjpa.Tool - Enhancer
> running on type
> "org.openmeetings.app.persistence.beans.domain.Organisation".
>   [openjpac] 1558  openmeetings  INFO   [main] openjpa.Tool - Enhancer
> running on type "org.openmeetings.app.persistence.beans.poll.PollType".
>   [openjpac] 1571  openmeetings  INFO   [main] openjpa.Tool - Enhancer
> running on type "org.openmeetings.app.persistence.beans.adresses.Adresses".
>   [openjpac] 1596  openmeetings  INFO   [main] openjpa.Tool - Enhancer
> running on type
> "org.openmeetings.app.persistence.beans.invitation.Invitations".
>   [openjpac] 1630  openmeetings  INFO   [main] openjpa.Tool - Enhancer
> running on type "org.openmeetings.app.persistence.beans.user.Salutations".
>   [openjpac] 1650  openmeetings  INFO   [main] openjpa.Tool - Enhancer
> running on type "org.openmeetings.app.persistence.beans.user.UserSipData".
>   [openjpac] 1666  openmeetings  INFO   [main] openjpa.Tool - Enhancer
> running on type "org.openmeetings.app.persistence.beans.lang.Fieldvalues".
>   [openjpac] 1685  openmeetings  INFO   [main] openjpa.Tool - Enhancer
> running on type "org.openmeetings.app.persistence.beans.user.Userdata".
>   [openjpac] 1706  openmeetings  INFO   [main] openjpa.Tool - Enhancer
> running on type
> "org.openmeetings.app.persistence.beans.basic.Configuration".
>   [openjpac] 1729  openmeetings  INFO   [main] openjpa.Tool - Enhancer
> running on type
> "org.openmeetings.app.persistence.beans.lang.Fieldlanguagesvalues".
>   [openjpac] 1747  openmeetings  INFO   [main] openjpa.Tool - Enhancer
> running on type "org.openmeetings.app.persistence.beans.logs.ConferenceLog".
>   [openjpac] 1777  openmeetings  INFO   [main] openjpa.Tool - Enhancer
> running on type
> "org.openmeetings.app.persistence.beans.sip.asterisk.MeetMe".
>   [openjpac] 1794  openmeetings  INFO   [main] openjpa.Tool - Enhancer
> running on type "org.openmeetings.app.persistence.beans.adresses.States".
>   [openjpac] 1809  openmeetings  INFO   [main] openjpa.Tool - Enhancer
> running on type
> "org.openmeetings.app.persistence.beans.calendar.AppointmentCategory".
>   [openjpac] 1827  openmeetings  INFO   [main] openjpa.Tool - Enhancer
> running on type
> "org.openmeetings.app.persistence.beans.flvrecord.FlvRecording".
>      [echo] Enhancing complete.
>
> enhance:
>
> -retrieve-anakia:
>
> -retrieve:
>      [echo] Ivy conf name: anakia, destination: <
> https://builds.apache.org/job/openmeetings/ws/singlewebapp/build/lib/anakia
> >
> [ivy:resolve] :: Ivy 2.2.0 - 20100923230623 :: http://ant.apache.org/ivy/::
> [ivy:resolve] :: loading settings :: file = <
> https://builds.apache.org/job/openmeetings/ws/singlewebapp/ivysettings.xml
> >
> [ivy:resolve] :: resolving dependencies ::
> apache#openmeetings;working@vesta.apache.org [not transitive]
> [ivy:resolve] confs: [anakia]
> [ivy:resolve] found org.jdom#jdom;1.1 in chain
> [ivy:resolve] found logkit#logkit;1.0.1 in chain
> [ivy:resolve] found oro#oro;2.0.8 in chain
> [ivy:resolve] :: resolution report :: resolve 227ms :: artifacts dl 16ms
>   ---------------------------------------------------------------------
>   |                  |            modules            ||   artifacts   |
>   |       conf       | number| search|dwnlded|evicted|| number|dwnlded|
>   ---------------------------------------------------------------------
>   |      anakia      |   3   |   0   |   0   |   0   ||   3   |   0   |
>   ---------------------------------------------------------------------
> [ivy:resolve]
> [ivy:resolve] :: problems summary ::
> [ivy:resolve] :::: ERRORS
> [ivy:resolve] unknown resolver maven2
> [ivy:resolve] unknown resolver default
> [ivy:resolve] unknown resolver ibiblio
> [ivy:resolve] unknown resolver default
> [ivy:resolve] unknown resolver default
> [ivy:resolve]
> [ivy:resolve] :: USE VERBOSE OR DEBUG MESSAGE LEVEL FOR MORE DETAILS
> [ivy:retrieve] :: retrieving :: apache#openmeetings
> [ivy:retrieve] confs: [anakia]
> [ivy:retrieve] 3 artifacts copied, 0 already retrieved (283kB/32ms)
>
> anakia:
>    [anakia] Transforming into: <
> https://builds.apache.org/job/openmeetings/ws/singlewebapp/docs>
>
> build.only.webservice.doc:
>   [javadoc] Generating Javadoc
>   [javadoc] Javadoc execution
>   [javadoc] Loading source file <
> https://builds.apache.org/job/openmeetings/ws/singlewebapp/src/org/openmeetings/axis/services/CalendarWebService.java
> ...>
>   [javadoc] Loading source file <
> https://builds.apache.org/job/openmeetings/ws/singlewebapp/src/org/openmeetings/axis/services/FileWebService.java
> ...>
>   [javadoc] Loading source file <
> https://builds.apache.org/job/openmeetings/ws/singlewebapp/src/org/openmeetings/axis/services/JabberWebService.java
> ...>
>   [javadoc] Loading source file <
> https://builds.apache.org/job/openmeetings/ws/singlewebapp/src/org/openmeetings/axis/services/RoomWebService.java
> ...>
>   [javadoc] Loading source file <
> https://builds.apache.org/job/openmeetings/ws/singlewebapp/src/org/openmeetings/axis/services/UserWebService.java
> ...>
>   [javadoc] Constructing Javadoc information...
>   [javadoc] SLF4J: Class path contains multiple SLF4J bindings.
>   [javadoc] SLF4J: Found binding in [jar:<
> https://builds.apache.org/job/openmeetings/ws/singlewebapp/build/red5/dist/lib/logback-classic-0.9.28.jar!/org/slf4j/impl/StaticLoggerBinder.class
> ]>
>   [javadoc] SLF4J: Found binding in [jar:<
> https://builds.apache.org/job/openmeetings/ws/singlewebapp/build/red5/dist/red5.jar!/org/slf4j/impl/StaticLoggerBinder.class
> ]>
>   [javadoc] SLF4J: See http://www.slf4j.org/codes.html#multiple_bindingsfor an explanation.
>   [javadoc] 00:21:12.859 [main] DEBUG org.apache.velocity -
> CommonsLogLogChute name is 'org.apache.velocity'
>   [javadoc] 00:21:12.879 [main] DEBUG org.apache.velocity - Initializing
> Velocity, Calling init()...
>   [javadoc] 00:21:12.879 [main] DEBUG org.apache.velocity - Starting
> Apache Velocity v1.7 (compiled: 2010-11-19 12:14:37)
>   [javadoc] 00:21:12.879 [main] DEBUG org.apache.velocity - Default
> Properties File: org/apache/velocity/runtime/defaults/velocity.properties
>   [javadoc] 00:21:12.879 [main] DEBUG org.apache.velocity - Trying to use
> logger class org.apache.velocity.runtime.log.AvalonLogChute
>   [javadoc] 00:21:12.879 [main] DEBUG org.apache.velocity - Target log
> system for org.apache.velocity.runtime.log.AvalonLogChute is not available
> (java.lang.NoClassDefFoundError: org/apache/log/format/Formatter).  Falling
> back to next log system...
>   [javadoc] 00:21:12.879 [main] DEBUG org.apache.velocity - Trying to use
> logger class org.apache.velocity.runtime.log.Log4JLogChute
>   [javadoc] 00:21:12.879 [main] DEBUG org.apache.velocity - Target log
> system for org.apache.velocity.runtime.log.Log4JLogChute is not available
> (java.lang.NoClassDefFoundError: org/apache/log4j/Appender).  Falling back
> to next log system...
>   [javadoc] 00:21:12.879 [main] DEBUG org.apache.velocity - Trying to use
> logger class org.apache.velocity.runtime.log.CommonsLogLogChute
>   [javadoc] 00:21:12.879 [main] DEBUG org.apache.velocity - Using logger
> class org.apache.velocity.runtime.log.CommonsLogLogChute
>   [javadoc] 00:21:12.886 [main] DEBUG org.apache.velocity - ResourceLoader
> instantiated: org.apache.velocity.runtime.resource.loader.FileResourceLoader
>   [javadoc] 00:21:12.887 [main] DEBUG org.apache.velocity - Do unicode
> file recognition:  false
>   [javadoc] 00:21:12.887 [main] DEBUG org.apache.velocity -
> FileResourceLoader : adding path '.'
>   [javadoc] 00:21:12.898 [main] DEBUG org.apache.velocity - ResourceCache:
> initialized (class org.apache.velocity.runtime.resource.ResourceCacheImpl)
> with class java.util.Collections$SynchronizedMap cache map.
>   [javadoc] 00:21:12.900 [main] DEBUG org.apache.velocity - Loaded System
> Directive: org.apache.velocity.runtime.directive.Stop
>   [javadoc] 00:21:12.901 [main] DEBUG org.apache.velocity - Loaded System
> Directive: org.apache.velocity.runtime.directive.Define
>   [javadoc] 00:21:12.902 [main] DEBUG org.apache.velocity - Loaded System
> Directive: org.apache.velocity.runtime.directive.Break
>   [javadoc] 00:21:12.903 [main] DEBUG org.apache.velocity - Loaded System
> Directive: org.apache.velocity.runtime.directive.Evaluate
>   [javadoc] 00:21:12.904 [main] DEBUG org.apache.velocity - Loaded System
> Directive: org.apache.velocity.runtime.directive.Literal
>   [javadoc] 00:21:12.905 [main] DEBUG org.apache.velocity - Loaded System
> Directive: org.apache.velocity.runtime.directive.Macro
>   [javadoc] 00:21:12.906 [main] DEBUG org.apache.velocity - Loaded System
> Directive: org.apache.velocity.runtime.directive.Parse
>   [javadoc] 00:21:12.908 [main] DEBUG org.apache.velocity - Loaded System
> Directive: org.apache.velocity.runtime.directive.Include
>   [javadoc] 00:21:12.909 [main] DEBUG org.apache.velocity - Loaded System
> Directive: org.apache.velocity.runtime.directive.Foreach
>   [javadoc] 00:21:12.947 [main] DEBUG org.apache.velocity - Created '20'
> parsers.
>   [javadoc] 00:21:12.954 [main] DEBUG org.apache.velocity - Velocimacro :
> "velocimacro.library" is not set.  Trying default library:
> VM_global_library.vm
>   [javadoc] 00:21:12.954 [main] DEBUG org.apache.velocity - Velocimacro :
> Default library not found.
>   [javadoc] 00:21:12.954 [main] DEBUG org.apache.velocity - Velocimacro :
> allowInline = true : VMs can be defined inline in templates
>   [javadoc] 00:21:12.954 [main] DEBUG org.apache.velocity - Velocimacro :
> allowInlineToOverride = false : VMs defined inline may NOT replace previous
> VM definitions
>   [javadoc] 00:21:12.954 [main] DEBUG org.apache.velocity - Velocimacro :
> allowInlineLocal = false : VMs defined inline will be global in scope if
> allowed.
>   [javadoc] 00:21:12.954 [main] DEBUG org.apache.velocity - Velocimacro :
> autoload off : VM system will not automatically reload global library macros
>   [javadoc] Start WebServiceDoclet templateNameNew ApiMethodsTemplate.vm
>   [javadoc] 00:21:13.007 [main] DEBUG org.apache.velocity -
> ResourceManager : found docs/ApiMethodsTemplate.vm with loader
> org.apache.velocity.runtime.resource.loader.FileResourceLoader
>   [javadoc] <
> https://builds.apache.org/job/openmeetings/ws/singlewebapp/src/org/openmeetings/axis/services/CalendarWebService.java>:99:
> warning - @return tag has no arguments.
>   [javadoc] <
> https://builds.apache.org/job/openmeetings/ws/singlewebapp/src/org/openmeetings/axis/services/CalendarWebService.java>:130:
> warning - @return tag has no arguments.
>   [javadoc] <
> https://builds.apache.org/job/openmeetings/ws/singlewebapp/src/org/openmeetings/axis/services/CalendarWebService.java>:155:
> warning - @return tag has no arguments.
>   [javadoc] <
> https://builds.apache.org/job/openmeetings/ws/singlewebapp/src/org/openmeetings/axis/services/CalendarWebService.java>:179:
> warning - @return tag has no arguments.
>   [javadoc] <
> https://builds.apache.org/job/openmeetings/ws/singlewebapp/src/org/openmeetings/axis/services/CalendarWebService.java>:205:
> warning - @return tag has no arguments.
>   [javadoc] <
> https://builds.apache.org/job/openmeetings/ws/singlewebapp/src/org/openmeetings/axis/services/CalendarWebService.java>:276:
> warning - @return tag has no arguments.
>   [javadoc] <
> https://builds.apache.org/job/openmeetings/ws/singlewebapp/src/org/openmeetings/axis/services/CalendarWebService.java>:343:
> warning - @return tag has no arguments.
>   [javadoc] <
> https://builds.apache.org/job/openmeetings/ws/singlewebapp/src/org/openmeetings/axis/services/CalendarWebService.java>:424:
> warning - @return tag has no arguments.
>   [javadoc] <
> https://builds.apache.org/job/openmeetings/ws/singlewebapp/src/org/openmeetings/axis/services/CalendarWebService.java>:516:
> warning - @return tag has no arguments.
>   [javadoc] <
> https://builds.apache.org/job/openmeetings/ws/singlewebapp/src/org/openmeetings/axis/services/CalendarWebService.java>:558:
> warning - @return tag has no arguments.
>   [javadoc] <
> https://builds.apache.org/job/openmeetings/ws/singlewebapp/src/org/openmeetings/axis/services/CalendarWebService.java>:590:
> warning - @return tag has no arguments.
>   [javadoc] <
> https://builds.apache.org/job/openmeetings/ws/singlewebapp/src/org/openmeetings/axis/services/CalendarWebService.java>:630:
> warning - @return tag has no arguments.
>   [javadoc] <
> https://builds.apache.org/job/openmeetings/ws/singlewebapp/src/org/openmeetings/axis/services/CalendarWebService.java>:685:
> warning - @return tag has no arguments.
>   [javadoc] <
> https://builds.apache.org/job/openmeetings/ws/singlewebapp/src/org/openmeetings/axis/services/FileWebService.java>:126:
> warning - @return tag has no arguments.
>   [javadoc] <
> https://builds.apache.org/job/openmeetings/ws/singlewebapp/src/org/openmeetings/axis/services/FileWebService.java>:245:
> warning - @return tag has no arguments.
>   [javadoc] <
> https://builds.apache.org/job/openmeetings/ws/singlewebapp/src/org/openmeetings/axis/services/FileWebService.java>:350:
> warning - @return tag has no arguments.
>   [javadoc] <
> https://builds.apache.org/job/openmeetings/ws/singlewebapp/src/org/openmeetings/axis/services/FileWebService.java>:416:
> warning - @return tag has no arguments.
>   [javadoc] <
> https://builds.apache.org/job/openmeetings/ws/singlewebapp/src/org/openmeetings/axis/services/FileWebService.java>:477:
> warning - @return tag has no arguments.
>   [javadoc] <
> https://builds.apache.org/job/openmeetings/ws/singlewebapp/src/org/openmeetings/axis/services/FileWebService.java>:531:
> warning - @return tag has no arguments.
>   [javadoc] <
> https://builds.apache.org/job/openmeetings/ws/singlewebapp/src/org/openmeetings/axis/services/FileWebService.java>:562:
> warning - @return tag has no arguments.
>   [javadoc] 00:21:13.059 [main] DEBUG org.apache.velocity -
> ResourceManager : found docs/ApiMethodsTemplate.vm with loader
> org.apache.velocity.runtime.resource.loader.FileResourceLoader
>   [javadoc] <
> https://builds.apache.org/job/openmeetings/ws/singlewebapp/src/org/openmeetings/axis/services/FileWebService.java>:592:
> warning - @return tag has no arguments.
>   [javadoc] 00:21:13.078 [main] DEBUG org.apache.velocity -
> ResourceManager : found docs/ApiMethodsTemplate.vm with loader
> org.apache.velocity.runtime.resource.loader.FileResourceLoader
>   [javadoc] <
> https://builds.apache.org/job/openmeetings/ws/singlewebapp/src/org/openmeetings/axis/services/FileWebService.java>:620:
> warning - @return tag has no arguments.
>   [javadoc] 00:21:13.085 [main] DEBUG org.apache.velocity -
> ResourceManager : found docs/ApiMethodsTemplate.vm with loader
> org.apache.velocity.runtime.resource.loader.FileResourceLoader
>   [javadoc] <
> https://builds.apache.org/job/openmeetings/ws/singlewebapp/src/org/openmeetings/axis/services/FileWebService.java>:639:
> warning - @return tag has no arguments.
>   [javadoc] <
> https://builds.apache.org/job/openmeetings/ws/singlewebapp/src/org/openmeetings/axis/services/FileWebService.java>:691:
> warning - @return tag has no arguments.
>   [javadoc] <
> https://builds.apache.org/job/openmeetings/ws/singlewebapp/src/org/openmeetings/axis/services/FileWebService.java>:762:
> warning - @return tag has no arguments.
>   [javadoc] <
> https://builds.apache.org/job/openmeetings/ws/singlewebapp/src/org/openmeetings/axis/services/FileWebService.java>:838:
> warning - @return tag has no arguments.
>   [javadoc] <
> https://builds.apache.org/job/openmeetings/ws/singlewebapp/src/org/openmeetings/axis/services/FileWebService.java>:888:
> warning - @return tag has no arguments.
>   [javadoc] <
> https://builds.apache.org/job/openmeetings/ws/singlewebapp/src/org/openmeetings/axis/services/FileWebService.java>:934:
> warning - @return tag has no arguments.
>   [javadoc] <
> https://builds.apache.org/job/openmeetings/ws/singlewebapp/src/org/openmeetings/axis/services/FileWebService.java>:970:
> warning - @return tag has no arguments.
>   [javadoc] <
> https://builds.apache.org/job/openmeetings/ws/singlewebapp/src/org/openmeetings/axis/services/FileWebService.java>:1025:
> warning - @return tag has no arguments.
>   [javadoc] <
> https://builds.apache.org/job/openmeetings/ws/singlewebapp/src/org/openmeetings/axis/services/FileWebService.java>:1084:
> warning - @return tag has no arguments.
>   [javadoc] <
> https://builds.apache.org/job/openmeetings/ws/singlewebapp/src/org/openmeetings/axis/services/RoomWebService.java>:148:
> warning - @return tag has no arguments.
>   [javadoc] <
> https://builds.apache.org/job/openmeetings/ws/singlewebapp/src/org/openmeetings/axis/services/RoomWebService.java>:176:
> warning - @return tag has no arguments.
>   [javadoc] <
> https://builds.apache.org/job/openmeetings/ws/singlewebapp/src/org/openmeetings/axis/services/RoomWebService.java>:227:
> warning - @return tag has no arguments.
>   [javadoc] <
> https://builds.apache.org/job/openmeetings/ws/singlewebapp/src/org/openmeetings/axis/services/RoomWebService.java>:277:
> warning - @return tag has no arguments.
>   [javadoc] <
> https://builds.apache.org/job/openmeetings/ws/singlewebapp/src/org/openmeetings/axis/services/RoomWebService.java>:306:
> warning - @return tag has no arguments.
>   [javadoc] <
> https://builds.apache.org/job/openmeetings/ws/singlewebapp/src/org/openmeetings/axis/services/RoomWebService.java>:353:
> warning - @return tag has no arguments.
>   [javadoc] <
> https://builds.apache.org/job/openmeetings/ws/singlewebapp/src/org/openmeetings/axis/services/RoomWebService.java>:399:
> warning - @return tag has no arguments.
>   [javadoc] <
> https://builds.apache.org/job/openmeetings/ws/singlewebapp/src/org/openmeetings/axis/services/RoomWebService.java>:437:
> warning - @return tag has no arguments.
>   [javadoc] <
> https://builds.apache.org/job/openmeetings/ws/singlewebapp/src/org/openmeetings/axis/services/RoomWebService.java>:527:
> warning - @return tag has no arguments.
>   [javadoc] <
> https://builds.apache.org/job/openmeetings/ws/singlewebapp/src/org/openmeetings/axis/services/RoomWebService.java>:538:
> warning - @return tag has no arguments.
>   [javadoc] <
> https://builds.apache.org/job/openmeetings/ws/singlewebapp/src/org/openmeetings/axis/services/RoomWebService.java>:550:
> warning - @return tag has no arguments.
>   [javadoc] <
> https://builds.apache.org/job/openmeetings/ws/singlewebapp/src/org/openmeetings/axis/services/RoomWebService.java>:620:
> warning - @return tag has no arguments.
>   [javadoc] <
> https://builds.apache.org/job/openmeetings/ws/singlewebapp/src/org/openmeetings/axis/services/RoomWebService.java>:641:
> warning - @return tag has no arguments.
>   [javadoc] <
> https://builds.apache.org/job/openmeetings/ws/singlewebapp/src/org/openmeetings/axis/services/RoomWebService.java>:678:
> warning - @return tag has no arguments.
>   [javadoc] <
> https://builds.apache.org/job/openmeetings/ws/singlewebapp/src/org/openmeetings/axis/services/RoomWebService.java>:739:
> warning - @return tag has no arguments.
>   [javadoc] <
> https://builds.apache.org/job/openmeetings/ws/singlewebapp/src/org/openmeetings/axis/services/RoomWebService.java>:799:
> warning - @return tag has no arguments.
>   [javadoc] <
> https://builds.apache.org/job/openmeetings/ws/singlewebapp/src/org/openmeetings/axis/services/RoomWebService.java>:863:
> warning - @return tag has no arguments.
>   [javadoc] <
> https://builds.apache.org/job/openmeetings/ws/singlewebapp/src/org/openmeetings/axis/services/RoomWebService.java>:942:
> warning - @return tag has no arguments.
>   [javadoc] <
> https://builds.apache.org/job/openmeetings/ws/singlewebapp/src/org/openmeetings/axis/services/RoomWebService.java>:1003:
> warning - @return tag has no arguments.
>   [javadoc] <
> https://builds.apache.org/job/openmeetings/ws/singlewebapp/src/org/openmeetings/axis/services/RoomWebService.java>:1063:
> warning - @return tag has no arguments.
>   [javadoc] <
> https://builds.apache.org/job/openmeetings/ws/singlewebapp/src/org/openmeetings/axis/services/RoomWebService.java>:1129:
> warning - @return tag has no arguments.
>   [javadoc] <
> https://builds.apache.org/job/openmeetings/ws/singlewebapp/src/org/openmeetings/axis/services/RoomWebService.java>:1190:
> warning - @return tag has no arguments.
>   [javadoc] <
> https://builds.apache.org/job/openmeetings/ws/singlewebapp/src/org/openmeetings/axis/services/RoomWebService.java>:1273:
> warning - @return tag has no arguments.
>   [javadoc] <
> https://builds.apache.org/job/openmeetings/ws/singlewebapp/src/org/openmeetings/axis/services/RoomWebService.java>:1307:
> warning - @return tag has no arguments.
>   [javadoc] <
> https://builds.apache.org/job/openmeetings/ws/singlewebapp/src/org/openmeetings/axis/services/RoomWebService.java>:1319:
> warning - @return tag has no arguments.
>   [javadoc] <
> https://builds.apache.org/job/openmeetings/ws/singlewebapp/src/org/openmeetings/axis/services/RoomWebService.java>:1369:
> warning - @return tag has no arguments.
>   [javadoc] <
> https://builds.apache.org/job/openmeetings/ws/singlewebapp/src/org/openmeetings/axis/services/RoomWebService.java>:1426:
> warning - @return tag has no arguments.
>   [javadoc] <
> https://builds.apache.org/job/openmeetings/ws/singlewebapp/src/org/openmeetings/axis/services/RoomWebService.java>:1490:
> warning - @return tag has no arguments.
>   [javadoc] <
> https://builds.apache.org/job/openmeetings/ws/singlewebapp/src/org/openmeetings/axis/services/RoomWebService.java>:1560:
> warning - @return tag has no arguments.
>   [javadoc] <
> https://builds.apache.org/job/openmeetings/ws/singlewebapp/src/org/openmeetings/axis/services/RoomWebService.java>:1955:
> warning - @return tag has no arguments.
>   [javadoc] <
> https://builds.apache.org/job/openmeetings/ws/singlewebapp/src/org/openmeetings/axis/services/RoomWebService.java>:2019:
> warning - @return tag has no arguments.
>   [javadoc] <
> https://builds.apache.org/job/openmeetings/ws/singlewebapp/src/org/openmeetings/axis/services/RoomWebService.java>:2116:
> warning - @return tag has no arguments.
>   [javadoc] <
> https://builds.apache.org/job/openmeetings/ws/singlewebapp/src/org/openmeetings/axis/services/RoomWebService.java>:2233:
> warning - @return tag has no arguments.
>   [javadoc] <
> https://builds.apache.org/job/openmeetings/ws/singlewebapp/src/org/openmeetings/axis/services/RoomWebService.java>:2293:
> warning - @return tag has no arguments.
>   [javadoc] <
> https://builds.apache.org/job/openmeetings/ws/singlewebapp/src/org/openmeetings/axis/services/RoomWebService.java>:2342:
> warning - @return tag has no arguments.
>   [javadoc] 00:21:13.131 [main] DEBUG org.apache.velocity -
> ResourceManager : found docs/ApiMethodsTemplate.vm with loader
> org.apache.velocity.runtime.resource.loader.FileResourceLoader
>   [javadoc] 00:21:13.141 [main] DEBUG org.apache.velocity -
> ResourceManager : found docs/ApiClassesTemplate.vm with loader
> org.apache.velocity.runtime.resource.loader.FileResourceLoader
>   [javadoc] 85 warnings
>   [javadoc] <
> https://builds.apache.org/job/openmeetings/ws/singlewebapp/src/org/openmeetings/axis/services/UserWebService.java>:91:
> warning - @return tag has no arguments.
>   [javadoc] <
> https://builds.apache.org/job/openmeetings/ws/singlewebapp/src/org/openmeetings/axis/services/UserWebService.java>:109:
> warning - @return tag has no arguments.
>   [javadoc] <
> https://builds.apache.org/job/openmeetings/ws/singlewebapp/src/org/openmeetings/axis/services/UserWebService.java>:143:
> warning - @return tag has no arguments.
>   [javadoc] <
> https://builds.apache.org/job/openmeetings/ws/singlewebapp/src/org/openmeetings/axis/services/UserWebService.java>:208:
> warning - @return tag has no arguments.
>   [javadoc] <
> https://builds.apache.org/job/openmeetings/ws/singlewebapp/src/org/openmeetings/axis/services/UserWebService.java>:302:
> warning - @return tag has no arguments.
>   [javadoc] <
> https://builds.apache.org/job/openmeetings/ws/singlewebapp/src/org/openmeetings/axis/services/UserWebService.java>:392:
> warning - @return tag has no arguments.
>   [javadoc] <
> https://builds.apache.org/job/openmeetings/ws/singlewebapp/src/org/openmeetings/axis/services/UserWebService.java>:456:
> warning - @return tag has no arguments.
>   [javadoc] <
> https://builds.apache.org/job/openmeetings/ws/singlewebapp/src/org/openmeetings/axis/services/UserWebService.java>:491:
> warning - @return tag has no arguments.
>   [javadoc] <
> https://builds.apache.org/job/openmeetings/ws/singlewebapp/src/org/openmeetings/axis/services/UserWebService.java>:541:
> warning - @return tag has no arguments.
>   [javadoc] <
> https://builds.apache.org/job/openmeetings/ws/singlewebapp/src/org/openmeetings/axis/services/UserWebService.java>:606:
> warning - @return tag has no arguments.
>   [javadoc] <
> https://builds.apache.org/job/openmeetings/ws/singlewebapp/src/org/openmeetings/axis/services/UserWebService.java>:679:
> warning - @return tag has no arguments.
>   [javadoc] <
> https://builds.apache.org/job/openmeetings/ws/singlewebapp/src/org/openmeetings/axis/services/UserWebService.java>:777:
> warning - @return tag has no arguments.
>   [javadoc] <
> https://builds.apache.org/job/openmeetings/ws/singlewebapp/src/org/openmeetings/axis/services/UserWebService.java>:880:
> warning - @return tag has no arguments.
>   [javadoc] <
> https://builds.apache.org/job/openmeetings/ws/singlewebapp/src/org/openmeetings/axis/services/UserWebService.java>:976:
> warning - @return tag has no arguments.
>   [javadoc] <
> https://builds.apache.org/job/openmeetings/ws/singlewebapp/src/org/openmeetings/axis/services/UserWebService.java>:1075:
> warning - @return tag has no arguments.
>   [javadoc] <
> https://builds.apache.org/job/openmeetings/ws/singlewebapp/src/org/openmeetings/axis/services/UserWebService.java>:1161:
> warning - @return tag has no arguments.
>   [javadoc] <
> https://builds.apache.org/job/openmeetings/ws/singlewebapp/src/org/openmeetings/axis/services/UserWebService.java>:1225:
> warning - @return tag has no arguments.
>   [javadoc] <
> https://builds.apache.org/job/openmeetings/ws/singlewebapp/src/org/openmeetings/axis/services/UserWebService.java>:1261:
> warning - @return tag has no arguments.
>   [javadoc] <
> https://builds.apache.org/job/openmeetings/ws/singlewebapp/src/org/openmeetings/axis/services/UserWebService.java>:1293:
> warning - @return tag has no arguments.
>      [copy] Copying 53 files to <
> https://builds.apache.org/job/openmeetings/ws/singlewebapp/dist/red5/webapps/openmeetings/docs
> >
>      [copy] Copying 43 files to <
> https://builds.apache.org/job/openmeetings/ws/singlewebapp/dist/red5/webapps/openmeetings/docs/images
> >
>      [copy] Copying 19 files to <
> https://builds.apache.org/job/openmeetings/ws/singlewebapp/dist/red5/webapps/openmeetings/docs/css
> >
>      [copy] Copying 6 files to <
> https://builds.apache.org/job/openmeetings/ws/singlewebapp/dist/red5/webapps/openmeetings/docs/js
> >
>      [copy] Copying 8 files to <
> https://builds.apache.org/job/openmeetings/ws/singlewebapp/dist/red5/webapps/openmeetings/docs/source
> >
>      [copy] Copying 2 files to <
> https://builds.apache.org/job/openmeetings/ws/singlewebapp/dist/red5/webapps/openmeetings/docs/source/helpers
> >
>
> current_revision:
>      [echo] Current revision: 1308222
>
> jar.only:
>       [jar] Building jar: <
> https://builds.apache.org/job/openmeetings/ws/singlewebapp/dist/red5/webapps/openmeetings/WEB-INF/lib/openmeetings-2.0.0-SNAPSHOT.jar
> >
>       [jar] Building jar: <
> https://builds.apache.org/job/openmeetings/ws/singlewebapp/dist/red5/webapps/openmeetings/WEB-INF/lib/openmeetings-templates-2.0.0-SNAPSHOT.jar
> >
>       [jar] Building jar: <
> https://builds.apache.org/job/openmeetings/ws/singlewebapp/dist/red5/webapps/openmeetings/WEB-INF/services/OpenMeetingsService-2.0.0-SNAPSHOT.aar
> >
>       [jar] Building jar: <
> https://builds.apache.org/job/openmeetings/ws/singlewebapp/dist/red5/webapps/openmeetings/WEB-INF/lib/openmeetings-WebService-2.0.0-SNAPSHOT.jar
> >
>
> jar.screen.share:
>       [jar] Building jar: <
> https://builds.apache.org/job/openmeetings/ws/singlewebapp/dist/red5/webapps/openmeetings/red5-screenshare/red5-screenshare.jar
> >
>
> jar:
>
> -retrieve-openlaszlo:
>
> -retrieve:
>      [echo] Ivy conf name: openlaszlo, destination: <
> https://builds.apache.org/job/openmeetings/ws/singlewebapp/build/openlaszlo
> >
> [ivy:resolve] :: Ivy 2.2.0 - 20100923230623 :: http://ant.apache.org/ivy/::
> [ivy:resolve] :: loading settings :: file = <
> https://builds.apache.org/job/openmeetings/ws/singlewebapp/ivysettings.xml
> >
> [ivy:resolve] :: resolving dependencies ::
> apache#openmeetings;working@vesta.apache.org [not transitive]
> [ivy:resolve] confs: [openlaszlo]
> [ivy:resolve] found openlaszlo#openlaszlo;4.9 in googlecode
> [ivy:resolve] downloading
> http://openlaszlo-openmeetings-integration.googlecode.com/svn/repository/openlaszlo-4.9.tgz...
> [ivy:resolve]
> ...............................................................................................................................................................................
> [ivy:resolve]
> ....................................................................................................................................................................
> [ivy:resolve]
> ..............................................................................................................................................................
> [ivy:resolve]
> ..............................................................................................................................................................................
> [ivy:resolve]
> ..................................................................................................................................................................................
> [ivy:resolve]  (42221kB)
>
> -extract-tgz:
>      [echo] Going to extract
> /home/hudson/.ivy2/cache/openlaszlo/openlaszlo/tgzs/openlaszlo-4.9.tgz to
> the <https://builds.apache.org/job/openmeetings/ws/singlewebapp/build>
> [ivy:resolve]
> [ivy:resolve] :: problems summary ::
> [ivy:resolve] :::: ERRORS
> [ivy:resolve] The following error occurred while executing this line:
> [ivy:resolve] <
> https://builds.apache.org/job/openmeetings/ws/singlewebapp/build.xml>:818:
> src
> '/home/hudson/.ivy2/cache/openlaszlo/openlaszlo/tgzs/openlaszlo-4.9.tgz'
> doesn't exist.
> [ivy:resolve]
> [ivy:resolve] :: USE VERBOSE OR DEBUG MESSAGE LEVEL FOR MORE DETAILS
>
> BUILD FAILED
> <https://builds.apache.org/job/openmeetings/ws/singlewebapp/build.xml>:821:
> The following error occurred while executing this line:
> <https://builds.apache.org/job/openmeetings/ws/singlewebapp/build.xml>:703:
> impossible to resolve dependencies:
>   The following error occurred while executing this line:
> <https://builds.apache.org/job/openmeetings/ws/singlewebapp/build.xml>:818:
> src
> '/home/hudson/.ivy2/cache/openlaszlo/openlaszlo/tgzs/openlaszlo-4.9.tgz'
> doesn't exist.
>
> Total time: 15 minutes 8 seconds
> Build step 'Invoke Ant' marked build as failure
> Archiving artifacts
>
>

Mime
  • Unnamed multipart/alternative (inline, None, 0 bytes)
View raw message