openjpa-dev mailing list archives

Site index · List index
Message view « Date » · « Thread »
Top « Date » · « Thread »
From Donald Woods <dwo...@apache.org>
Subject Re: Compile failures starting at revs 769478 and 769497
Date Wed, 29 Apr 2009 16:11:14 GMT
I just updated to Rev769801 and I'm seeing build failures in the 
openjpa-persistence tests now with Java 5 and 6.


-Donald


David Ezzio wrote:
> Hi Pinaki,
> 
> This is fixed for me starting at 769549.
> 
> Thanks,
> 
> David
> 
> David Ezzio wrote:
>> At 769478:
>>
>> [INFO] Compiling 12 source files to 
>> C:\code\svn\RW_OpenJPATrunk\openjpa-persistence\target\test-classes
>> [INFO] 
>> ------------------------------------------------------------------------
>> [ERROR] BUILD FAILURE
>> [INFO] 
>> ------------------------------------------------------------------------
>> [INFO] Compilation failure
>>
>> C:\code\svn\RW_OpenJPATrunk\openjpa-persistence\src\test\java\org\apache\openjpa\persistence\meta\TestCanonicalMetamodelGeneration.java:[14,35]

>> package javax.annotation.processing does not exist
>>
>> etc.
>>
>> xxxxxxxxxxxxxxxxxxxxxxxxxxxxxxxxxxxxxxxxxxxxxxx
>>
>> At 769497:
>>
>>
>> [INFO] Compiling 193 source files to 
>> C:\code\svn\RW_OpenJPATrunk\openjpa-persistence\target\classes
>> [INFO] 
>> ------------------------------------------------------------------------
>> [ERROR] BUILD FAILURE
>> [INFO] 
>> ------------------------------------------------------------------------
>> [INFO] Compilation failure
>>
>> C:\code\svn\RW_OpenJPATrunk\openjpa-persistence\src\main\java\org\apache\openjpa\persistence\meta\SourceAnnotationHandler.java:[29,35]

>> package javax.annotation.processing does not exist
>>
>> etc.
>>
> 

Mime
View raw message