openjpa-dev mailing list archives

Site index · List index
Message view « Date » · « Thread »
Top « Date » · « Thread »
From Pinaki Poddar <ppod...@apache.org>
Subject Re: Compile failures starting at revs 769478 and 769497
Date Tue, 28 Apr 2009 20:44:17 GMT

Hi David,
  Sorry about that.
  Will be fixed with an hour. 


David Ezzio-3 wrote:
> 
> At 769478:
> 
> [INFO] Compiling 12 source files to 
> C:\code\svn\RW_OpenJPATrunk\openjpa-persistence\target\test-classes
> [INFO] 
> ------------------------------------------------------------------------
> [ERROR] BUILD FAILURE
> [INFO] 
> ------------------------------------------------------------------------
> [INFO] Compilation failure
> 
> C:\code\svn\RW_OpenJPATrunk\openjpa-persistence\src\test\java\org\apache\openjpa\persistence\meta\TestCanonicalMetamodelGeneration.java:[14,35]

> package javax.annotation.processing does not exist
> 
> etc.
> 
> xxxxxxxxxxxxxxxxxxxxxxxxxxxxxxxxxxxxxxxxxxxxxxx
> 
> At 769497:
> 
> 
> [INFO] Compiling 193 source files to 
> C:\code\svn\RW_OpenJPATrunk\openjpa-persistence\target\classes
> [INFO] 
> ------------------------------------------------------------------------
> [ERROR] BUILD FAILURE
> [INFO] 
> ------------------------------------------------------------------------
> [INFO] Compilation failure
> 
> C:\code\svn\RW_OpenJPATrunk\openjpa-persistence\src\main\java\org\apache\openjpa\persistence\meta\SourceAnnotationHandler.java:[29,35]

> package javax.annotation.processing does not exist
> 
> etc.
> 
> 


-----
Pinaki Poddar                      http://ppoddar.blogspot.com/
                                      
http://www.linkedin.com/in/pinakipoddar
OpenJPA PMC Member/Committer
JPA Expert Group Member
-- 
View this message in context: http://n2.nabble.com/Compile-failures-starting-at-revs-769478-and-769497-tp2736621p2736772.html
Sent from the OpenJPA Developers mailing list archive at Nabble.com.


Mime
View raw message