openjpa-dev mailing list archives

Site index · List index
Message view « Date » · « Thread »
Top « Date » · « Thread »
From Craig L Russell <Craig.Russ...@Sun.COM>
Subject Re: [continuum] BUILD FAILURE: OpenJPA Utilities
Date Mon, 13 Aug 2007 04:34:53 GMT
Looks like the Java 6 incompatible JDBC nailed us.

We need to specify Java 5 at least for this project and maybe for  
JDBC projects as well...

Craig

On Aug 12, 2007, at 8:14 PM, Continuum VMBuild Server wrote:

> Online report : http://vmbuild1.apache.org/continuum/ 
> buildResult.action?buildId=224&projectId=27
>
> Build statistics:
>  State: Failed
>  Previous Build: No previous build.
>  Started at: Sun 12 Aug 2007 19:59:12 -0700
>  Finished at: Sun 12 Aug 2007 20:14:51 -0700
>  Total time: 15m 38s
>  Build Trigger: Forced
>  Build Number: 0
>  Exit code: 1
>  Building machine hostname: vmbuild
>  Operating system : Linux(unknown)
>  Java Home version :          java version "1.6.0"
>          Java(TM) SE Runtime Environment (build 1.6.0-b105)
>          Java HotSpot(TM) Client VM (build 1.6.0-b105, mixed mode,  
> sharing)
>         Builder version :
>          Maven version: 2.0.7
>          Java version: 1.6.0
>          OS name: "linux" version: "2.6.20-16-server" arch: "i386"
>     
> ********************************************************************** 
> ******
> SCM Changes:
> ********************************************************************** 
> ******
> No files changed
>
> ********************************************************************** 
> ******
> Dependencies Changes:
> ********************************************************************** 
> ******
> No dependencies changed
>
> ********************************************************************** 
> ******
> Test Summary:
> ********************************************************************** 
> ******
> Tests: 0
> Failures: 0
> Total time: 0
>
> ********************************************************************** 
> ******
> Output:
> ********************************************************************** 
> ******
> [INFO] Scanning for projects...
> [INFO]  
> ---------------------------------------------------------------------- 
> ------
> [INFO] Building OpenJPA Utilities
> [INFO]    task-segment: [clean, install]
> [INFO]  
> ---------------------------------------------------------------------- 
> ------
> [INFO] [clean:clean]
> [INFO] Deleting directory /home/continuum/data/working-directory/27/ 
> target
> [INFO] Deleting directory /home/continuum/data/working-directory/27/ 
> target/classes
> [INFO] Deleting directory /home/continuum/data/working-directory/27/ 
> target/test-classes
> [INFO] Deleting directory /home/continuum/data/working-directory/27/ 
> target/site
> Downloading: http://repo1.maven.org/maven2/org/apache/maven/plugins/ 
> maven-surefire-plugin/2.2/maven-surefire-plugin-2.2.pom
> 1K downloaded
> Downloading: http://repo1.maven.org/maven2/org/apache/maven/plugins/ 
> maven-surefire-plugin/2.2/maven-surefire-plugin-2.2.jar
> 14K downloaded
> [INFO] [resources:resources]
> [INFO] Using default encoding to copy filtered resources.
> Downloading: http://www.ibiblio.org/maven2/jakarta-regexp/jakarta- 
> regexp/1.4/jakarta-regexp-1.4.pom
> 160b downloaded
> Downloading: http://www.ibiblio.org/maven2/commons-collections/ 
> commons-collections/3.2/commons-collections-3.2.pom
> 10K downloaded
> Downloading: http://www.ibiblio.org/maven2/net/sourceforge/serp/ 
> serp/1.11.0/serp-1.11.0.pom
> 4K downloaded
> Downloading: http://www.ibiblio.org/maven2/commons-collections/ 
> commons-collections/3.2/commons-collections-3.2.jar
> 557K downloaded
> Downloading: http://www.ibiblio.org/maven2/net/sourceforge/serp/ 
> serp/1.11.0/serp-1.11.0.jar
> 185K downloaded
> [INFO] [compiler:compile]
> [INFO] Compiling 156 source files to /home/continuum/data/working- 
> directory/27/target/classes
> [INFO]  
> ---------------------------------------------------------------------- 
> --
> [ERROR] BUILD FAILURE
> [INFO]  
> ---------------------------------------------------------------------- 
> --
> [INFO] Compilation failure
>
> /home/continuum/data/working-directory/27/src/main/java/org/apache/ 
> openjpa/lib/util/concurrent/Utils.java:[203,22] sun.misc.Perf is  
> Sun proprietary API and may be removed in a future release
>
> /home/continuum/data/working-directory/27/src/main/java/org/apache/ 
> openjpa/lib/jdbc/DelegatingDataSource.java:[35,7]  
> org.apache.openjpa.lib.jdbc.DelegatingDataSource is not abstract  
> and does not override abstract method isWrapperFor(java.lang.Class)  
> in java.sql.Wrapper
>
> /home/continuum/data/working-directory/27/src/main/java/org/apache/ 
> openjpa/lib/jdbc/DelegatingConnection.java:[46,7]  
> org.apache.openjpa.lib.jdbc.DelegatingConnection is not abstract  
> and does not override abstract method createStruct 
> (java.lang.String,java.lang.Object[]) in java.sql.Connection
>
> /home/continuum/data/working-directory/27/src/main/java/org/apache/ 
> openjpa/lib/jdbc/DelegatingPreparedStatement.java:[51,7]  
> org.apache.openjpa.lib.jdbc.DelegatingPreparedStatement is not  
> abstract and does not override abstract method setNClob 
> (int,java.io.Reader) in java.sql.PreparedStatement
>
> /home/continuum/data/working-directory/27/src/main/java/org/apache/ 
> openjpa/lib/jdbc/DelegatingStatement.java:[37,7]  
> org.apache.openjpa.lib.jdbc.DelegatingStatement is not abstract and  
> does not override abstract method isPoolable() in java.sql.Statement
>
> /home/continuum/data/working-directory/27/src/main/java/org/apache/ 
> openjpa/lib/jdbc/DelegatingDatabaseMetaData.java:[31,7]  
> org.apache.openjpa.lib.jdbc.DelegatingDatabaseMetaData is not  
> abstract and does not override abstract method getFunctionColumns 
> (java.lang.String,java.lang.String,java.lang.String,java.lang.String)  
> in java.sql.DatabaseMetaData
>
> /home/continuum/data/working-directory/27/src/main/java/org/apache/ 
> openjpa/lib/jdbc/DelegatingResultSet.java:[50,7]  
> org.apache.openjpa.lib.jdbc.DelegatingResultSet is not abstract and  
> does not override abstract method updateNClob 
> (java.lang.String,java.io.Reader) in java.sql.ResultSet
>
> /home/continuum/data/working-directory/27/src/main/java/org/apache/ 
> openjpa/lib/jdbc/DelegatingCallableStatement.java:[49,7]  
> org.apache.openjpa.lib.jdbc.DelegatingCallableStatement is not  
> abstract and does not override abstract method setNClob 
> (java.lang.String,java.io.Reader) in java.sql.CallableStatement
>
> /home/continuum/data/working-directory/27/src/main/java/org/apache/ 
> openjpa/lib/util/concurrent/Utils.java:[207,28] sun.misc.Perf is  
> Sun proprietary API and may be removed in a future release
>
> /home/continuum/data/working-directory/27/src/main/java/org/apache/ 
> openjpa/lib/util/concurrent/Utils.java:[210,39] sun.misc.Perf is  
> Sun proprietary API and may be removed in a future release
>
>
> [INFO]  
> ---------------------------------------------------------------------- 
> --
> [INFO] For more information, run Maven with the -e switch
> [INFO]  
> ---------------------------------------------------------------------- 
> --
> [INFO] Total time: 15 minutes 37 seconds
> [INFO] Finished at: Sun Aug 12 20:14:51 PDT 2007
> [INFO] Final Memory: 5M/24M
> [INFO]  
> ---------------------------------------------------------------------- 
> --
>
> ********************************************************************** 
> ******
>
>

Craig Russell
Architect, Sun Java Enterprise System http://java.sun.com/products/jdo
408 276-5638 mailto:Craig.Russell@sun.com
P.S. A good JDO? O, Gasp!


Mime
View raw message