openjpa-dev mailing list archives

Site index · List index
Message view « Date » · « Thread »
Top « Date » · « Thread »
From "Continuum@vmbuild" <...@openjpa.apache.org>
Subject [continuum] BUILD FAILURE: OpenJPA Kernel
Date Tue, 21 Aug 2007 01:18:48 GMT
Online report : http://vmbuild1.apache.org/continuum/buildResult.action?buildId=1770&projectId=28

Build statistics:
  State: Failed
  Previous State: Ok
  Started at: Mon 20 Aug 2007 18:18:25 -0700
  Finished at: Mon 20 Aug 2007 18:18:45 -0700
  Total time: 19s
  Build Trigger: Schedule
  Build Number: 19
  Exit code: 1
  Building machine hostname: vmbuild
  Operating system : Linux(unknown)
  Java Home version : 
          java version "1.5.0_12"
          Java(TM) 2 Runtime Environment, Standard Edition (build 1.5.0_12-b04)
          Java HotSpot(TM) Client VM (build 1.5.0_12-b04, mixed mode, sharing)
        
  Builder version :
          Maven version: 2.0.7
          Java version: 1.5.0_12
          OS name: "linux" version: "2.6.20-16-server" arch: "i386"
    
****************************************************************************
SCM Changes:
****************************************************************************
Changed: pcl @ Mon 20 Aug 2007 16:19:05 -0700
Comment: OPENJPA-314, OPENJPA-315
Files changed:
  /openjpa/trunk/openjpa-kernel/src/main/java/org/apache/openjpa/enhance/PCEnhancer.java (
567875 )
  /openjpa/trunk/openjpa-kernel/src/main/java/org/apache/openjpa/util/ApplicationIds.java
( 567875 )
  /openjpa/trunk/openjpa-persistence-jdbc/src/test/java/org/apache/openjpa/enhance/AbstractUnenhancedClassTest.java
( 567875 )
  /openjpa/trunk/openjpa-persistence-jdbc/src/test/java/org/apache/openjpa/enhance/TestUnenhancedCompoundPKSubclass.java
( 567875 )
  /openjpa/trunk/openjpa-persistence-jdbc/src/test/java/org/apache/openjpa/enhance/TestUnenhancedFieldAccess.java
( 567875 )
  /openjpa/trunk/openjpa-persistence-jdbc/src/test/java/org/apache/openjpa/enhance/TestUnenhancedFieldAccessPrimitiveWrapper.java
( 567875 )
  /openjpa/trunk/openjpa-persistence-jdbc/src/test/java/org/apache/openjpa/enhance/TestUnenhancedPropertyAccess.java
( 567875 )
  /openjpa/trunk/openjpa-persistence-jdbc/src/test/java/org/apache/openjpa/enhance/UnenhancedCompoundPKFieldAccessSubclass.java
( 567875 )
  /openjpa/trunk/openjpa-persistence-jdbc/src/test/java/org/apache/openjpa/enhance/UnenhancedCompoundPKFieldAccessSuperclass.java
( 567875 )
  /openjpa/trunk/openjpa-persistence-jdbc/src/test/java/org/apache/openjpa/enhance/UnenhancedFieldAccessPrimitiveWrapper.java
( 567875 )
  /openjpa/trunk/openjpa-persistence-jdbc/src/test/java/org/apache/openjpa/enhance/UnenhancedFieldAccessPrimitiveWrapperSubclass.java
( 567875 )

Changed: pcl @ Mon 20 Aug 2007 17:45:23 -0700
Comment: OPENJPA-293. Allow runtime redefinition to be disabled via a configuration setting.
We really should sweep through the code and change ImplHelper to take a Configuration as an
argument, but that won't change the behavior; it'll just make some of the validations more
eager.
Files changed:
  /openjpa/trunk/openjpa-jdbc/src/main/java/org/apache/openjpa/jdbc/kernel/exps/Param.java
( 567886 )
  /openjpa/trunk/openjpa-kernel/src/main/java/org/apache/openjpa/conf/OpenJPAConfiguration.java
( 567886 )
  /openjpa/trunk/openjpa-kernel/src/main/java/org/apache/openjpa/conf/OpenJPAConfigurationImpl.java
( 567886 )
  /openjpa/trunk/openjpa-kernel/src/main/java/org/apache/openjpa/datacache/QueryKey.java (
567886 )
  /openjpa/trunk/openjpa-kernel/src/main/java/org/apache/openjpa/meta/ClassMetaData.java (
567886 )
  /openjpa/trunk/openjpa-kernel/src/main/java/org/apache/openjpa/meta/FieldMetaData.java (
567886 )
  /openjpa/trunk/openjpa-kernel/src/main/java/org/apache/openjpa/meta/MetaDataRepository.java
( 567886 )
  /openjpa/trunk/openjpa-kernel/src/main/java/org/apache/openjpa/util/AbstractChangeTracker.java
( 567886 )
  /openjpa/trunk/openjpa-kernel/src/main/java/org/apache/openjpa/util/Exceptions.java ( 567886
)
  /openjpa/trunk/openjpa-kernel/src/main/java/org/apache/openjpa/util/ImplHelper.java ( 567886
)
  /openjpa/trunk/openjpa-kernel/src/main/java/org/apache/openjpa/util/ProxyManagerImpl.java
( 567886 )
  /openjpa/trunk/openjpa-kernel/src/main/resources/org/apache/openjpa/conf/localizer.properties
( 567886 )
  /openjpa/trunk/openjpa-kernel-5/src/main/java/org/apache/openjpa/enhance/ManagedClassSubclasser.java
( 567886 )
  /openjpa/trunk/openjpa-lib/src/main/java/org/apache/openjpa/lib/conf/Configuration.java
( 567886 )
  /openjpa/trunk/openjpa-persistence/src/main/java/org/apache/openjpa/persistence/AnnotationPersistenceMetaDataParser.java
( 567886 )
  /openjpa/trunk/openjpa-persistence/src/main/java/org/apache/openjpa/persistence/EntityManagerImpl.java
( 567886 )
  /openjpa/trunk/openjpa-persistence/src/main/java/org/apache/openjpa/persistence/OpenJPAPersistence.java
( 567886 )
  /openjpa/trunk/openjpa-persistence/src/main/java/org/apache/openjpa/persistence/QueryImpl.java
( 567886 )
  /openjpa/trunk/openjpa-persistence/src/main/java/org/apache/openjpa/persistence/XMLPersistenceMetaDataParser.java
( 567886 )
  /openjpa/trunk/openjpa-persistence-jdbc/src/test/java/org/apache/openjpa/enhance/AbstractUnenhancedClassTest.java
( 567886 )
  /openjpa/trunk/openjpa-persistence-jdbc/src/test/java/org/apache/openjpa/enhance/TestEnhancementConfiguration.java
( 567886 )

Changed: pcl @ Mon 20 Aug 2007 17:54:44 -0700
Comment: OPENJPA-293. More-eager failures.
Files changed:
  /openjpa/trunk/openjpa-kernel/src/main/resources/org/apache/openjpa/enhance/localizer.properties
( 567889 )
  /openjpa/trunk/openjpa-kernel-5/src/main/java/org/apache/openjpa/enhance/ManagedClassSubclasser.java
( 567889 )
  /openjpa/trunk/openjpa-persistence-jdbc/src/test/java/org/apache/openjpa/enhance/TestEnhancementConfiguration.java
( 567889 )

****************************************************************************
Dependencies Changes:
****************************************************************************
org.apache.openjpa:openjpa-lib:1.0.0-SNAPSHOT

org.apache.openjpa:openjpa-parent:1.0.0-SNAPSHOT

****************************************************************************
Test Summary:
****************************************************************************
Tests: 75
Failures: 3
Total time: 583

****************************************************************************
Output:
****************************************************************************
[INFO] Scanning for projects...
[INFO] ----------------------------------------------------------------------------
[INFO] Building OpenJPA Kernel
[INFO]    task-segment: [clean, install]
[INFO] ----------------------------------------------------------------------------
[INFO] [clean:clean]
[INFO] Deleting directory /home/continuum/data/working-directory/28/target
[INFO] Deleting directory /home/continuum/data/working-directory/28/target/classes
[INFO] Deleting directory /home/continuum/data/working-directory/28/target/test-classes
[INFO] Deleting directory /home/continuum/data/working-directory/28/target/site
[INFO] [javacc:jjtree {execution: jjtree-jpql}]
Java Compiler Compiler Version 4.0 (Tree Builder)
(type "jjtree" with no arguments for help)
Reading from file /home/continuum/data/working-directory/28/src/main/jjtree/org/apache/openjpa/kernel/jpql/JPQL.jjt
. . .
File "/home/continuum/data/working-directory/28/target/generated-sources/jjtree/org/apache/openjpa/kernel/jpql/Node.java"
does not exist.  Will create one.
Annotated grammar generated successfully in /home/continuum/data/working-directory/28/target/generated-sources/jjtree/org/apache/openjpa/kernel/jpql/JPQL.jj
[INFO] [javacc:javacc {execution: javacc-jpql}]
Java Compiler Compiler Version 4.0 (Parser Generator)
(type "javacc" with no arguments for help)
Reading from file /home/continuum/data/working-directory/28/target/generated-sources/jjtree/org/apache/openjpa/kernel/jpql/JPQL.jj
. . .
Warning: Choice conflict in (...)* construct at line 850, column 17.
         Expansion nested within construct and expansion following construct
         have common prefixes, one of which is: "+"
         Consider using a lookahead of 2 or more for nested expansion.
Warning: Choice conflict in (...)* construct at line 859, column 17.
         Expansion nested within construct and expansion following construct
         have common prefixes, one of which is: "*"
         Consider using a lookahead of 2 or more for nested expansion.
File "TokenMgrError.java" does not exist.  Will create one.
File "ParseException.java" does not exist.  Will create one.
File "Token.java" does not exist.  Will create one.
File "JavaCharStream.java" does not exist.  Will create one.
Parser generated with 0 errors and 2 warnings.
[INFO] [antrun:run {execution: default}]
[INFO] Executing tasks
   [delete] Deleting: /home/continuum/data/working-directory/28/target/generated-sources/javacc/org/apache/openjpa/kernel/jpql/ParseException.java
[INFO] Executed tasks
[INFO] [resources:resources]
[INFO] Using default encoding to copy filtered resources.
[INFO] [compiler:compile]
[INFO] Compiling 404 source files to /home/continuum/data/working-directory/28/target/classes
[INFO] [antrun:run {execution: add-was-interfaces}]
[INFO] Executing tasks
[INFO] Executed tasks
[INFO] [antrun:run {execution: generate-standard-sco-proxies}]
[INFO] Executing tasks
org.apache.openjpa.util.java$sql$Date$proxy
org.apache.openjpa.util.java$sql$Time$proxy
org.apache.openjpa.util.java$sql$Timestamp$proxy
org.apache.openjpa.util.java$util$ArrayList$proxy
org.apache.openjpa.util.java$util$Date$proxy
org.apache.openjpa.util.java$util$GregorianCalendar$proxy
org.apache.openjpa.util.java$util$HashMap$proxy
org.apache.openjpa.util.java$util$HashSet$proxy
org.apache.openjpa.util.java$util$Hashtable$proxy
org.apache.openjpa.util.java$util$LinkedList$proxy
org.apache.openjpa.util.java$util$Properties$proxy
org.apache.openjpa.util.java$util$TreeMap$proxy
org.apache.openjpa.util.java$util$TreeSet$proxy
org.apache.openjpa.util.java$util$Vector$proxy
org.apache.openjpa.util.java$util$EnumMap$proxy
org.apache.openjpa.util.java$util$IdentityHashMap$proxy
org.apache.openjpa.util.java$util$LinkedHashMap$proxy
org.apache.openjpa.util.java$util$LinkedHashSet$proxy
org.apache.openjpa.util.java$util$PriorityQueue$proxy
[INFO] Executed tasks
[INFO] [resources:testResources]
[INFO] Using default encoding to copy filtered resources.
[INFO] [compiler:testCompile]
[INFO] Compiling 2 source files to /home/continuum/data/working-directory/28/target/test-classes
[INFO] [surefire:test]
[INFO] Surefire report directory: /home/continuum/data/working-directory/28/target/surefire-reports

-------------------------------------------------------
 T E S T S
-------------------------------------------------------
Running org.apache.openjpa.util.TestProxyManager
Tests run: 37, Failures: 0, Errors: 3, Skipped: 0, Time elapsed: 0.586 sec <<< FAILURE!
testCopyBeans(org.apache.openjpa.util.TestProxyManager)  Time elapsed: 0.014 sec  <<<
ERROR!
java.lang.NullPointerException
	at org.apache.openjpa.util.TestProxyManager.assertBeansEqual(TestProxyManager.java:742)
	at org.apache.openjpa.util.TestProxyManager.testCopyBeans(TestProxyManager.java:716)
	at sun.reflect.NativeMethodAccessorImpl.invoke0(Native Method)
	at sun.reflect.NativeMethodAccessorImpl.invoke(NativeMethodAccessorImpl.java:39)
	at sun.reflect.DelegatingMethodAccessorImpl.invoke(DelegatingMethodAccessorImpl.java:25)
	at java.lang.reflect.Method.invoke(Method.java:597)
	at junit.framework.TestCase.runTest(TestCase.java:154)
	at junit.framework.TestCase.runBare(TestCase.java:127)
	at junit.framework.TestResult$1.protect(TestResult.java:106)
	at junit.framework.TestResult.runProtected(TestResult.java:124)
	at junit.framework.TestResult.run(TestResult.java:109)
	at junit.framework.TestCase.run(TestCase.java:118)
	at junit.framework.TestSuite.runTest(TestSuite.java:208)
	at junit.framework.TestSuite.run(TestSuite.java:203)
	at sun.reflect.NativeMethodAccessorImpl.invoke0(Native Method)
	at sun.reflect.NativeMethodAccessorImpl.invoke(NativeMethodAccessorImpl.java:39)
	at sun.reflect.DelegatingMethodAccessorImpl.invoke(DelegatingMethodAccessorImpl.java:25)
	at java.lang.reflect.Method.invoke(Method.java:597)
	at org.apache.maven.surefire.junit.JUnitTestSet.execute(JUnitTestSet.java:210)
	at org.apache.maven.surefire.suite.AbstractDirectoryTestSuite.executeTestSet(AbstractDirectoryTestSuite.java:135)
	at org.apache.maven.surefire.suite.AbstractDirectoryTestSuite.execute(AbstractDirectoryTestSuite.java:122)
	at org.apache.maven.surefire.Surefire.run(Surefire.java:129)
	at sun.reflect.NativeMethodAccessorImpl.invoke0(Native Method)
	at sun.reflect.NativeMethodAccessorImpl.invoke(NativeMethodAccessorImpl.java:39)
	at sun.reflect.DelegatingMethodAccessorImpl.invoke(DelegatingMethodAccessorImpl.java:25)
	at java.lang.reflect.Method.invoke(Method.java:597)
	at org.apache.maven.surefire.booter.SurefireBooter.runSuitesInProcess(SurefireBooter.java:225)
	at org.apache.maven.surefire.booter.SurefireBooter.main(SurefireBooter.java:747)

testCopyProxyBean(org.apache.openjpa.util.TestProxyManager)  Time elapsed: 0 sec  <<<
ERROR!
java.lang.NullPointerException
	at org.apache.openjpa.util.TestProxyManager.populate(TestProxyManager.java:726)
	at org.apache.openjpa.util.TestProxyManager.testCopyProxyBean(TestProxyManager.java:753)
	at sun.reflect.NativeMethodAccessorImpl.invoke0(Native Method)
	at sun.reflect.NativeMethodAccessorImpl.invoke(NativeMethodAccessorImpl.java:39)
	at sun.reflect.DelegatingMethodAccessorImpl.invoke(DelegatingMethodAccessorImpl.java:25)
	at java.lang.reflect.Method.invoke(Method.java:597)
	at junit.framework.TestCase.runTest(TestCase.java:154)
	at junit.framework.TestCase.runBare(TestCase.java:127)
	at junit.framework.TestResult$1.protect(TestResult.java:106)
	at junit.framework.TestResult.runProtected(TestResult.java:124)
	at junit.framework.TestResult.run(TestResult.java:109)
	at junit.framework.TestCase.run(TestCase.java:118)
	at junit.framework.TestSuite.runTest(TestSuite.java:208)
	at junit.framework.TestSuite.run(TestSuite.java:203)
	at sun.reflect.NativeMethodAccessorImpl.invoke0(Native Method)
	at sun.reflect.NativeMethodAccessorImpl.invoke(NativeMethodAccessorImpl.java:39)
	at sun.reflect.DelegatingMethodAccessorImpl.invoke(DelegatingMethodAccessorImpl.java:25)
	at java.lang.reflect.Method.invoke(Method.java:597)
	at org.apache.maven.surefire.junit.JUnitTestSet.execute(JUnitTestSet.java:210)
	at org.apache.maven.surefire.suite.AbstractDirectoryTestSuite.executeTestSet(AbstractDirectoryTestSuite.java:135)
	at org.apache.maven.surefire.suite.AbstractDirectoryTestSuite.execute(AbstractDirectoryTestSuite.java:122)
	at org.apache.maven.surefire.Surefire.run(Surefire.java:129)
	at sun.reflect.NativeMethodAccessorImpl.invoke0(Native Method)
	at sun.reflect.NativeMethodAccessorImpl.invoke(NativeMethodAccessorImpl.java:39)
	at sun.reflect.DelegatingMethodAccessorImpl.invoke(DelegatingMethodAccessorImpl.java:25)
	at java.lang.reflect.Method.invoke(Method.java:597)
	at org.apache.maven.surefire.booter.SurefireBooter.runSuitesInProcess(SurefireBooter.java:225)
	at org.apache.maven.surefire.booter.SurefireBooter.main(SurefireBooter.java:747)

testBeanMethodsProxied(org.apache.openjpa.util.TestProxyManager)  Time elapsed: 0 sec  <<<
ERROR!
java.lang.NullPointerException
	at org.apache.openjpa.util.TestProxyManager.testBeanMethodsProxied(TestProxyManager.java:761)
	at sun.reflect.NativeMethodAccessorImpl.invoke0(Native Method)
	at sun.reflect.NativeMethodAccessorImpl.invoke(NativeMethodAccessorImpl.java:39)
	at sun.reflect.DelegatingMethodAccessorImpl.invoke(DelegatingMethodAccessorImpl.java:25)
	at java.lang.reflect.Method.invoke(Method.java:597)
	at junit.framework.TestCase.runTest(TestCase.java:154)
	at junit.framework.TestCase.runBare(TestCase.java:127)
	at junit.framework.TestResult$1.protect(TestResult.java:106)
	at junit.framework.TestResult.runProtected(TestResult.java:124)
	at junit.framework.TestResult.run(TestResult.java:109)
	at junit.framework.TestCase.run(TestCase.java:118)
	at junit.framework.TestSuite.runTest(TestSuite.java:208)
	at junit.framework.TestSuite.run(TestSuite.java:203)
	at sun.reflect.NativeMethodAccessorImpl.invoke0(Native Method)
	at sun.reflect.NativeMethodAccessorImpl.invoke(NativeMethodAccessorImpl.java:39)
	at sun.reflect.DelegatingMethodAccessorImpl.invoke(DelegatingMethodAccessorImpl.java:25)
	at java.lang.reflect.Method.invoke(Method.java:597)
	at org.apache.maven.surefire.junit.JUnitTestSet.execute(JUnitTestSet.java:210)
	at org.apache.maven.surefire.suite.AbstractDirectoryTestSuite.executeTestSet(AbstractDirectoryTestSuite.java:135)
	at org.apache.maven.surefire.suite.AbstractDirectoryTestSuite.execute(AbstractDirectoryTestSuite.java:122)
	at org.apache.maven.surefire.Surefire.run(Surefire.java:129)
	at sun.reflect.NativeMethodAccessorImpl.invoke0(Native Method)
	at sun.reflect.NativeMethodAccessorImpl.invoke(NativeMethodAccessorImpl.java:39)
	at sun.reflect.DelegatingMethodAccessorImpl.invoke(DelegatingMethodAccessorImpl.java:25)
	at java.lang.reflect.Method.invoke(Method.java:597)
	at org.apache.maven.surefire.booter.SurefireBooter.runSuitesInProcess(SurefireBooter.java:225)
	at org.apache.maven.surefire.booter.SurefireBooter.main(SurefireBooter.java:747)

Running org.apache.openjpa.ee.TestWASManagedRuntime
Tests run: 1, Failures: 0, Errors: 0, Skipped: 0, Time elapsed: 0.015 sec

Results :
Tests run: 38, Failures: 0, Errors: 3, Skipped: 0

[INFO] ------------------------------------------------------------------------
[ERROR] BUILD FAILURE
[INFO] ------------------------------------------------------------------------
[INFO] There are test failures.
[INFO] ------------------------------------------------------------------------
[INFO] For more information, run Maven with the -e switch
[INFO] ------------------------------------------------------------------------
[INFO] Total time: 17 seconds
[INFO] Finished at: Mon Aug 20 18:18:44 PDT 2007
[INFO] Final Memory: 10M/40M
[INFO] ------------------------------------------------------------------------

****************************************************************************



Mime
View raw message