openjpa-commits mailing list archives

Site index · List index
Message view « Date » · « Thread »
Top « Date » · « Thread »
From Apache Jenkins Server <jenk...@builds.apache.org>
Subject Build failed in Jenkins: OpenJPA-Trunk-Deploy #88
Date Sat, 14 Mar 2020 06:46:34 GMT
See <https://builds.apache.org/job/OpenJPA-Trunk-Deploy/88/display/redirect?page=changes>

Changes:

[struberg] Revert "[OPENJPA-2798] java11 friendly (#57)"

[struberg] OPENJPA-2798 use geronimo-jpa-2.2 spec api which use a module name


------------------------------------------
[...truncated 33.34 KB...]

main:
org.apache.openjpa.util.java$sql$Date$proxy
org.apache.openjpa.util.java$sql$Time$proxy
org.apache.openjpa.util.java$sql$Timestamp$proxy
org.apache.openjpa.util.java$util$ArrayList$proxy
org.apache.openjpa.util.java$util$Date$proxy
org.apache.openjpa.util.java$util$GregorianCalendar$proxy
org.apache.openjpa.util.java$util$HashMap$proxy
org.apache.openjpa.util.java$util$HashSet$proxy
org.apache.openjpa.util.java$util$Hashtable$proxy
org.apache.openjpa.util.java$util$LinkedList$proxy
org.apache.openjpa.util.java$util$Properties$proxy
org.apache.openjpa.util.java$util$TreeMap$proxy
org.apache.openjpa.util.java$util$TreeSet$proxy
org.apache.openjpa.util.java$util$Vector$proxy
org.apache.openjpa.util.java$util$EnumMap$proxy
org.apache.openjpa.util.java$util$IdentityHashMap$proxy
org.apache.openjpa.util.java$util$LinkedHashMap$proxy
org.apache.openjpa.util.java$util$LinkedHashSet$proxy
org.apache.openjpa.util.java$util$PriorityQueue$proxy
[INFO] Executed tasks
[INFO] 
[INFO] --- maven-compiler-plugin:3.8.0:testCompile (test-source-compile) @ openjpa-kernel ---
[INFO] Changes detected - recompiling the module!
[INFO] Compiling 13 source files to <https://builds.apache.org/job/OpenJPA-Trunk-Deploy/ws/openjpa-kernel/target/test-classes>
[INFO] <https://builds.apache.org/job/OpenJPA-Trunk-Deploy/ws/openjpa-kernel/src/test/java/org/apache/openjpa/util/TestProxyManager.java>: Some input files use unchecked or unsafe operations.
[INFO] <https://builds.apache.org/job/OpenJPA-Trunk-Deploy/ws/openjpa-kernel/src/test/java/org/apache/openjpa/util/TestProxyManager.java>: Recompile with -Xlint:unchecked for details.
[INFO] 
[INFO] --- maven-resources-plugin:3.1.0:testResources (default-testResources) @ openjpa-kernel ---
[INFO] Using 'UTF-8' encoding to copy filtered resources.
[INFO] skip non existing resourceDirectory <https://builds.apache.org/job/OpenJPA-Trunk-Deploy/ws/openjpa-kernel/src/test/resources>
[INFO] Copying 3 resources
[INFO] 
[INFO] --- maven-compiler-plugin:3.8.0:testCompile (default-testCompile) @ openjpa-kernel ---
[INFO] Changes detected - recompiling the module!
[INFO] Compiling 13 source files to <https://builds.apache.org/job/OpenJPA-Trunk-Deploy/ws/openjpa-kernel/target/test-classes>
[INFO] <https://builds.apache.org/job/OpenJPA-Trunk-Deploy/ws/openjpa-kernel/src/test/java/org/apache/openjpa/util/TestProxyManager.java>: Some input files use unchecked or unsafe operations.
[INFO] <https://builds.apache.org/job/OpenJPA-Trunk-Deploy/ws/openjpa-kernel/src/test/java/org/apache/openjpa/util/TestProxyManager.java>: Recompile with -Xlint:unchecked for details.
[INFO] 
[INFO] --- maven-surefire-plugin:2.22.0:test (default-test) @ openjpa-kernel ---
[INFO] Tests are skipped.
[INFO] 
[INFO] --- maven-jar-plugin:3.1.0:jar (default-jar) @ openjpa-kernel ---
[INFO] Building jar: <https://builds.apache.org/job/OpenJPA-Trunk-Deploy/ws/openjpa-kernel/target/openjpa-kernel-3.1.2-SNAPSHOT.jar>
[INFO] 
[INFO] --- maven-site-plugin:3.7.1:attach-descriptor (attach-descriptor) @ openjpa-kernel ---
[INFO] Skipping because packaging 'jar' is not pom.
[INFO] 
[INFO] --- maven-jar-plugin:3.1.0:test-jar (attach-tests) @ openjpa-kernel ---
[INFO] Building jar: <https://builds.apache.org/job/OpenJPA-Trunk-Deploy/ws/openjpa-kernel/target/openjpa-kernel-3.1.2-SNAPSHOT-tests.jar>
[INFO] 
[INFO] --- apache-rat-plugin:0.12:check (default) @ openjpa-kernel ---
[INFO] Enabled default license matchers.
[INFO] Will parse SCM ignores for exclusions...
[INFO] Finished adding exclusions from SCM ignore files.
[INFO] 61 implicit excludes (use -debug for more details).
[INFO] Exclude: **/.*/**
[INFO] Exclude: **/target/**/*
[INFO] 543 resources included (use -debug for more details)
[INFO] Rat check: Summary over all files. Unapproved: 0, unknown: 0, generated: 0, approved: 543 licenses.
[INFO] 
[INFO] --- maven-install-plugin:2.5.2:install (default-install) @ openjpa-kernel ---
[INFO] Installing <https://builds.apache.org/job/OpenJPA-Trunk-Deploy/ws/openjpa-kernel/target/openjpa-kernel-3.1.2-SNAPSHOT.jar> to /home/jenkins/.m2/repository/org/apache/openjpa/openjpa-kernel/3.1.2-SNAPSHOT/openjpa-kernel-3.1.2-SNAPSHOT.jar
[INFO] Installing <https://builds.apache.org/job/OpenJPA-Trunk-Deploy/ws/openjpa-kernel/pom.xml> to /home/jenkins/.m2/repository/org/apache/openjpa/openjpa-kernel/3.1.2-SNAPSHOT/openjpa-kernel-3.1.2-SNAPSHOT.pom
[INFO] Installing <https://builds.apache.org/job/OpenJPA-Trunk-Deploy/ws/openjpa-kernel/target/openjpa-kernel-3.1.2-SNAPSHOT-tests.jar> to /home/jenkins/.m2/repository/org/apache/openjpa/openjpa-kernel/3.1.2-SNAPSHOT/openjpa-kernel-3.1.2-SNAPSHOT-tests.jar
[INFO] 
[INFO] --- maven-deploy-plugin:2.8.2:deploy (default-deploy) @ openjpa-kernel ---
Downloading from apache.snapshots.https: https://repository.apache.org/content/repositories/snapshots/org/apache/openjpa/openjpa-kernel/3.1.2-SNAPSHOT/maven-metadata.xml
Progress (1): 994 B                   Downloaded from apache.snapshots.https: https://repository.apache.org/content/repositories/snapshots/org/apache/openjpa/openjpa-kernel/3.1.2-SNAPSHOT/maven-metadata.xml (994 B at 1.6 kB/s)
Uploading to apache.snapshots.https: https://repository.apache.org/content/repositories/snapshots/org/apache/openjpa/openjpa-kernel/3.1.2-SNAPSHOT/openjpa-kernel-3.1.2-20200314.064605-2.jar
Progress (1): 0/1.5 MBProgress (1): 0/1.5 MBProgress (1): 0/1.5 MBProgress (1): 0/1.5 MBProgress (1): 0/1.5 MBProgress (1): 0/1.5 MBProgress (1): 0/1.5 MBProgress (1): 0/1.5 MBProgress (1): 0/1.5 MBProgress (1): 0/1.5 MBProgress (1): 0/1.5 MBProgress (1): 0/1.5 MBProgress (1): 0/1.5 MBProgress (1): 0/1.5 MBProgress (1): 0/1.5 MBProgress (1): 0/1.5 MBProgress (1): 0/1.5 MBProgress (1): 0/1.5 MBProgress (1): 0/1.5 MBProgress (1): 0/1.5 MBProgress (1): 0/1.5 MBProgress (1): 0/1.5 MBProgress (1): 0/1.5 MBProgress (1): 0/1.5 MBProgress (1): 0.1/1.5 MBProgress (1): 0.1/1.5 MBProgress (1): 0.1/1.5 MBProgress (1): 0.1/1.5 MBProgress (1): 0.1/1.5 MBProgress (1): 0.1/1.5 MBProgress (1): 0.1/1.5 MBProgress (1): 0.1/1.5 MBProgress (1): 0.1/1.5 MBProgress (1): 0.1/1.5 MBProgress (1): 0.1/1.5 MBProgress (1): 0.1/1.5 MBProgress (1): 0.1/1.5 MBProgress (1): 0.1/1.5 MBProgress (1): 0.1/1.5 MBProgress (1): 0.1/1.5 MBProgress (1): 0.1/1.5 MBProgress (1): 0.1/1.5 MBProgress (1): 0.1/1.5 MBProgress (1): 0.1/1.5 MBProgress (1): 0.1/1.5 MBProgress (1): 0.1/1.5 MBProgress (1): 0.1/1.5 MBProgress (1): 0.1/1.5 MBProgress (1): 0.1/1.5 MBProgress (1): 0.1/1.5 MBProgress (1): 0.1/1.5 MBProgress (1): 0.1/1.5 MBProgress (1): 0.1/1.5 MBProgress (1): 0.1/1.5 MBProgress (1): 0.1/1.5 MBProgress (1): 0.1/1.5 MBProgress (1): 0.1/1.5 MBProgress (1): 0.1/1.5 MBProgress (1): 0.1/1.5 MBProgress (1): 0.1/1.5 MBProgress (1): 0.1/1.5 MBProgress (1): 0.1/1.5 MBProgress (1): 0.1/1.5 MBProgress (1): 0.1/1.5 MBProgress (1): 0.1/1.5 MBProgress (1): 0.1/1.5 MBProgress (1): 0.1/1.5 MBProgress (1): 0.1/1.5 MBProgress (1): 0.1/1.5 MBProgress (1): 0.1/1.5 MBProgress (1): 0.1/1.5 MBProgress (1): 0.1/1.5 MBProgress (1): 0.1/1.5 MBProgress (1): 0.2/1.5 MBProgress (1): 0.2/1.5 MBProgress (1): 0.2/1.5 MBProgress (1): 0.2/1.5 MBProgress (1): 0.2/1.5 MBProgress (1): 0.2/1.5 MBProgress (1): 0.2/1.5 MBProgress (1): 0.2/1.5 MBProgress (1): 0.2/1.5 MBProgress (1): 0.2/1.5 MBProgress (1): 0.2/1.5 MBProgress (1): 0.2/1.5 MBProgress (1): 0.2/1.5 MBProgress (1): 0.2/1.5 MBProgress (1): 0.2/1.5 MBProgress (1): 0.2/1.5 MBProgress (1): 0.2/1.5 MBProgress (1): 0.2/1.5 MBProgress (1): 0.2/1.5 MBProgress (1): 0.2/1.5 MBProgress (1): 0.2/1.5 MBProgress (1): 0.2/1.5 MBProgress (1): 0.2/1.5 MBProgress (1): 0.2/1.5 MBProgress (1): 0.2/1.5 MBProgress (1): 0.2/1.5 MBProgress (1): 0.2/1.5 MBProgress (1): 0.2/1.5 MBProgress (1): 0.2/1.5 MBProgress (1): 0.2/1.5 MBProgress (1): 0.2/1.5 MBProgress (1): 0.2/1.5 MBProgress (1): 0.2/1.5 MBProgress (1): 0.2/1.5 MBProgress (1): 0.2/1.5 MBProgress (1): 0.2/1.5 MBProgress (1): 0.2/1.5 MBProgress (1): 0.2/1.5 MBProgress (1): 0.2/1.5 MBProgress (1): 0.2/1.5 MBProgress (1): 0.2/1.5 MBProgress (1): 0.2/1.5 MBProgress (1): 0.2/1.5 MBProgress (1): 0.2/1.5 MBProgress (1): 0.2/1.5 MBProgress (1): 0.2/1.5 MBProgress (1): 0.2/1.5 MBProgress (1): 0.2/1.5 MBProgress (1): 0.2/1.5 MBProgress (1): 0.3/1.5 MBProgress (1): 0.3/1.5 MBProgress (1): 0.3/1.5 MBProgress (1): 0.3/1.5 MBProgress (1): 0.3/1.5 MBProgress (1): 0.3/1.5 MBProgress (1): 0.3/1.5 MBProgress (1): 0.3/1.5 MBProgress (1): 0.3/1.5 MBProgress (1): 0.3/1.5 MBProgress (1): 0.3/1.5 MBProgress (1): 0.3/1.5 MBProgress (1): 0.3/1.5 MBProgress (1): 0.3/1.5 MBProgress (1): 0.3/1.5 MBProgress (1): 0.3/1.5 MBProgress (1): 0.3/1.5 MBProgress (1): 0.3/1.5 MBProgress (1): 0.3/1.5 MBProgress (1): 0.3/1.5 MBProgress (1): 0.3/1.5 MBProgress (1): 0.3/1.5 MBProgress (1): 0.3/1.5 MBProgress (1): 0.3/1.5 MBProgress (1): 0.3/1.5 MBProgress (1): 0.3/1.5 MBProgress (1): 0.3/1.5 MBProgress (1): 0.3/1.5 MBProgress (1): 0.3/1.5 MBProgress (1): 0.3/1.5 MBProgress (1): 0.3/1.5 MBProgress (1): 0.3/1.5 MBProgress (1): 0.3/1.5 MBProgress (1): 0.3/1.5 MBProgress (1): 0.3/1.5 MBProgress (1): 0.3/1.5 MBProgress (1): 0.3/1.5 MBProgress (1): 0.3/1.5 MBProgress (1): 0.3/1.5 MBProgress (1): 0.3/1.5 MBProgress (1): 0.3/1.5 MBProgress (1): 0.3/1.5 MBProgress (1): 0.3/1.5 MBProgress (1): 0.3/1.5 MBProgress (1): 0.3/1.5 MBProgress (1): 0.3/1.5 MBProgress (1): 0.3/1.5 MBProgress (1): 0.3/1.5 MBProgress (1): 0.4/1.5 MBProgress (1): 0.4/1.5 MBProgress (1): 0.4/1.5 MBProgress (1): 0.4/1.5 MBProgress (1): 0.4/1.5 MBProgress (1): 0.4/1.5 MBProgress (1): 0.4/1.5 MBProgress (1): 0.4/1.5 MBProgress (1): 0.4/1.5 MBProgress (1): 0.4/1.5 MBProgress (1): 0.4/1.5 MBProgress (1): 0.4/1.5 MBProgress (1): 0.4/1.5 MBProgress (1): 0.4/1.5 MBProgress (1): 0.4/1.5 MBProgress (1): 0.4/1.5 MBProgress (1): 0.4/1.5 MBProgress (1): 0.4/1.5 MBProgress (1): 0.4/1.5 MBProgress (1): 0.4/1.5 MBProgress (1): 0.4/1.5 MBProgress (1): 0.4/1.5 MBProgress (1): 0.4/1.5 MBProgress (1): 0.4/1.5 MBProgress (1): 0.4/1.5 MBProgress (1): 0.4/1.5 MBProgress (1): 0.4/1.5 MBProgress (1): 0.4/1.5 MBProgress (1): 0.4/1.5 MBProgress (1): 0.4/1.5 MBProgress (1): 0.4/1.5 MBProgress (1): 0.4/1.5 MBProgress (1): 0.4/1.5 MBProgress (1): 0.4/1.5 MBProgress (1): 0.4/1.5 MBProgress (1): 0.4/1.5 MBProgress (1): 0.4/1.5 MBProgress (1): 0.4/1.5 MBProgress (1): 0.4/1.5 MBProgress (1): 0.4/1.5 MBProgress (1): 0.4/1.5 MBProgress (1): 0.4/1.5 MBProgress (1): 0.4/1.5 MBProgress (1): 0.4/1.5 MBProgress (1): 0.4/1.5 MBProgress (1): 0.4/1.5 MBProgress (1): 0.4/1.5 MBProgress (1): 0.4/1.5 MBProgress (1): 0.4/1.5 MBProgress (1): 0.5/1.5 MBProgress (1): 0.5/1.5 MBProgress (1): 0.5/1.5 MBProgress (1): 0.5/1.5 MBProgress (1): 0.5/1.5 MBProgress (1): 0.5/1.5 MBProgress (1): 0.5/1.5 MBProgress (1): 0.5/1.5 MBProgress (1): 0.5/1.5 MBProgress (1): 0.5/1.5 MBProgress (1): 0.5/1.5 MBProgress (1): 0.5/1.5 MBProgress (1): 0.5/1.5 MBProgress (1): 0.5/1.5 MBProgress (1): 0.5/1.5 MBProgress (1): 0.5/1.5 MBProgress (1): 0.5/1.5 MBProgress (1): 0.5/1.5 MBProgress (1): 0.5/1.5 MBProgress (1): 0.5/1.5 MBProgress (1): 0.5/1.5 MBProgress (1): 0.5/1.5 MBProgress (1): 0.5/1.5 MBProgress (1): 0.5/1.5 MBProgress (1): 0.5/1.5 MBProgress (1): 0.5/1.5 MBProgress (1): 0.5/1.5 MBProgress (1): 0.5/1.5 MBProgress (1): 0.5/1.5 MBProgress (1): 0.5/1.5 MBProgress (1): 0.5/1.5 MBProgress (1): 0.5/1.5 MBProgress (1): 0.5/1.5 MBProgress (1): 0.5/1.5 MBProgress (1): 0.5/1.5 MBProgress (1): 0.5/1.5 MBProgress (1): 0.5/1.5 MBProgress (1): 0.5/1.5 MBProgress (1): 0.5/1.5 MBProgress (1): 0.5/1.5 MBProgress (1): 0.5/1.5 MBProgress (1): 0.5/1.5 MBProgress (1): 0.5/1.5 MBProgress (1): 0.5/1.5 MBProgress (1): 0.5/1.5 MBProgress (1): 0.5/1.5 MBProgress (1): 0.5/1.5 MBProgress (1): 0.5/1.5 MBProgress (1): 0.5/1.5 MBProgress (1): 0.6/1.5 MBProgress (1): 0.6/1.5 MBProgress (1): 0.6/1.5 MBProgress (1): 0.6/1.5 MBProgress (1): 0.6/1.5 MBProgress (1): 0.6/1.5 MBProgress (1): 0.6/1.5 MBProgress (1): 0.6/1.5 MBProgress (1): 0.6/1.5 MBProgress (1): 0.6/1.5 MBProgress (1): 0.6/1.5 MBProgress (1): 0.6/1.5 MBProgress (1): 0.6/1.5 MBProgress (1): 0.6/1.5 MBProgress (1): 0.6/1.5 MBProgress (1): 0.6/1.5 MBProgress (1): 0.6/1.5 MBProgress (1): 0.6/1.5 MBProgress (1): 0.6/1.5 MBProgress (1): 0.6/1.5 MBProgress (1): 0.6/1.5 MBProgress (1): 0.6/1.5 MBProgress (1): 0.6/1.5 MBProgress (1): 0.6/1.5 MBProgress (1): 0.6/1.5 MBProgress (1): 0.6/1.5 MBProgress (1): 0.6/1.5 MBProgress (1): 0.6/1.5 MBProgress (1): 0.6/1.5 MBProgress (1): 0.6/1.5 MBProgress (1): 0.6/1.5 MBProgress (1): 0.6/1.5 MBProgress (1): 0.6/1.5 MBProgress (1): 0.6/1.5 MBProgress (1): 0.6/1.5 MBProgress (1): 0.6/1.5 MBProgress (1): 0.6/1.5 MBProgress (1): 0.6/1.5 MBProgress (1): 0.6/1.5 MBProgress (1): 0.6/1.5 MBProgress (1): 0.6/1.5 MBProgress (1): 0.6/1.5 MBProgress (1): 0.6/1.5 MBProgress (1): 0.6/1.5 MBProgress (1): 0.6/1.5 MBProgress (1): 0.6/1.5 MBProgress (1): 0.6/1.5 MBProgress (1): 0.6/1.5 MBProgress (1): 0.6/1.5 MBProgress (1): 0.7/1.5 MBProgress (1): 0.7/1.5 MBProgress (1): 0.7/1.5 MBProgress (1): 0.7/1.5 MBProgress (1): 0.7/1.5 MBProgress (1): 0.7/1.5 MBProgress (1): 0.7/1.5 MBProgress (1): 0.7/1.5 MBProgress (1): 0.7/1.5 MBProgress (1): 0.7/1.5 MBProgress (1): 0.7/1.5 MBProgress (1): 0.7/1.5 MBProgress (1): 0.7/1.5 MBProgress (1): 0.7/1.5 MBProgress (1): 0.7/1.5 MBProgress (1): 0.7/1.5 MBProgress (1): 0.7/1.5 MBProgress (1): 0.7/1.5 MBProgress (1): 0.7/1.5 MBProgress (1): 0.7/1.5 MBProgress (1): 0.7/1.5 MBProgress (1): 0.7/1.5 MBProgress (1): 0.7/1.5 MBProgress (1): 0.7/1.5 MBProgress (1): 0.7/1.5 MBProgress (1): 0.7/1.5 MBProgress (1): 0.7/1.5 MBProgress (1): 0.7/1.5 MBProgress (1): 0.7/1.5 MBProgress (1): 0.7/1.5 MBProgress (1): 0.7/1.5 MBProgress (1): 0.7/1.5 MBProgress (1): 0.7/1.5 MBProgress (1): 0.7/1.5 MBProgress (1): 0.7/1.5 MBProgress (1): 0.7/1.5 MBProgress (1): 0.7/1.5 MBProgress (1): 0.7/1.5 MBProgress (1): 0.7/1.5 MBProgress (1): 0.7/1.5 MBProgress (1): 0.7/1.5 MBProgress (1): 0.7/1.5 MBProgress (1): 0.7/1.5 MBProgress (1): 0.7/1.5 MBProgress (1): 0.7/1.5 MBProgress (1): 0.7/1.5 MBProgress (1): 0.7/1.5 MBProgress (1): 0.7/1.5 MBProgress (1): 0.7/1.5 MBProgress (1): 0.8/1.5 MBProgress (1): 0.8/1.5 MBProgress (1): 0.8/1.5 MBProgress (1): 0.8/1.5 MBProgress (1): 0.8/1.5 MBProgress (1): 0.8/1.5 MBProgress (1): 0.8/1.5 MBProgress (1): 0.8/1.5 MBProgress (1): 0.8/1.5 MBProgress (1): 0.8/1.5 MBProgress (1): 0.8/1.5 MBProgress (1): 0.8/1.5 MBProgress (1): 0.8/1.5 MBProgress (1): 0.8/1.5 MBProgress (1): 0.8/1.5 MBProgress (1): 0.8/1.5 MBProgress (1): 0.8/1.5 MBProgress (1): 0.8/1.5 MBProgress (1): 0.8/1.5 MBProgress (1): 0.8/1.5 MBProgress (1): 0.8/1.5 MBProgress (1): 0.8/1.5 MBProgress (1): 0.8/1.5 MBProgress (1): 0.8/1.5 MBProgress (1): 0.8/1.5 MBProgress (1): 0.8/1.5 MBProgress (1): 0.8/1.5 MBProgress (1): 0.8/1.5 MBProgress (1): 0.8/1.5 MBProgress (1): 0.8/1.5 MBProgress (1): 0.8/1.5 MBProgress (1): 0.8/1.5 MBProgress (1): 0.8/1.5 MBProgress (1): 0.8/1.5 MBProgress (1): 0.8/1.5 MBProgress (1): 0.8/1.5 MBProgress (1): 0.8/1.5 MBProgress (1): 0.8/1.5 MBProgress (1): 0.8/1.5 MBProgress (1): 0.8/1.5 MBProgress (1): 0.8/1.5 MBProgress (1): 0.8/1.5 MBProgress (1): 0.8/1.5 MBProgress (1): 0.8/1.5 MBProgress (1): 0.8/1.5 MBProgress (1): 0.8/1.5 MBProgress (1): 0.8/1.5 MBProgress (1): 0.8/1.5 MBProgress (1): 0.8/1.5 MBProgress (1): 0.9/1.5 MBProgress (1): 0.9/1.5 MBProgress (1): 0.9/1.5 MBProgress (1): 0.9/1.5 MBProgress (1): 0.9/1.5 MBProgress (1): 0.9/1.5 MBProgress (1): 0.9/1.5 MBProgress (1): 0.9/1.5 MBProgress (1): 0.9/1.5 MBProgress (1): 0.9/1.5 MBProgress (1): 0.9/1.5 MBProgress (1): 0.9/1.5 MBProgress (1): 0.9/1.5 MBProgress (1): 0.9/1.5 MBProgress (1): 0.9/1.5 MBProgress (1): 0.9/1.5 MBProgress (1): 0.9/1.5 MBProgress (1): 0.9/1.5 MBProgress (1): 0.9/1.5 MBProgress (1): 0.9/1.5 MBProgress (1): 0.9/1.5 MBProgress (1): 0.9/1.5 MBProgress (1): 0.9/1.5 MBProgress (1): 0.9/1.5 MBProgress (1): 0.9/1.5 MBProgress (1): 0.9/1.5 MBProgress (1): 0.9/1.5 MBProgress (1): 0.9/1.5 MBProgress (1): 0.9/1.5 MBProgress (1): 0.9/1.5 MBProgress (1): 0.9/1.5 MBProgress (1): 0.9/1.5 MBProgress (1): 0.9/1.5 MBProgress (1): 0.9/1.5 MBProgress (1): 0.9/1.5 MBProgress (1): 0.9/1.5 MBProgress (1): 0.9/1.5 MBProgress (1): 0.9/1.5 MBProgress (1): 0.9/1.5 MBProgress (1): 0.9/1.5 MBProgress (1): 0.9/1.5 MBProgress (1): 0.9/1.5 MBProgress (1): 0.9/1.5 MBProgress (1): 0.9/1.5 MBProgress (1): 0.9/1.5 MBProgress (1): 0.9/1.5 MBProgress (1): 0.9/1.5 MBProgress (1): 0.9/1.5 MBProgress (1): 1.0/1.5 MBProgress (1): 1.0/1.5 MBProgress (1): 1.0/1.5 MBProgress (1): 1.0/1.5 MBProgress (1): 1.0/1.5 MBProgress (1): 1.0/1.5 MBProgress (1): 1.0/1.5 MBProgress (1): 1.0/1.5 MBProgress (1): 1.0/1.5 MBProgress (1): 1.0/1.5 MBProgress (1): 1.0/1.5 MBProgress (1): 1.0/1.5 MBProgress (1): 1.0/1.5 MBProgress (1): 1.0/1.5 MBProgress (1): 1.0/1.5 MBProgress (1): 1.0/1.5 MBProgress (1): 1.0/1.5 MBProgress (1): 1.0/1.5 MBProgress (1): 1.0/1.5 MBProgress (1): 1.0/1.5 MBProgress (1): 1.0/1.5 MBProgress (1): 1.0/1.5 MBProgress (1): 1.0/1.5 MBProgress (1): 1.0/1.5 MBProgress (1): 1.0/1.5 MBProgress (1): 1.0/1.5 MBProgress (1): 1.0/1.5 MBProgress (1): 1.0/1.5 MBProgress (1): 1.0/1.5 MBProgress (1): 1.0/1.5 MBProgress (1): 1.0/1.5 MBProgress (1): 1.0/1.5 MBProgress (1): 1.0/1.5 MBProgress (1): 1.0/1.5 MBProgress (1): 1.0/1.5 MBProgress (1): 1.0/1.5 MBProgress (1): 1.0/1.5 MBProgress (1): 1.0/1.5 MBProgress (1): 1.0/1.5 MBProgress (1): 1.0/1.5 MBProgress (1): 1.0/1.5 MBProgress (1): 1.0/1.5 MBProgress (1): 1.0/1.5 MBProgress (1): 1.0/1.5 MBProgress (1): 1.0/1.5 MBProgress (1): 1.0/1.5 MBProgress (1): 1.0/1.5 MBProgress (1): 1.0/1.5 MBProgress (1): 1.0/1.5 MBProgress (1): 1.1/1.5 MBProgress (1): 1.1/1.5 MBProgress (1): 1.1/1.5 MBProgress (1): 1.1/1.5 MBProgress (1): 1.1/1.5 MBProgress (1): 1.1/1.5 MBProgress (1): 1.1/1.5 MBProgress (1): 1.1/1.5 MBProgress (1): 1.1/1.5 MBProgress (1): 1.1/1.5 MBProgress (1): 1.1/1.5 MBProgress (1): 1.1/1.5 MBProgress (1): 1.1/1.5 MBProgress (1): 1.1/1.5 MBProgress (1): 1.1/1.5 MBProgress (1): 1.1/1.5 MBProgress (1): 1.1/1.5 MBProgress (1): 1.1/1.5 MBProgress (1): 1.1/1.5 MBProgress (1): 1.1/1.5 MBProgress (1): 1.1/1.5 MBProgress (1): 1.1/1.5 MBProgress (1): 1.1/1.5 MBProgress (1): 1.1/1.5 MBProgress (1): 1.1/1.5 MBProgress (1): 1.1/1.5 MBProgress (1): 1.1/1.5 MBProgress (1): 1.1/1.5 MBProgress (1): 1.1/1.5 MBProgress (1): 1.1/1.5 MBProgress (1): 1.1/1.5 MBProgress (1): 1.1/1.5 MBProgress (1): 1.1/1.5 MBProgress (1): 1.1/1.5 MBProgress (1): 1.1/1.5 MBProgress (1): 1.1/1.5 MBProgress (1): 1.1/1.5 MBProgress (1): 1.1/1.5 MBProgress (1): 1.1/1.5 MBProgress (1): 1.1/1.5 MBProgress (1): 1.1/1.5 MBProgress (1): 1.1/1.5 MBProgress (1): 1.1/1.5 MBProgress (1): 1.1/1.5 MBProgress (1): 1.1/1.5 MBProgress (1): 1.1/1.5 MBProgress (1): 1.1/1.5 MBProgress (1): 1.1/1.5 MBProgress (1): 1.1/1.5 MBProgress (1): 1.2/1.5 MBProgress (1): 1.2/1.5 MBProgress (1): 1.2/1.5 MBProgress (1): 1.2/1.5 MBProgress (1): 1.2/1.5 MBProgress (1): 1.2/1.5 MBProgress (1): 1.2/1.5 MBProgress (1): 1.2/1.5 MBProgress (1): 1.2/1.5 MBProgress (1): 1.2/1.5 MBProgress (1): 1.2/1.5 MBProgress (1): 1.2/1.5 MBProgress (1): 1.2/1.5 MBProgress (1): 1.2/1.5 MBProgress (1): 1.2/1.5 MBProgress (1): 1.2/1.5 MBProgress (1): 1.2/1.5 MBProgress (1): 1.2/1.5 MBProgress (1): 1.2/1.5 MBProgress (1): 1.2/1.5 MBProgress (1): 1.2/1.5 MBProgress (1): 1.2/1.5 MBProgress (1): 1.2/1.5 MBProgress (1): 1.2/1.5 MBProgress (1): 1.2/1.5 MBProgress (1): 1.2/1.5 MBProgress (1): 1.2/1.5 MBProgress (1): 1.2/1.5 MBProgress (1): 1.2/1.5 MBProgress (1): 1.2/1.5 MBProgress (1): 1.2/1.5 MBProgress (1): 1.2/1.5 MBProgress (1): 1.2/1.5 MBProgress (1): 1.2/1.5 MBProgress (1): 1.2/1.5 MBProgress (1): 1.2/1.5 MBProgress (1): 1.2/1.5 MBProgress (1): 1.2/1.5 MBProgress (1): 1.2/1.5 MBProgress (1): 1.2/1.5 MBProgress (1): 1.2/1.5 MBProgress (1): 1.2/1.5 MBProgress (1): 1.2/1.5 MBProgress (1): 1.2/1.5 MBProgress (1): 1.2/1.5 MBProgress (1): 1.2/1.5 MBProgress (1): 1.2/1.5 MBProgress (1): 1.2/1.5 MBProgress (1): 1.2/1.5 MBProgress (1): 1.3/1.5 MBProgress (1): 1.3/1.5 MBProgress (1): 1.3/1.5 MBProgress (1): 1.3/1.5 MBProgress (1): 1.3/1.5 MBProgress (1): 1.3/1.5 MBProgress (1): 1.3/1.5 MBProgress (1): 1.3/1.5 MBProgress (1): 1.3/1.5 MBProgress (1): 1.3/1.5 MBProgress (1): 1.3/1.5 MBProgress (1): 1.3/1.5 MBProgress (1): 1.3/1.5 MBProgress (1): 1.3/1.5 MBProgress (1): 1.3/1.5 MBProgress (1): 1.3/1.5 MBProgress (1): 1.3/1.5 MBProgress (1): 1.3/1.5 MBProgress (1): 1.3/1.5 MBProgress (1): 1.3/1.5 MBProgress (1): 1.3/1.5 MBProgress (1): 1.3/1.5 MBProgress (1): 1.3/1.5 MBProgress (1): 1.3/1.5 MBProgress (1): 1.3/1.5 MBProgress (1): 1.3/1.5 MBProgress (1): 1.3/1.5 MBProgress (1): 1.3/1.5 MBProgress (1): 1.3/1.5 MBProgress (1): 1.3/1.5 MBProgress (1): 1.3/1.5 MBProgress (1): 1.3/1.5 MBProgress (1): 1.3/1.5 MBProgress (1): 1.3/1.5 MBProgress (1): 1.3/1.5 MBProgress (1): 1.3/1.5 MBProgress (1): 1.3/1.5 MBProgress (1): 1.3/1.5 MBProgress (1): 1.3/1.5 MBProgress (1): 1.3/1.5 MBProgress (1): 1.3/1.5 MBProgress (1): 1.3/1.5 MBProgress (1): 1.3/1.5 MBProgress (1): 1.3/1.5 MBProgress (1): 1.3/1.5 MBProgress (1): 1.3/1.5 MBProgress (1): 1.3/1.5 MBProgress (1): 1.3/1.5 MBProgress (1): 1.3/1.5 MBProgress (1): 1.4/1.5 MBProgress (1): 1.4/1.5 MBProgress (1): 1.4/1.5 MBProgress (1): 1.4/1.5 MBProgress (1): 1.4/1.5 MBProgress (1): 1.4/1.5 MBProgress (1): 1.4/1.5 MBProgress (1): 1.4/1.5 MBProgress (1): 1.4/1.5 MBProgress (1): 1.4/1.5 MBProgress (1): 1.4/1.5 MBProgress (1): 1.4/1.5 MBProgress (1): 1.4/1.5 MBProgress (1): 1.4/1.5 MBProgress (1): 1.4/1.5 MBProgress (1): 1.4/1.5 MBProgress (1): 1.4/1.5 MBProgress (1): 1.4/1.5 MBProgress (1): 1.4/1.5 MBProgress (1): 1.4/1.5 MBProgress (1): 1.4/1.5 MBProgress (1): 1.4/1.5 MBProgress (1): 1.4/1.5 MBProgress (1): 1.4/1.5 MBProgress (1): 1.4/1.5 MBProgress (1): 1.4/1.5 MBProgress (1): 1.4/1.5 MBProgress (1): 1.4/1.5 MBProgress (1): 1.4/1.5 MBProgress (1): 1.4/1.5 MBProgress (1): 1.4/1.5 MBProgress (1): 1.4/1.5 MBProgress (1): 1.4/1.5 MBProgress (1): 1.4/1.5 MBProgress (1): 1.4/1.5 MBProgress (1): 1.4/1.5 MBProgress (1): 1.4/1.5 MBProgress (1): 1.4/1.5 MBProgress (1): 1.4/1.5 MBProgress (1): 1.4/1.5 MBProgress (1): 1.4/1.5 MBProgress (1): 1.4/1.5 MBProgress (1): 1.4/1.5 MBProgress (1): 1.4/1.5 MBProgress (1): 1.4/1.5 MBProgress (1): 1.4/1.5 MBProgress (1): 1.4/1.5 MBProgress (1): 1.4/1.5 MBProgress (1): 1.4/1.5 MBProgress (1): 1.5/1.5 MBProgress (1): 1.5/1.5 MBProgress (1): 1.5/1.5 MBProgress (1): 1.5/1.5 MBProgress (1): 1.5/1.5 MBProgress (1): 1.5/1.5 MBProgress (1): 1.5/1.5 MBProgress (1): 1.5/1.5 MBProgress (1): 1.5/1.5 MBProgress (1): 1.5/1.5 MBProgress (1): 1.5/1.5 MBProgress (1): 1.5/1.5 MBProgress (1): 1.5/1.5 MBProgress (1): 1.5/1.5 MBProgress (1): 1.5/1.5 MBProgress (1): 1.5/1.5 MBProgress (1): 1.5/1.5 MBProgress (1): 1.5/1.5 MBProgress (1): 1.5/1.5 MBProgress (1): 1.5/1.5 MBProgress (1): 1.5/1.5 MBProgress (1): 1.5/1.5 MBProgress (1): 1.5/1.5 MBProgress (1): 1.5/1.5 MBProgress (1): 1.5/1.5 MBProgress (1): 1.5/1.5 MBProgress (1): 1.5/1.5 MBProgress (1): 1.5/1.5 MBProgress (1): 1.5/1.5 MBProgress (1): 1.5/1.5 MBProgress (1): 1.5/1.5 MBProgress (1): 1.5/1.5 MBProgress (1): 1.5 MB                        Uploaded to apache.snapshots.https: https://repository.apache.org/content/repositories/snapshots/org/apache/openjpa/openjpa-kernel/3.1.2-SNAPSHOT/openjpa-kernel-3.1.2-20200314.064605-2.jar (1.5 MB at 908 kB/s)
Uploading to apache.snapshots.https: https://repository.apache.org/content/repositories/snapshots/org/apache/openjpa/openjpa-kernel/3.1.2-SNAPSHOT/openjpa-kernel-3.1.2-20200314.064605-2.pom
Progress (1): 2.0/6.9 kBProgress (1): 4.1/6.9 kBProgress (1): 6.1/6.9 kBProgress (1): 6.9 kB                        Uploaded to apache.snapshots.https: https://repository.apache.org/content/repositories/snapshots/org/apache/openjpa/openjpa-kernel/3.1.2-SNAPSHOT/openjpa-kernel-3.1.2-20200314.064605-2.pom (6.9 kB at 6.2 kB/s)
Downloading from apache.snapshots.https: https://repository.apache.org/content/repositories/snapshots/org/apache/openjpa/openjpa-kernel/maven-metadata.xml
Progress (1): 695 B                   Downloaded from apache.snapshots.https: https://repository.apache.org/content/repositories/snapshots/org/apache/openjpa/openjpa-kernel/maven-metadata.xml (695 B at 1.1 kB/s)
Uploading to apache.snapshots.https: https://repository.apache.org/content/repositories/snapshots/org/apache/openjpa/openjpa-kernel/3.1.2-SNAPSHOT/maven-metadata.xml
Progress (1): 994 B                   Uploaded to apache.snapshots.https: https://repository.apache.org/content/repositories/snapshots/org/apache/openjpa/openjpa-kernel/3.1.2-SNAPSHOT/maven-metadata.xml (994 B at 897 B/s)
Uploading to apache.snapshots.https: https://repository.apache.org/content/repositories/snapshots/org/apache/openjpa/openjpa-kernel/maven-metadata.xml
Progress (1): 674 B                   Uploaded to apache.snapshots.https: https://repository.apache.org/content/repositories/snapshots/org/apache/openjpa/openjpa-kernel/maven-metadata.xml (674 B at 615 B/s)
Uploading to apache.snapshots.https: https://repository.apache.org/content/repositories/snapshots/org/apache/openjpa/openjpa-kernel/3.1.2-SNAPSHOT/openjpa-kernel-3.1.2-20200314.064605-2-tests.jar
Progress (1): 2.0/57 kBProgress (1): 4.1/57 kBProgress (1): 6.1/57 kBProgress (1): 8.2/57 kBProgress (1): 10/57 kB Progress (1): 12/57 kBProgress (1): 14/57 kBProgress (1): 16/57 kBProgress (1): 18/57 kBProgress (1): 20/57 kBProgress (1): 23/57 kBProgress (1): 25/57 kBProgress (1): 27/57 kBProgress (1): 29/57 kBProgress (1): 31/57 kBProgress (1): 33/57 kBProgress (1): 35/57 kBProgress (1): 37/57 kBProgress (1): 39/57 kBProgress (1): 41/57 kBProgress (1): 43/57 kBProgress (1): 45/57 kBProgress (1): 47/57 kBProgress (1): 49/57 kBProgress (1): 51/57 kBProgress (1): 53/57 kBProgress (1): 55/57 kBProgress (1): 57 kB                      Uploaded to apache.snapshots.https: https://repository.apache.org/content/repositories/snapshots/org/apache/openjpa/openjpa-kernel/3.1.2-SNAPSHOT/openjpa-kernel-3.1.2-20200314.064605-2-tests.jar (57 kB at 46 kB/s)
Uploading to apache.snapshots.https: https://repository.apache.org/content/repositories/snapshots/org/apache/openjpa/openjpa-kernel/3.1.2-SNAPSHOT/maven-metadata.xml
Progress (1): 994 B                   Uploaded to apache.snapshots.https: https://repository.apache.org/content/repositories/snapshots/org/apache/openjpa/openjpa-kernel/3.1.2-SNAPSHOT/maven-metadata.xml (994 B at 878 B/s)
[INFO] 
[INFO] ------------------< org.apache.openjpa:openjpa-jdbc >-------------------
[INFO] Building OpenJPA JDBC 3.1.2-SNAPSHOT                              [4/30]
[INFO] --------------------------------[ jar ]---------------------------------
[INFO] 
[INFO] --- maven-clean-plugin:3.1.0:clean (default-clean) @ openjpa-jdbc ---
[INFO] 
[INFO] --- buildnumber-maven-plugin:1.4:create (default) @ openjpa-jdbc ---
[INFO] 
[INFO] --- maven-enforcer-plugin:1.4.1:enforce (enforce-maven-version) @ openjpa-jdbc ---
[INFO] 
[INFO] --- maven-enforcer-plugin:1.4.1:enforce (default) @ openjpa-jdbc ---
[INFO] 
[INFO] --- maven-checkstyle-plugin:3.0.0:checkstyle (default) @ openjpa-jdbc ---
[INFO] Starting audit...
Audit done.
[WARNING] Unable to locate Source XRef to link to - DISABLED
[INFO] 
[INFO] --- maven-remote-resources-plugin:1.5:process (process-resource-bundles) @ openjpa-jdbc ---
[INFO] 
[INFO] --- maven-resources-plugin:3.1.0:resources (default-resources) @ openjpa-jdbc ---
[INFO] Using 'UTF-8' encoding to copy filtered resources.
[INFO] Copying 14 resources
[INFO] Copying 3 resources
[INFO] 
[INFO] --- maven-compiler-plugin:3.8.0:compile (default-compile) @ openjpa-jdbc ---
[INFO] Changes detected - recompiling the module!
[INFO] Compiling 364 source files to <https://builds.apache.org/job/OpenJPA-Trunk-Deploy/ws/openjpa-jdbc/target/classes>
[INFO] <https://builds.apache.org/job/OpenJPA-Trunk-Deploy/ws/openjpa-jdbc/src/main/java/org/apache/openjpa/jdbc/kernel/JDBCStoreQuery.java>: Some input files use or override a deprecated API.
[INFO] <https://builds.apache.org/job/OpenJPA-Trunk-Deploy/ws/openjpa-jdbc/src/main/java/org/apache/openjpa/jdbc/kernel/JDBCStoreQuery.java>: Recompile with -Xlint:deprecation for details.
[INFO] <https://builds.apache.org/job/OpenJPA-Trunk-Deploy/ws/openjpa-jdbc/src/main/java/org/apache/openjpa/jdbc/meta/PropertiesReverseCustomizer.java>: Some input files use unchecked or unsafe operations.
[INFO] <https://builds.apache.org/job/OpenJPA-Trunk-Deploy/ws/openjpa-jdbc/src/main/java/org/apache/openjpa/jdbc/meta/PropertiesReverseCustomizer.java>: Recompile with -Xlint:unchecked for details.
[INFO] 
[INFO] --- maven-compiler-plugin:3.8.0:testCompile (test-source-compile) @ openjpa-jdbc ---
[INFO] Changes detected - recompiling the module!
[INFO] Compiling 9 source files to <https://builds.apache.org/job/OpenJPA-Trunk-Deploy/ws/openjpa-jdbc/target/test-classes>
[INFO] <https://builds.apache.org/job/OpenJPA-Trunk-Deploy/ws/openjpa-jdbc/src/test/java/org/apache/openjpa/jdbc/sql/TestBooleanRepresentation.java>: Some input files use or override a deprecated API.
[INFO] <https://builds.apache.org/job/OpenJPA-Trunk-Deploy/ws/openjpa-jdbc/src/test/java/org/apache/openjpa/jdbc/sql/TestBooleanRepresentation.java>: Recompile with -Xlint:deprecation for details.
[INFO] <https://builds.apache.org/job/OpenJPA-Trunk-Deploy/ws/openjpa-jdbc/src/test/java/org/apache/openjpa/jdbc/sql/TestBooleanRepresentation.java>: Some input files use unchecked or unsafe operations.
[INFO] <https://builds.apache.org/job/OpenJPA-Trunk-Deploy/ws/openjpa-jdbc/src/test/java/org/apache/openjpa/jdbc/sql/TestBooleanRepresentation.java>: Recompile with -Xlint:unchecked for details.
[INFO] 
[INFO] --- maven-resources-plugin:3.1.0:testResources (default-testResources) @ openjpa-jdbc ---
[INFO] Using 'UTF-8' encoding to copy filtered resources.
[INFO] skip non existing resourceDirectory <https://builds.apache.org/job/OpenJPA-Trunk-Deploy/ws/openjpa-jdbc/src/test/resources>
[INFO] Copying 3 resources
[INFO] 
[INFO] --- maven-compiler-plugin:3.8.0:testCompile (default-testCompile) @ openjpa-jdbc ---
[INFO] Changes detected - recompiling the module!
[INFO] Compiling 9 source files to <https://builds.apache.org/job/OpenJPA-Trunk-Deploy/ws/openjpa-jdbc/target/test-classes>
[INFO] <https://builds.apache.org/job/OpenJPA-Trunk-Deploy/ws/openjpa-jdbc/src/test/java/org/apache/openjpa/jdbc/sql/TestBooleanRepresentation.java>: Some input files use or override a deprecated API.
[INFO] <https://builds.apache.org/job/OpenJPA-Trunk-Deploy/ws/openjpa-jdbc/src/test/java/org/apache/openjpa/jdbc/sql/TestBooleanRepresentation.java>: Recompile with -Xlint:deprecation for details.
[INFO] <https://builds.apache.org/job/OpenJPA-Trunk-Deploy/ws/openjpa-jdbc/src/test/java/org/apache/openjpa/jdbc/sql/TestBooleanRepresentation.java>: Some input files use unchecked or unsafe operations.
[INFO] <https://builds.apache.org/job/OpenJPA-Trunk-Deploy/ws/openjpa-jdbc/src/test/java/org/apache/openjpa/jdbc/sql/TestBooleanRepresentation.java>: Recompile with -Xlint:unchecked for details.
[INFO] 
[INFO] --- maven-surefire-plugin:2.22.0:test (default-test) @ openjpa-jdbc ---
[INFO] Tests are skipped.
[INFO] 
[INFO] --- maven-jar-plugin:3.1.0:jar (default-jar) @ openjpa-jdbc ---
[INFO] Building jar: <https://builds.apache.org/job/OpenJPA-Trunk-Deploy/ws/openjpa-jdbc/target/openjpa-jdbc-3.1.2-SNAPSHOT.jar>
[INFO] 
[INFO] --- maven-site-plugin:3.7.1:attach-descriptor (attach-descriptor) @ openjpa-jdbc ---
[INFO] Skipping because packaging 'jar' is not pom.
[INFO] 
[INFO] --- maven-jar-plugin:3.1.0:test-jar (attach-tests) @ openjpa-jdbc ---
[INFO] Building jar: <https://builds.apache.org/job/OpenJPA-Trunk-Deploy/ws/openjpa-jdbc/target/openjpa-jdbc-3.1.2-SNAPSHOT-tests.jar>
[INFO] 
[INFO] --- apache-rat-plugin:0.12:check (default) @ openjpa-jdbc ---
[INFO] Enabled default license matchers.
[INFO] Will parse SCM ignores for exclusions...
[INFO] Finished adding exclusions from SCM ignore files.
[INFO] 61 implicit excludes (use -debug for more details).
[INFO] Exclude: **/.*/**
[INFO] Exclude: **/target/**/*
[INFO] 391 resources included (use -debug for more details)
[INFO] Rat check: Summary over all files. Unapproved: 0, unknown: 0, generated: 0, approved: 391 licenses.
[INFO] 
[INFO] --- maven-install-plugin:2.5.2:install (default-install) @ openjpa-jdbc ---
[INFO] Installing <https://builds.apache.org/job/OpenJPA-Trunk-Deploy/ws/openjpa-jdbc/target/openjpa-jdbc-3.1.2-SNAPSHOT.jar> to /home/jenkins/.m2/repository/org/apache/openjpa/openjpa-jdbc/3.1.2-SNAPSHOT/openjpa-jdbc-3.1.2-SNAPSHOT.jar
[INFO] Installing <https://builds.apache.org/job/OpenJPA-Trunk-Deploy/ws/openjpa-jdbc/pom.xml> to /home/jenkins/.m2/repository/org/apache/openjpa/openjpa-jdbc/3.1.2-SNAPSHOT/openjpa-jdbc-3.1.2-SNAPSHOT.pom
[INFO] Installing <https://builds.apache.org/job/OpenJPA-Trunk-Deploy/ws/openjpa-jdbc/target/openjpa-jdbc-3.1.2-SNAPSHOT-tests.jar> to /home/jenkins/.m2/repository/org/apache/openjpa/openjpa-jdbc/3.1.2-SNAPSHOT/openjpa-jdbc-3.1.2-SNAPSHOT-tests.jar
[INFO] 
[INFO] --- maven-deploy-plugin:2.8.2:deploy (default-deploy) @ openjpa-jdbc ---
Downloading from apache.snapshots.https: https://repository.apache.org/content/repositories/snapshots/org/apache/openjpa/openjpa-jdbc/3.1.2-SNAPSHOT/maven-metadata.xml
Progress (1): 992 B                   Downloaded from apache.snapshots.https: https://repository.apache.org/content/repositories/snapshots/org/apache/openjpa/openjpa-jdbc/3.1.2-SNAPSHOT/maven-metadata.xml (992 B at 1.6 kB/s)
Uploading to apache.snapshots.https: https://repository.apache.org/content/repositories/snapshots/org/apache/openjpa/openjpa-jdbc/3.1.2-SNAPSHOT/openjpa-jdbc-3.1.2-20200314.064621-2.jar
Progress (1): 0/1.5 MBProgress (1): 0/1.5 MBProgress (1): 0/1.5 MBProgress (1): 0/1.5 MBProgress (1): 0/1.5 MBProgress (1): 0/1.5 MBProgress (1): 0/1.5 MBProgress (1): 0/1.5 MBProgress (1): 0/1.5 MBProgress (1): 0/1.5 MBProgress (1): 0/1.5 MBProgress (1): 0/1.5 MBProgress (1): 0/1.5 MBProgress (1): 0/1.5 MBProgress (1): 0/1.5 MBProgress (1): 0/1.5 MBProgress (1): 0/1.5 MBProgress (1): 0/1.5 MBProgress (1): 0/1.5 MBProgress (1): 0/1.5 MBProgress (1): 0/1.5 MBProgress (1): 0/1.5 MBProgress (1): 0/1.5 MBProgress (1): 0/1.5 MBProgress (1): 0.1/1.5 MBProgress (1): 0.1/1.5 MBProgress (1): 0.1/1.5 MBProgress (1): 0.1/1.5 MBProgress (1): 0.1/1.5 MBProgress (1): 0.1/1.5 MBProgress (1): 0.1/1.5 MBProgress (1): 0.1/1.5 MBProgress (1): 0.1/1.5 MBProgress (1): 0.1/1.5 MBProgress (1): 0.1/1.5 MBProgress (1): 0.1/1.5 MBProgress (1): 0.1/1.5 MBProgress (1): 0.1/1.5 MBProgress (1): 0.1/1.5 MBProgress (1): 0.1/1.5 MBProgress (1): 0.1/1.5 MBProgress (1): 0.1/1.5 MBProgress (1): 0.1/1.5 MBProgress (1): 0.1/1.5 MBProgress (1): 0.1/1.5 MBProgress (1): 0.1/1.5 MBProgress (1): 0.1/1.5 MBProgress (1): 0.1/1.5 MBProgress (1): 0.1/1.5 MBProgress (1): 0.1/1.5 MBProgress (1): 0.1/1.5 MBProgress (1): 0.1/1.5 MBProgress (1): 0.1/1.5 MBProgress (1): 0.1/1.5 MBProgress (1): 0.1/1.5 MBProgress (1): 0.1/1.5 MBProgress (1): 0.1/1.5 MBProgress (1): 0.1/1.5 MBProgress (1): 0.1/1.5 MBProgress (1): 0.1/1.5 MBProgress (1): 0.1/1.5 MBProgress (1): 0.1/1.5 MBProgress (1): 0.1/1.5 MBProgress (1): 0.1/1.5 MBProgress (1): 0.1/1.5 MBProgress (1): 0.1/1.5 MBProgress (1): 0.1/1.5 MBProgress (1): 0.1/1.5 MBProgress (1): 0.1/1.5 MBProgress (1): 0.1/1.5 MBProgress (1): 0.1/1.5 MBProgress (1): 0.1/1.5 MBProgress (1): 0.1/1.5 MBProgress (1): 0.2/1.5 MBProgress (1): 0.2/1.5 MBProgress (1): 0.2/1.5 MBProgress (1): 0.2/1.5 MBProgress (1): 0.2/1.5 MBProgress (1): 0.2/1.5 MBProgress (1): 0.2/1.5 MBProgress (1): 0.2/1.5 MBProgress (1): 0.2/1.5 MBProgress (1): 0.2/1.5 MBProgress (1): 0.2/1.5 MBProgress (1): 0.2/1.5 MBProgress (1): 0.2/1.5 MBProgress (1): 0.2/1.5 MBProgress (1): 0.2/1.5 MBProgress (1): 0.2/1.5 MBProgress (1): 0.2/1.5 MBProgress (1): 0.2/1.5 MBProgress (1): 0.2/1.5 MBProgress (1): 0.2/1.5 MBProgress (1): 0.2/1.5 MBProgress (1): 0.2/1.5 MBProgress (1): 0.2/1.5 MBProgress (1): 0.2/1.5 MBProgress (1): 0.2/1.5 MBProgress (1): 0.2/1.5 MBProgress (1): 0.2/1.5 MBProgress (1): 0.2/1.5 MBProgress (1): 0.2/1.5 MBProgress (1): 0.2/1.5 MBProgress (1): 0.2/1.5 MBProgress (1): 0.2/1.5 MBProgress (1): 0.2/1.5 MBProgress (1): 0.2/1.5 MBProgress (1): 0.2/1.5 MBProgress (1): 0.2/1.5 MBProgress (1): 0.2/1.5 MBProgress (1): 0.2/1.5 MBProgress (1): 0.2/1.5 MBProgress (1): 0.2/1.5 MBProgress (1): 0.2/1.5 MBProgress (1): 0.2/1.5 MBProgress (1): 0.2/1.5 MBProgress (1): 0.2/1.5 MBProgress (1): 0.2/1.5 MBProgress (1): 0.2/1.5 MBProgress (1): 0.2/1.5 MBProgress (1): 0.2/1.5 MBProgress (1): 0.2/1.5 MBProgress (1): 0.3/1.5 MBProgress (1): 0.3/1.5 MBProgress (1): 0.3/1.5 MBProgress (1): 0.3/1.5 MBProgress (1): 0.3/1.5 MBProgress (1): 0.3/1.5 MBProgress (1): 0.3/1.5 MBProgress (1): 0.3/1.5 MBProgress (1): 0.3/1.5 MBProgress (1): 0.3/1.5 MBProgress (1): 0.3/1.5 MBProgress (1): 0.3/1.5 MBProgress (1): 0.3/1.5 MBProgress (1): 0.3/1.5 MBProgress (1): 0.3/1.5 MBProgress (1): 0.3/1.5 MBProgress (1): 0.3/1.5 MBProgress (1): 0.3/1.5 MBProgress (1): 0.3/1.5 MBProgress (1): 0.3/1.5 MBProgress (1): 0.3/1.5 MBProgress (1): 0.3/1.5 MBProgress (1): 0.3/1.5 MBProgress (1): 0.3/1.5 MBProgress (1): 0.3/1.5 MBProgress (1): 0.3/1.5 MBProgress (1): 0.3/1.5 MBProgress (1): 0.3/1.5 MBProgress (1): 0.3/1.5 MBProgress (1): 0.3/1.5 MBProgress (1): 0.3/1.5 MBProgress (1): 0.3/1.5 MBProgress (1): 0.3/1.5 MBProgress (1): 0.3/1.5 MBProgress (1): 0.3/1.5 MBProgress (1): 0.3/1.5 MBProgress (1): 0.3/1.5 MBProgress (1): 0.3/1.5 MBProgress (1): 0.3/1.5 MBProgress (1): 0.3/1.5 MBProgress (1): 0.3/1.5 MBProgress (1): 0.3/1.5 MBProgress (1): 0.3/1.5 MBProgress (1): 0.3/1.5 MBProgress (1): 0.3/1.5 MBProgress (1): 0.3/1.5 MBProgress (1): 0.3/1.5 MBProgress (1): 0.3/1.5 MBProgress (1): 0.4/1.5 MBProgress (1): 0.4/1.5 MBProgress (1): 0.4/1.5 MBProgress (1): 0.4/1.5 MBProgress (1): 0.4/1.5 MBProgress (1): 0.4/1.5 MBProgress (1): 0.4/1.5 MBProgress (1): 0.4/1.5 MBProgress (1): 0.4/1.5 MBProgress (1): 0.4/1.5 MBProgress (1): 0.4/1.5 MBProgress (1): 0.4/1.5 MBProgress (1): 0.4/1.5 MBProgress (1): 0.4/1.5 MBProgress (1): 0.4/1.5 MBProgress (1): 0.4/1.5 MBProgress (1): 0.4/1.5 MBProgress (1): 0.4/1.5 MBProgress (1): 0.4/1.5 MBProgress (1): 0.4/1.5 MBProgress (1): 0.4/1.5 MBProgress (1): 0.4/1.5 MBProgress (1): 0.4/1.5 MBProgress (1): 0.4/1.5 MBProgress (1): 0.4/1.5 MBProgress (1): 0.4/1.5 MBProgress (1): 0.4/1.5 MBProgress (1): 0.4/1.5 MBProgress (1): 0.4/1.5 MBProgress (1): 0.4/1.5 MBProgress (1): 0.4/1.5 MBProgress (1): 0.4/1.5 MBProgress (1): 0.4/1.5 MBProgress (1): 0.4/1.5 MBProgress (1): 0.4/1.5 MBProgress (1): 0.4/1.5 MBProgress (1): 0.4/1.5 MBProgress (1): 0.4/1.5 MBProgress (1): 0.4/1.5 MBProgress (1): 0.4/1.5 MBProgress (1): 0.4/1.5 MBProgress (1): 0.4/1.5 MBProgress (1): 0.4/1.5 MBProgress (1): 0.4/1.5 MBProgress (1): 0.4/1.5 MBProgress (1): 0.4/1.5 MBProgress (1): 0.4/1.5 MBProgress (1): 0.4/1.5 MBProgress (1): 0.4/1.5 MBProgress (1): 0.5/1.5 MBProgress (1): 0.5/1.5 MBProgress (1): 0.5/1.5 MBProgress (1): 0.5/1.5 MBProgress (1): 0.5/1.5 MBProgress (1): 0.5/1.5 MBProgress (1): 0.5/1.5 MBProgress (1): 0.5/1.5 MBProgress (1): 0.5/1.5 MBProgress (1): 0.5/1.5 MBProgress (1): 0.5/1.5 MBProgress (1): 0.5/1.5 MBProgress (1): 0.5/1.5 MBProgress (1): 0.5/1.5 MBProgress (1): 0.5/1.5 MBProgress (1): 0.5/1.5 MBProgress (1): 0.5/1.5 MBProgress (1): 0.5/1.5 MBProgress (1): 0.5/1.5 MBProgress (1): 0.5/1.5 MBProgress (1): 0.5/1.5 MBProgress (1): 0.5/1.5 MBProgress (1): 0.5/1.5 MBProgress (1): 0.5/1.5 MBProgress (1): 0.5/1.5 MBProgress (1): 0.5/1.5 MBProgress (1): 0.5/1.5 MBProgress (1): 0.5/1.5 MBProgress (1): 0.5/1.5 MBProgress (1): 0.5/1.5 MBProgress (1): 0.5/1.5 MBProgress (1): 0.5/1.5 MBProgress (1): 0.5/1.5 MBProgress (1): 0.5/1.5 MBProgress (1): 0.5/1.5 MBProgress (1): 0.5/1.5 MBProgress (1): 0.5/1.5 MBProgress (1): 0.5/1.5 MBProgress (1): 0.5/1.5 MBProgress (1): 0.5/1.5 MBProgress (1): 0.5/1.5 MBProgress (1): 0.5/1.5 MBProgress (1): 0.5/1.5 MBProgress (1): 0.5/1.5 MBProgress (1): 0.5/1.5 MBProgress (1): 0.5/1.5 MBProgress (1): 0.5/1.5 MBProgress (1): 0.5/1.5 MBProgress (1): 0.5/1.5 MBProgress (1): 0.6/1.5 MBProgress (1): 0.6/1.5 MBProgress (1): 0.6/1.5 MBProgress (1): 0.6/1.5 MBProgress (1): 0.6/1.5 MBProgress (1): 0.6/1.5 MBProgress (1): 0.6/1.5 MBProgress (1): 0.6/1.5 MBProgress (1): 0.6/1.5 MBProgress (1): 0.6/1.5 MBProgress (1): 0.6/1.5 MBProgress (1): 0.6/1.5 MBProgress (1): 0.6/1.5 MBProgress (1): 0.6/1.5 MBProgress (1): 0.6/1.5 MBProgress (1): 0.6/1.5 MBProgress (1): 0.6/1.5 MBProgress (1): 0.6/1.5 MBProgress (1): 0.6/1.5 MBProgress (1): 0.6/1.5 MBProgress (1): 0.6/1.5 MBProgress (1): 0.6/1.5 MBProgress (1): 0.6/1.5 MBProgress (1): 0.6/1.5 MBProgress (1): 0.6/1.5 MBProgress (1): 0.6/1.5 MBProgress (1): 0.6/1.5 MBProgress (1): 0.6/1.5 MBProgress (1): 0.6/1.5 MBProgress (1): 0.6/1.5 MBProgress (1): 0.6/1.5 MBProgress (1): 0.6/1.5 MBProgress (1): 0.6/1.5 MBProgress (1): 0.6/1.5 MBProgress (1): 0.6/1.5 MBProgress (1): 0.6/1.5 MBProgress (1): 0.6/1.5 MBProgress (1): 0.6/1.5 MBProgress (1): 0.6/1.5 MBProgress (1): 0.6/1.5 MBProgress (1): 0.6/1.5 MBProgress (1): 0.6/1.5 MBProgress (1): 0.6/1.5 MBProgress (1): 0.6/1.5 MBProgress (1): 0.6/1.5 MBProgress (1): 0.6/1.5 MBProgress (1): 0.6/1.5 MBProgress (1): 0.6/1.5 MBProgress (1): 0.6/1.5 MBProgress (1): 0.7/1.5 MBProgress (1): 0.7/1.5 MBProgress (1): 0.7/1.5 MBProgress (1): 0.7/1.5 MBProgress (1): 0.7/1.5 MBProgress (1): 0.7/1.5 MBProgress (1): 0.7/1.5 MBProgress (1): 0.7/1.5 MBProgress (1): 0.7/1.5 MBProgress (1): 0.7/1.5 MBProgress (1): 0.7/1.5 MBProgress (1): 0.7/1.5 MBProgress (1): 0.7/1.5 MBProgress (1): 0.7/1.5 MBProgress (1): 0.7/1.5 MBProgress (1): 0.7/1.5 MBProgress (1): 0.7/1.5 MBProgress (1): 0.7/1.5 MBProgress (1): 0.7/1.5 MBProgress (1): 0.7/1.5 MBProgress (1): 0.7/1.5 MBProgress (1): 0.7/1.5 MBProgress (1): 0.7/1.5 MBProgress (1): 0.7/1.5 MBProgress (1): 0.7/1.5 MBProgress (1): 0.7/1.5 MBProgress (1): 0.7/1.5 MBProgress (1): 0.7/1.5 MBProgress (1): 0.7/1.5 MBProgress (1): 0.7/1.5 MBProgress (1): 0.7/1.5 MBProgress (1): 0.7/1.5 MBProgress (1): 0.7/1.5 MBProgress (1): 0.7/1.5 MBProgress (1): 0.7/1.5 MBProgress (1): 0.7/1.5 MBProgress (1): 0.7/1.5 MBProgress (1): 0.7/1.5 MBProgress (1): 0.7/1.5 MBProgress (1): 0.7/1.5 MBProgress (1): 0.7/1.5 MBProgress (1): 0.7/1.5 MBProgress (1): 0.7/1.5 MBProgress (1): 0.7/1.5 MBProgress (1): 0.7/1.5 MBProgress (1): 0.7/1.5 MBProgress (1): 0.7/1.5 MBProgress (1): 0.7/1.5 MBProgress (1): 0.7/1.5 MBProgress (1): 0.8/1.5 MBProgress (1): 0.8/1.5 MBProgress (1): 0.8/1.5 MBProgress (1): 0.8/1.5 MBProgress (1): 0.8/1.5 MBProgress (1): 0.8/1.5 MBProgress (1): 0.8/1.5 MBProgress (1): 0.8/1.5 MBProgress (1): 0.8/1.5 MBProgress (1): 0.8/1.5 MBProgress (1): 0.8/1.5 MBProgress (1): 0.8/1.5 MBProgress (1): 0.8/1.5 MBProgress (1): 0.8/1.5 MBProgress (1): 0.8/1.5 MBProgress (1): 0.8/1.5 MBProgress (1): 0.8/1.5 MBProgress (1): 0.8/1.5 MBProgress (1): 0.8/1.5 MBProgress (1): 0.8/1.5 MBProgress (1): 0.8/1.5 MBProgress (1): 0.8/1.5 MBProgress (1): 0.8/1.5 MBProgress (1): 0.8/1.5 MBProgress (1): 0.8/1.5 MBProgress (1): 0.8/1.5 MBProgress (1): 0.8/1.5 MBProgress (1): 0.8/1.5 MBProgress (1): 0.8/1.5 MBProgress (1): 0.8/1.5 MBProgress (1): 0.8/1.5 MBProgress (1): 0.8/1.5 MBProgress (1): 0.8/1.5 MBProgress (1): 0.8/1.5 MBProgress (1): 0.8/1.5 MBProgress (1): 0.8/1.5 MBProgress (1): 0.8/1.5 MBProgress (1): 0.8/1.5 MBProgress (1): 0.8/1.5 MBProgress (1): 0.8/1.5 MBProgress (1): 0.8/1.5 MBProgress (1): 0.8/1.5 MBProgress (1): 0.8/1.5 MBProgress (1): 0.8/1.5 MBProgress (1): 0.8/1.5 MBProgress (1): 0.8/1.5 MBProgress (1): 0.8/1.5 MBProgress (1): 0.8/1.5 MBProgress (1): 0.8/1.5 MBProgress (1): 0.9/1.5 MBProgress (1): 0.9/1.5 MBProgress (1): 0.9/1.5 MBProgress (1): 0.9/1.5 MBProgress (1): 0.9/1.5 MBProgress (1): 0.9/1.5 MBProgress (1): 0.9/1.5 MBProgress (1): 0.9/1.5 MBProgress (1): 0.9/1.5 MBProgress (1): 0.9/1.5 MBProgress (1): 0.9/1.5 MBProgress (1): 0.9/1.5 MBProgress (1): 0.9/1.5 MBProgress (1): 0.9/1.5 MBProgress (1): 0.9/1.5 MBProgress (1): 0.9/1.5 MBProgress (1): 0.9/1.5 MBProgress (1): 0.9/1.5 MBProgress (1): 0.9/1.5 MBProgress (1): 0.9/1.5 MBProgress (1): 0.9/1.5 MBProgress (1): 0.9/1.5 MBProgress (1): 0.9/1.5 MBProgress (1): 0.9/1.5 MBProgress (1): 0.9/1.5 MBProgress (1): 0.9/1.5 MBProgress (1): 0.9/1.5 MBProgress (1): 0.9/1.5 MBProgress (1): 0.9/1.5 MBProgress (1): 0.9/1.5 MBProgress (1): 0.9/1.5 MBProgress (1): 0.9/1.5 MBProgress (1): 0.9/1.5 MBProgress (1): 0.9/1.5 MBProgress (1): 0.9/1.5 MBProgress (1): 0.9/1.5 MBProgress (1): 0.9/1.5 MBProgress (1): 0.9/1.5 MBProgress (1): 0.9/1.5 MBProgress (1): 0.9/1.5 MBProgress (1): 0.9/1.5 MBProgress (1): 0.9/1.5 MBProgress (1): 0.9/1.5 MBProgress (1): 0.9/1.5 MBProgress (1): 0.9/1.5 MBProgress (1): 0.9/1.5 MBProgress (1): 0.9/1.5 MBProgress (1): 0.9/1.5 MBProgress (1): 1.0/1.5 MBProgress (1): 1.0/1.5 MBProgress (1): 1.0/1.5 MBProgress (1): 1.0/1.5 MBProgress (1): 1.0/1.5 MBProgress (1): 1.0/1.5 MBProgress (1): 1.0/1.5 MBProgress (1): 1.0/1.5 MBProgress (1): 1.0/1.5 MBProgress (1): 1.0/1.5 MBProgress (1): 1.0/1.5 MBProgress (1): 1.0/1.5 MBProgress (1): 1.0/1.5 MBProgress (1): 1.0/1.5 MBProgress (1): 1.0/1.5 MBProgress (1): 1.0/1.5 MBProgress (1): 1.0/1.5 MBProgress (1): 1.0/1.5 MBProgress (1): 1.0/1.5 MBProgress (1): 1.0/1.5 MBProgress (1): 1.0/1.5 MBProgress (1): 1.0/1.5 MBProgress (1): 1.0/1.5 MBProgress (1): 1.0/1.5 MBProgress (1): 1.0/1.5 MBProgress (1): 1.0/1.5 MBProgress (1): 1.0/1.5 MBProgress (1): 1.0/1.5 MBProgress (1): 1.0/1.5 MBProgress (1): 1.0/1.5 MBProgress (1): 1.0/1.5 MBProgress (1): 1.0/1.5 MBProgress (1): 1.0/1.5 MBProgress (1): 1.0/1.5 MBProgress (1): 1.0/1.5 MBProgress (1): 1.0/1.5 MBProgress (1): 1.0/1.5 MBProgress (1): 1.0/1.5 MBProgress (1): 1.0/1.5 MBProgress (1): 1.0/1.5 MBProgress (1): 1.0/1.5 MBProgress (1): 1.0/1.5 MBProgress (1): 1.0/1.5 MBProgress (1): 1.0/1.5 MBProgress (1): 1.0/1.5 MBProgress (1): 1.0/1.5 MBProgress (1): 1.0/1.5 MBProgress (1): 1.0/1.5 MBProgress (1): 1.0/1.5 MBProgress (1): 1.1/1.5 MBProgress (1): 1.1/1.5 MBProgress (1): 1.1/1.5 MBProgress (1): 1.1/1.5 MBProgress (1): 1.1/1.5 MBProgress (1): 1.1/1.5 MBProgress (1): 1.1/1.5 MBProgress (1): 1.1/1.5 MBProgress (1): 1.1/1.5 MBProgress (1): 1.1/1.5 MBProgress (1): 1.1/1.5 MBProgress (1): 1.1/1.5 MBProgress (1): 1.1/1.5 MBProgress (1): 1.1/1.5 MBProgress (1): 1.1/1.5 MBProgress (1): 1.1/1.5 MBProgress (1): 1.1/1.5 MBProgress (1): 1.1/1.5 MBProgress (1): 1.1/1.5 MBProgress (1): 1.1/1.5 MBProgress (1): 1.1/1.5 MBProgress (1): 1.1/1.5 MBProgress (1): 1.1/1.5 MBProgress (1): 1.1/1.5 MBProgress (1): 1.1/1.5 MBProgress (1): 1.1/1.5 MBProgress (1): 1.1/1.5 MBProgress (1): 1.1/1.5 MBProgress (1): 1.1/1.5 MBProgress (1): 1.1/1.5 MBProgress (1): 1.1/1.5 MBProgress (1): 1.1/1.5 MBProgress (1): 1.1/1.5 MBProgress (1): 1.1/1.5 MBProgress (1): 1.1/1.5 MBProgress (1): 1.1/1.5 MBProgress (1): 1.1/1.5 MBProgress (1): 1.1/1.5 MBProgress (1): 1.1/1.5 MBProgress (1): 1.1/1.5 MBProgress (1): 1.1/1.5 MBProgress (1): 1.1/1.5 MBProgress (1): 1.1/1.5 MBProgress (1): 1.1/1.5 MBProgress (1): 1.1/1.5 MBProgress (1): 1.1/1.5 MBProgress (1): 1.1/1.5 MBProgress (1): 1.1/1.5 MBProgress (1): 1.1/1.5 MBProgress (1): 1.2/1.5 MBProgress (1): 1.2/1.5 MBProgress (1): 1.2/1.5 MBProgress (1): 1.2/1.5 MBProgress (1): 1.2/1.5 MBProgress (1): 1.2/1.5 MBProgress (1): 1.2/1.5 MBProgress (1): 1.2/1.5 MBProgress (1): 1.2/1.5 MBProgress (1): 1.2/1.5 MBProgress (1): 1.2/1.5 MBProgress (1): 1.2/1.5 MBProgress (1): 1.2/1.5 MBProgress (1): 1.2/1.5 MBProgress (1): 1.2/1.5 MBProgress (1): 1.2/1.5 MBProgress (1): 1.2/1.5 MBProgress (1): 1.2/1.5 MBProgress (1): 1.2/1.5 MBProgress (1): 1.2/1.5 MBProgress (1): 1.2/1.5 MBProgress (1): 1.2/1.5 MBProgress (1): 1.2/1.5 MBProgress (1): 1.2/1.5 MBProgress (1): 1.2/1.5 MBProgress (1): 1.2/1.5 MBProgress (1): 1.2/1.5 MBProgress (1): 1.2/1.5 MBProgress (1): 1.2/1.5 MBProgress (1): 1.2/1.5 MBProgress (1): 1.2/1.5 MBProgress (1): 1.2/1.5 MBProgress (1): 1.2/1.5 MBProgress (1): 1.2/1.5 MBProgress (1): 1.2/1.5 MBProgress (1): 1.2/1.5 MBProgress (1): 1.2/1.5 MBProgress (1): 1.2/1.5 MBProgress (1): 1.2/1.5 MBProgress (1): 1.2/1.5 MBProgress (1): 1.2/1.5 MBProgress (1): 1.2/1.5 MBProgress (1): 1.2/1.5 MBProgress (1): 1.2/1.5 MBProgress (1): 1.2/1.5 MBProgress (1): 1.2/1.5 MBProgress (1): 1.2/1.5 MBProgress (1): 1.2/1.5 MBProgress (1): 1.2/1.5 MBProgress (1): 1.3/1.5 MBProgress (1): 1.3/1.5 MBProgress (1): 1.3/1.5 MBProgress (1): 1.3/1.5 MBProgress (1): 1.3/1.5 MBProgress (1): 1.3/1.5 MBProgress (1): 1.3/1.5 MBProgress (1): 1.3/1.5 MBProgress (1): 1.3/1.5 MBProgress (1): 1.3/1.5 MBProgress (1): 1.3/1.5 MBProgress (1): 1.3/1.5 MBProgress (1): 1.3/1.5 MBProgress (1): 1.3/1.5 MBProgress (1): 1.3/1.5 MBProgress (1): 1.3/1.5 MBProgress (1): 1.3/1.5 MBProgress (1): 1.3/1.5 MBProgress (1): 1.3/1.5 MBProgress (1): 1.3/1.5 MBProgress (1): 1.3/1.5 MBProgress (1): 1.3/1.5 MBProgress (1): 1.3/1.5 MBProgress (1): 1.3/1.5 MBProgress (1): 1.3/1.5 MBProgress (1): 1.3/1.5 MBProgress (1): 1.3/1.5 MBProgress (1): 1.3/1.5 MBProgress (1): 1.3/1.5 MBProgress (1): 1.3/1.5 MBProgress (1): 1.3/1.5 MBProgress (1): 1.3/1.5 MBProgress (1): 1.3/1.5 MBProgress (1): 1.3/1.5 MBProgress (1): 1.3/1.5 MBProgress (1): 1.3/1.5 MBProgress (1): 1.3/1.5 MBProgress (1): 1.3/1.5 MBProgress (1): 1.3/1.5 MBProgress (1): 1.3/1.5 MBProgress (1): 1.3/1.5 MBProgress (1): 1.3/1.5 MBProgress (1): 1.3/1.5 MBProgress (1): 1.3/1.5 MBProgress (1): 1.3/1.5 MBProgress (1): 1.3/1.5 MBProgress (1): 1.3/1.5 MBProgress (1): 1.3/1.5 MBProgress (1): 1.3/1.5 MBProgress (1): 1.4/1.5 MBProgress (1): 1.4/1.5 MBProgress (1): 1.4/1.5 MBProgress (1): 1.4/1.5 MBProgress (1): 1.4/1.5 MBProgress (1): 1.4/1.5 MBProgress (1): 1.4/1.5 MBProgress (1): 1.4/1.5 MBProgress (1): 1.4/1.5 MBProgress (1): 1.4/1.5 MBProgress (1): 1.4/1.5 MBProgress (1): 1.4/1.5 MBProgress (1): 1.4/1.5 MBProgress (1): 1.4/1.5 MBProgress (1): 1.4/1.5 MBProgress (1): 1.4/1.5 MBProgress (1): 1.4/1.5 MBProgress (1): 1.4/1.5 MBProgress (1): 1.4/1.5 MBProgress (1): 1.4/1.5 MBProgress (1): 1.4/1.5 MBProgress (1): 1.4/1.5 MBProgress (1): 1.4/1.5 MBProgress (1): 1.4/1.5 MBProgress (1): 1.4/1.5 MBProgress (1): 1.4/1.5 MBProgress (1): 1.4/1.5 MBProgress (1): 1.4/1.5 MBProgress (1): 1.4/1.5 MBProgress (1): 1.4/1.5 MBProgress (1): 1.4/1.5 MBProgress (1): 1.4/1.5 MBProgress (1): 1.4/1.5 MBProgress (1): 1.4/1.5 MBProgress (1): 1.4/1.5 MBProgress (1): 1.4/1.5 MBProgress (1): 1.4/1.5 MBProgress (1): 1.4/1.5 MBProgress (1): 1.4/1.5 MBProgress (1): 1.4/1.5 MBProgress (1): 1.4/1.5 MBProgress (1): 1.4/1.5 MBProgress (1): 1.4/1.5 MBProgress (1): 1.4/1.5 MBProgress (1): 1.4/1.5 MBProgress (1): 1.4/1.5 MBProgress (1): 1.4/1.5 MBProgress (1): 1.4/1.5 MBProgress (1): 1.4/1.5 MBProgress (1): 1.5/1.5 MBProgress (1): 1.5/1.5 MBProgress (1): 1.5/1.5 MBProgress (1): 1.5/1.5 MBProgress (1): 1.5/1.5 MBProgress (1): 1.5/1.5 MBProgress (1): 1.5/1.5 MBProgress (1): 1.5/1.5 MBProgress (1): 1.5/1.5 MBProgress (1): 1.5/1.5 MBProgress (1): 1.5/1.5 MBProgress (1): 1.5/1.5 MBProgress (1): 1.5/1.5 MBProgress (1): 1.5/1.5 MBProgress (1): 1.5/1.5 MBProgress (1): 1.5/1.5 MBProgress (1): 1.5/1.5 MBProgress (1): 1.5/1.5 MBProgress (1): 1.5/1.5 MBProgress (1): 1.5/1.5 MBProgress (1): 1.5/1.5 MBProgress (1): 1.5/1.5 MBProgress (1): 1.5/1.5 MBProgress (1): 1.5/1.5 MBProgress (1): 1.5/1.5 MBProgress (1): 1.5/1.5 MBProgress (1): 1.5 MB                        Uploaded to apache.snapshots.https: https://repository.apache.org/content/repositories/snapshots/org/apache/openjpa/openjpa-jdbc/3.1.2-SNAPSHOT/openjpa-jdbc-3.1.2-20200314.064621-2.jar (1.5 MB at 943 kB/s)
Uploading to apache.snapshots.https: https://repository.apache.org/content/repositories/snapshots/org/apache/openjpa/openjpa-jdbc/3.1.2-SNAPSHOT/openjpa-jdbc-3.1.2-20200314.064621-2.pom
Progress (1): 2.0/3.1 kBProgress (1): 3.1 kB                        Uploaded to apache.snapshots.https: https://repository.apache.org/content/repositories/snapshots/org/apache/openjpa/openjpa-jdbc/3.1.2-SNAPSHOT/openjpa-jdbc-3.1.2-20200314.064621-2.pom (3.1 kB at 2.8 kB/s)
Downloading from apache.snapshots.https: https://repository.apache.org/content/repositories/snapshots/org/apache/openjpa/openjpa-jdbc/maven-metadata.xml
Progress (1): 693 B                   Downloaded from apache.snapshots.https: https://repository.apache.org/content/repositories/snapshots/org/apache/openjpa/openjpa-jdbc/maven-metadata.xml (693 B at 1.1 kB/s)
Uploading to apache.snapshots.https: https://repository.apache.org/content/repositories/snapshots/org/apache/openjpa/openjpa-jdbc/3.1.2-SNAPSHOT/maven-metadata.xml
Progress (1): 992 B                   Uploaded to apache.snapshots.https: https://repository.apache.org/content/repositories/snapshots/org/apache/openjpa/openjpa-jdbc/3.1.2-SNAPSHOT/maven-metadata.xml (992 B at 880 B/s)
Uploading to apache.snapshots.https: https://repository.apache.org/content/repositories/snapshots/org/apache/openjpa/openjpa-jdbc/maven-metadata.xml
Progress (1): 672 B                   Uploaded to apache.snapshots.https: https://repository.apache.org/content/repositories/snapshots/org/apache/openjpa/openjpa-jdbc/maven-metadata.xml (672 B at 605 B/s)
Uploading to apache.snapshots.https: https://repository.apache.org/content/repositories/snapshots/org/apache/openjpa/openjpa-jdbc/3.1.2-SNAPSHOT/openjpa-jdbc-3.1.2-20200314.064621-2-tests.jar
Progress (1): 2.0/52 kBProgress (1): 4.1/52 kBProgress (1): 6.1/52 kBProgress (1): 8.2/52 kBProgress (1): 10/52 kB Progress (1): 12/52 kBProgress (1): 14/52 kBProgress (1): 16/52 kBProgress (1): 18/52 kBProgress (1): 20/52 kBProgress (1): 23/52 kBProgress (1): 25/52 kBProgress (1): 27/52 kBProgress (1): 29/52 kBProgress (1): 31/52 kBProgress (1): 33/52 kBProgress (1): 35/52 kBProgress (1): 37/52 kBProgress (1): 39/52 kBProgress (1): 41/52 kBProgress (1): 43/52 kBProgress (1): 45/52 kBProgress (1): 47/52 kBProgress (1): 49/52 kBProgress (1): 51/52 kBProgress (1): 52 kB                      Uploaded to apache.snapshots.https: https://repository.apache.org/content/repositories/snapshots/org/apache/openjpa/openjpa-jdbc/3.1.2-SNAPSHOT/openjpa-jdbc-3.1.2-20200314.064621-2-tests.jar (52 kB at 41 kB/s)
Uploading to apache.snapshots.https: https://repository.apache.org/content/repositories/snapshots/org/apache/openjpa/openjpa-jdbc/3.1.2-SNAPSHOT/maven-metadata.xml
Progress (1): 992 B                   Uploaded to apache.snapshots.https: https://repository.apache.org/content/repositories/snapshots/org/apache/openjpa/openjpa-jdbc/3.1.2-SNAPSHOT/maven-metadata.xml (992 B at 864 B/s)
[INFO] 
[INFO] ---------------< org.apache.openjpa:openjpa-persistence >---------------
[INFO] Building OpenJPA Persistence 3.1.2-SNAPSHOT                       [5/30]
[INFO] --------------------------------[ jar ]---------------------------------
Downloading from Nexus: http://repository.apache.org/snapshots/org/apache/geronimo/specs/geronimo-jpa_2.2_spec/1.1-SNAPSHOT/maven-metadata.xml
Downloading from Nexus: http://repository.apache.org/snapshots/org/apache/geronimo/specs/geronimo-jpa_2.2_spec/1.1-SNAPSHOT/geronimo-jpa_2.2_spec-1.1-SNAPSHOT.pom
[WARNING] The POM for org.apache.geronimo.specs:geronimo-jpa_2.2_spec:jar:1.1-SNAPSHOT is missing, no dependency information available
Downloading from Nexus: http://repository.apache.org/snapshots/org/apache/geronimo/specs/geronimo-jpa_2.2_spec/1.1-SNAPSHOT/geronimo-jpa_2.2_spec-1.1-SNAPSHOT.jar
[INFO] ------------------------------------------------------------------------
[INFO] Reactor Summary:
[INFO] 
[INFO] OpenJPA Parent POM 3.1.2-SNAPSHOT .................. SUCCESS [ 13.037 s]
[INFO] OpenJPA Utilities Library .......................... SUCCESS [ 17.768 s]
[INFO] OpenJPA Kernel ..................................... SUCCESS [ 19.436 s]
[INFO] OpenJPA JDBC ....................................... SUCCESS [ 16.128 s]
[INFO] OpenJPA Persistence ................................ FAILURE [  0.526 s]
[INFO] OpenJPA Persistence JDBC ........................... SKIPPED
[INFO] OpenJPA Persistence Locking Tests .................. SKIPPED
[INFO] OpenJPA tools ...................................... SKIPPED
[INFO] OpenJPA Maven Plugin ............................... SKIPPED
[INFO] OpenJPA XML Store .................................. SKIPPED
[INFO] OpenJPA Slice ...................................... SKIPPED
[INFO] OpenJPA JEST ....................................... SKIPPED
[INFO] OpenJPA Kubernetes ................................. SKIPPED
[INFO] OpenJPA Aggregate Jar .............................. SKIPPED
[INFO] OpenJPA Aggregate Jar with Dependencies ............ SKIPPED
[INFO] OpenJPA Project Docs and Assemblies ................ SKIPPED
[INFO] OpenJPA Examples ................................... SKIPPED
[INFO] OpenJPA Examples - Simple .......................... SKIPPED
[INFO] OpenJPA Examples - image-gallery ................... SKIPPED
[INFO] OpenJPA Examples - OpenBooks ....................... SKIPPED
[INFO] OpenJPA Integration Tests .......................... SKIPPED
[INFO] OpenJPA Integration Tests - Daytrader .............. SKIPPED
[INFO] OpenJPA Integration Tests - Examples ............... SKIPPED
[INFO] OpenJPA Integration Tests - SLF4JLogFactory ........ SKIPPED
[INFO] OpenJPA Integration Tests - JPA TCK ................ SKIPPED
[INFO] OpenJPA Integration Tests - Bean Validation ........ SKIPPED
[INFO] OpenJPA Integration Tests - JMX Platform MBeans .... SKIPPED
[INFO] OpenJPA Fetching Statistic Tool .................... SKIPPED
[INFO] OpenJPA Fetching Statistic Tool -- WAS Bundle ...... SKIPPED
[INFO] OpenJPA Features 3.1.2-SNAPSHOT .................... SKIPPED
[INFO] ------------------------------------------------------------------------
[INFO] BUILD FAILURE
[INFO] ------------------------------------------------------------------------
[INFO] Total time: 01:08 min
[INFO] Finished at: 2020-03-14T06:46:30Z
[INFO] ------------------------------------------------------------------------
[ERROR] Failed to execute goal on project openjpa-persistence: Could not resolve dependencies for project org.apache.openjpa:openjpa-persistence:jar:3.1.2-SNAPSHOT: Could not find artifact org.apache.geronimo.specs:geronimo-jpa_2.2_spec:jar:1.1-SNAPSHOT in Nexus (http://repository.apache.org/snapshots) -> [Help 1]
[ERROR] 
[ERROR] To see the full stack trace of the errors, re-run Maven with the -e switch.
[ERROR] Re-run Maven using the -X switch to enable full debug logging.
[ERROR] 
[ERROR] For more information about the errors and possible solutions, please read the following articles:
[ERROR] [Help 1] http://cwiki.apache.org/confluence/display/MAVEN/DependencyResolutionException
[ERROR] 
[ERROR] After correcting the problems, you can resume the build with the command
[ERROR]   mvn <goals> -rf :openjpa-persistence
Build step 'Execute shell' marked build as failure
Archiving artifacts
Setting ANT_1_9_7_HOME=/home/jenkins/tools/ant/apache-ant-1.9.7
ERROR: No tool found matching MAVEN_3_0_4_HOME
Setting JDK_1_8_LATEST__HOME=/home/jenkins/tools/java/latest1.8
Setting MAVEN_3_5_4_HOME=/home/jenkins/tools/maven/apache-maven-3.5.4
Setting ANT_1_9_7_HOME=/home/jenkins/tools/ant/apache-ant-1.9.7
ERROR: No tool found matching MAVEN_3_0_4_HOME
Setting JDK_1_8_LATEST__HOME=/home/jenkins/tools/java/latest1.8
Setting MAVEN_3_5_4_HOME=/home/jenkins/tools/maven/apache-maven-3.5.4

Mime
View raw message