openjpa-commits mailing list archives

Site index · List index
Message view « Date » · « Thread »
Top « Date » · « Thread »
From Apache Jenkins Server <jenk...@builds.apache.org>
Subject Build failed in Jenkins: OpenJPA-trunk #14
Date Sat, 12 May 2018 10:28:24 GMT
See <https://builds.apache.org/job/OpenJPA-trunk/14/display/redirect?page=changes>

Changes:

[struberg] cleanup import minor

------------------------------------------
[...truncated 1.96 MB...]
[INFO] --- maven-surefire-plugin:2.19.1:test (default-test) @ openjpa-integration-jmx ---

-------------------------------------------------------
 T E S T S
-------------------------------------------------------
Running org.apache.openjpa.integration.jmx.TestJMXPlatformMBeans
Tests run: 3, Failures: 0, Errors: 0, Skipped: 0, Time elapsed: 2.781 sec - in org.apache.openjpa.integration.jmx.TestJMXPlatformMBeans

Results :

Tests run: 3, Failures: 0, Errors: 0, Skipped: 0

[INFO] 
[INFO] --- maven-jar-plugin:3.0.2:jar (default-jar) @ openjpa-integration-jmx ---
[INFO] Building jar: <https://builds.apache.org/job/OpenJPA-trunk/ws/openjpa-integration/jmx/target/openjpa-integration-jmx-3.0.0-SNAPSHOT.jar>
[INFO] 
[INFO] --- maven-site-plugin:3.5.1:attach-descriptor (attach-descriptor) @ openjpa-integration-jmx
---
[INFO] 
[INFO] --- maven-jar-plugin:3.0.2:test-jar (attach-tests) @ openjpa-integration-jmx ---
[INFO] Building jar: <https://builds.apache.org/job/OpenJPA-trunk/ws/openjpa-integration/jmx/target/openjpa-integration-jmx-3.0.0-SNAPSHOT-tests.jar>
[INFO] 
[INFO] --- apache-rat-plugin:0.11:check (default) @ openjpa-integration-jmx ---
[INFO] 51 implicit excludes (use -debug for more details).
[INFO] Exclude: **/.*/**
[INFO] Exclude: **/target/**/*
[INFO] 3 resources included (use -debug for more details)
[INFO] Rat check: Summary of files. Unapproved: 0 unknown: 0 generated: 0 approved: 3 licence.
[INFO] 
[INFO] --- maven-install-plugin:2.5.2:install (default-install) @ openjpa-integration-jmx
---
[INFO] Installing <https://builds.apache.org/job/OpenJPA-trunk/ws/openjpa-integration/jmx/target/openjpa-integration-jmx-3.0.0-SNAPSHOT.jar>
to /home/jenkins/.m2/repository/org/apache/openjpa/openjpa-integration-jmx/3.0.0-SNAPSHOT/openjpa-integration-jmx-3.0.0-SNAPSHOT.jar
[INFO] Installing <https://builds.apache.org/job/OpenJPA-trunk/ws/openjpa-integration/jmx/pom.xml>
to /home/jenkins/.m2/repository/org/apache/openjpa/openjpa-integration-jmx/3.0.0-SNAPSHOT/openjpa-integration-jmx-3.0.0-SNAPSHOT.pom
[INFO] Installing <https://builds.apache.org/job/OpenJPA-trunk/ws/openjpa-integration/jmx/target/openjpa-integration-jmx-3.0.0-SNAPSHOT-tests.jar>
to /home/jenkins/.m2/repository/org/apache/openjpa/openjpa-integration-jmx/3.0.0-SNAPSHOT/openjpa-integration-jmx-3.0.0-SNAPSHOT-tests.jar
[INFO]                                                                         
[INFO] ------------------------------------------------------------------------
[INFO] Building OpenJPA Fetching Statistic Tool 3.0.0-SNAPSHOT
[INFO] ------------------------------------------------------------------------
[INFO] 
[INFO] --- maven-clean-plugin:3.0.0:clean (default-clean) @ openjpa-fetch-statistics ---
[INFO] 
[INFO] --- buildnumber-maven-plugin:1.4:create (default) @ openjpa-fetch-statistics ---
[INFO] 
[INFO] --- maven-enforcer-plugin:1.4.1:enforce (default) @ openjpa-fetch-statistics ---
[INFO] 
[INFO] --- maven-checkstyle-plugin:2.9:checkstyle (default) @ openjpa-fetch-statistics ---
[INFO] Starting audit...
Audit done.

[WARNING] Unable to locate Source XRef to link to - DISABLED
[INFO] 
[INFO] --- maven-remote-resources-plugin:1.5:process (process-resource-bundles) @ openjpa-fetch-statistics
---
[INFO] 
[INFO] --- maven-resources-plugin:2.7:resources (default-resources) @ openjpa-fetch-statistics
---
[INFO] Using 'UTF-8' encoding to copy filtered resources.
[INFO] Copying 3 resources
[INFO] Copying 3 resources
[INFO] 
[INFO] --- maven-compiler-plugin:3.5.1:compile (default-compile) @ openjpa-fetch-statistics
---
[INFO] Changes detected - recompiling the module!
[INFO] Compiling 2 source files to <https://builds.apache.org/job/OpenJPA-trunk/ws/openjpa-tools/openjpa-fetch-statistics/target/classes>
[INFO] 
[INFO] --- maven-compiler-plugin:3.5.1:testCompile (test-source-compile) @ openjpa-fetch-statistics
---
[INFO] Changes detected - recompiling the module!
[INFO] Compiling 5 source files to <https://builds.apache.org/job/OpenJPA-trunk/ws/openjpa-tools/openjpa-fetch-statistics/target/test-classes>
[INFO] 
[INFO] --- maven-resources-plugin:2.7:testResources (default-testResources) @ openjpa-fetch-statistics
---
[INFO] Using 'UTF-8' encoding to copy filtered resources.
[INFO] Copying 1 resource
[INFO] Copying 3 resources
[INFO] 
[INFO] --- maven-compiler-plugin:3.5.1:testCompile (default-testCompile) @ openjpa-fetch-statistics
---
[INFO] Changes detected - recompiling the module!
[INFO] Compiling 5 source files to <https://builds.apache.org/job/OpenJPA-trunk/ws/openjpa-tools/openjpa-fetch-statistics/target/test-classes>
[INFO] 
[INFO] --- maven-surefire-plugin:2.19.1:test (default-test) @ openjpa-fetch-statistics ---
[INFO] 
[INFO] --- maven-jar-plugin:3.0.2:jar (default-jar) @ openjpa-fetch-statistics ---
[INFO] Building jar: <https://builds.apache.org/job/OpenJPA-trunk/ws/openjpa-tools/openjpa-fetch-statistics/target/openjpa-fetch-statistics-3.0.0-SNAPSHOT.jar>
[INFO] 
[INFO] --- maven-site-plugin:3.5.1:attach-descriptor (attach-descriptor) @ openjpa-fetch-statistics
---
[INFO] 
[INFO] --- maven-jar-plugin:3.0.2:test-jar (attach-tests) @ openjpa-fetch-statistics ---
[INFO] Building jar: <https://builds.apache.org/job/OpenJPA-trunk/ws/openjpa-tools/openjpa-fetch-statistics/target/openjpa-fetch-statistics-3.0.0-SNAPSHOT-tests.jar>
[INFO] 
[INFO] --- apache-rat-plugin:0.11:check (default) @ openjpa-fetch-statistics ---
[INFO] 51 implicit excludes (use -debug for more details).
[INFO] Exclude: **/.*/**
[INFO] Exclude: **/target/**/*
[INFO] 10 resources included (use -debug for more details)
[INFO] Rat check: Summary of files. Unapproved: 0 unknown: 0 generated: 0 approved: 9 licence.
[INFO] 
[INFO] --- maven-install-plugin:2.5.2:install (default-install) @ openjpa-fetch-statistics
---
[INFO] Installing <https://builds.apache.org/job/OpenJPA-trunk/ws/openjpa-tools/openjpa-fetch-statistics/target/openjpa-fetch-statistics-3.0.0-SNAPSHOT.jar>
to /home/jenkins/.m2/repository/org/apache/openjpa/openjpa-fetch-statistics/3.0.0-SNAPSHOT/openjpa-fetch-statistics-3.0.0-SNAPSHOT.jar
[INFO] Installing <https://builds.apache.org/job/OpenJPA-trunk/ws/openjpa-tools/openjpa-fetch-statistics/pom.xml>
to /home/jenkins/.m2/repository/org/apache/openjpa/openjpa-fetch-statistics/3.0.0-SNAPSHOT/openjpa-fetch-statistics-3.0.0-SNAPSHOT.pom
[INFO] Installing <https://builds.apache.org/job/OpenJPA-trunk/ws/openjpa-tools/openjpa-fetch-statistics/target/openjpa-fetch-statistics-3.0.0-SNAPSHOT-tests.jar>
to /home/jenkins/.m2/repository/org/apache/openjpa/openjpa-fetch-statistics/3.0.0-SNAPSHOT/openjpa-fetch-statistics-3.0.0-SNAPSHOT-tests.jar
[INFO]                                                                         
[INFO] ------------------------------------------------------------------------
[INFO] Building OpenJPA Fetching Statistic Tool -- WAS Bundle 3.0.0-SNAPSHOT
[INFO] ------------------------------------------------------------------------
[INFO] 
[INFO] --- maven-clean-plugin:3.0.0:clean (default-clean) @ openjpa-fetch-statistics-was ---
[INFO] 
[INFO] --- buildnumber-maven-plugin:1.4:create (default) @ openjpa-fetch-statistics-was ---
[INFO] 
[INFO] --- maven-enforcer-plugin:1.4.1:enforce (default) @ openjpa-fetch-statistics-was ---
[INFO] 
[INFO] --- maven-checkstyle-plugin:2.9:checkstyle (default) @ openjpa-fetch-statistics-was
---
[INFO] 
[INFO] --- maven-remote-resources-plugin:1.5:process (process-resource-bundles) @ openjpa-fetch-statistics-was
---
[INFO] 
[INFO] --- maven-resources-plugin:2.7:resources (default-resources) @ openjpa-fetch-statistics-was
---
[INFO] Using 'UTF-8' encoding to copy filtered resources.
[INFO] Copying 1 resource
[INFO] Copying 3 resources
[INFO] 
[INFO] --- maven-compiler-plugin:3.5.1:compile (default-compile) @ openjpa-fetch-statistics-was
---
[INFO] No sources to compile
[INFO] 
[INFO] --- maven-compiler-plugin:3.5.1:testCompile (test-source-compile) @ openjpa-fetch-statistics-was
---
[INFO] No sources to compile
[INFO] 
[INFO] --- maven-resources-plugin:2.7:testResources (default-testResources) @ openjpa-fetch-statistics-was
---
[INFO] Using 'UTF-8' encoding to copy filtered resources.
[INFO] skip non existing resourceDirectory <https://builds.apache.org/job/OpenJPA-trunk/ws/openjpa-tools/openjpa-fetch-statistics-was/src/test/resources>
[INFO] Copying 3 resources
[INFO] 
[INFO] --- maven-compiler-plugin:3.5.1:testCompile (default-testCompile) @ openjpa-fetch-statistics-was
---
[INFO] No sources to compile
[INFO] 
[INFO] --- maven-surefire-plugin:2.19.1:test (default-test) @ openjpa-fetch-statistics-was
---
[INFO] 
[INFO] --- maven-jar-plugin:3.0.2:jar (default-jar) @ openjpa-fetch-statistics-was ---
[INFO] Building jar: <https://builds.apache.org/job/OpenJPA-trunk/ws/openjpa-tools/openjpa-fetch-statistics-was/target/openjpa-fetch-statistics-was-3.0.0-SNAPSHOT.jar>
[INFO] 
[INFO] --- maven-site-plugin:3.5.1:attach-descriptor (attach-descriptor) @ openjpa-fetch-statistics-was
---
[INFO] 
[INFO] --- maven-jar-plugin:3.0.2:test-jar (attach-tests) @ openjpa-fetch-statistics-was ---
[INFO] Building jar: <https://builds.apache.org/job/OpenJPA-trunk/ws/openjpa-tools/openjpa-fetch-statistics-was/target/openjpa-fetch-statistics-was-3.0.0-SNAPSHOT-tests.jar>
[INFO] 
[INFO] --- maven-shade-plugin:1.7.1:shade (default) @ openjpa-fetch-statistics-was ---
[INFO] Including org.apache.openjpa:openjpa-fetch-statistics:jar:3.0.0-SNAPSHOT in the shaded
jar.
[INFO] Excluding org.apache.geronimo.specs:geronimo-jpa_2.1_spec:jar:1.0-alpha-1 from the
shaded jar.
[INFO] Excluding org.apache.geronimo.specs:geronimo-jta_1.1_spec:jar:1.1.1 from the shaded
jar.
[INFO] Excluding org.apache.openjpa:openjpa-kernel:jar:3.0.0-SNAPSHOT from the shaded jar.
[INFO] Excluding org.apache.geronimo.specs:geronimo-jms_1.1_spec:jar:1.1.1 from the shaded
jar.
[INFO] Excluding org.apache.xbean:xbean-asm6-shaded:jar:4.8 from the shaded jar.
[INFO] Excluding org.apache.openjpa:openjpa-lib:jar:3.0.0-SNAPSHOT from the shaded jar.
[INFO] Excluding commons-collections:commons-collections:jar:3.2.2 from the shaded jar.
[INFO] Excluding net.sourceforge.serp:serp:jar:1.15.1 from the shaded jar.
[INFO] Excluding org.apache.openjpa:openjpa-persistence-jdbc:jar:3.0.0-SNAPSHOT from the shaded
jar.
[INFO] Excluding org.apache.openjpa:openjpa-jdbc:jar:3.0.0-SNAPSHOT from the shaded jar.
[INFO] Excluding org.apache.openjpa:openjpa-persistence:jar:3.0.0-SNAPSHOT from the shaded
jar.
[INFO] Excluding commons-pool:commons-pool:jar:1.6 from the shaded jar.
[INFO] Replacing original artifact with shaded artifact.
[INFO] Replacing <https://builds.apache.org/job/OpenJPA-trunk/ws/openjpa-tools/openjpa-fetch-statistics-was/target/openjpa-fetch-statistics-was-3.0.0-SNAPSHOT.jar>
with <https://builds.apache.org/job/OpenJPA-trunk/ws/openjpa-tools/openjpa-fetch-statistics-was/target/openjpa-fetch-statistics-was-3.0.0-SNAPSHOT-shaded.jar>
[INFO] 
[INFO] --- apache-rat-plugin:0.11:check (default) @ openjpa-fetch-statistics-was ---
[INFO] 51 implicit excludes (use -debug for more details).
[INFO] Exclude: **/.*/**
[INFO] Exclude: **/target/**/*
[INFO] 1 resources included (use -debug for more details)
[INFO] Rat check: Summary of files. Unapproved: 0 unknown: 0 generated: 0 approved: 0 licence.
[INFO] 
[INFO] --- maven-install-plugin:2.5.2:install (default-install) @ openjpa-fetch-statistics-was
---
[INFO] Installing <https://builds.apache.org/job/OpenJPA-trunk/ws/openjpa-tools/openjpa-fetch-statistics-was/target/openjpa-fetch-statistics-was-3.0.0-SNAPSHOT.jar>
to /home/jenkins/.m2/repository/org/apache/openjpa/openjpa-fetch-statistics-was/3.0.0-SNAPSHOT/openjpa-fetch-statistics-was-3.0.0-SNAPSHOT.jar
[INFO] Installing <https://builds.apache.org/job/OpenJPA-trunk/ws/openjpa-tools/openjpa-fetch-statistics-was/dependency-reduced-pom.xml>
to /home/jenkins/.m2/repository/org/apache/openjpa/openjpa-fetch-statistics-was/3.0.0-SNAPSHOT/openjpa-fetch-statistics-was-3.0.0-SNAPSHOT.pom
[INFO] Installing <https://builds.apache.org/job/OpenJPA-trunk/ws/openjpa-tools/openjpa-fetch-statistics-was/target/openjpa-fetch-statistics-was-3.0.0-SNAPSHOT-tests.jar>
to /home/jenkins/.m2/repository/org/apache/openjpa/openjpa-fetch-statistics-was/3.0.0-SNAPSHOT/openjpa-fetch-statistics-was-3.0.0-SNAPSHOT-tests.jar
[INFO]                                                                         
[INFO] ------------------------------------------------------------------------
[INFO] Building OpenJPA Features 3.0.0-SNAPSHOT
[INFO] ------------------------------------------------------------------------
[INFO] 
[INFO] --- maven-clean-plugin:3.0.0:clean (default-clean) @ openjpa-features ---
[INFO] 
[INFO] --- buildnumber-maven-plugin:1.4:create (default) @ openjpa-features ---
[INFO] 
[INFO] --- maven-enforcer-plugin:1.4.1:enforce (default) @ openjpa-features ---
[INFO] 
[INFO] --- maven-checkstyle-plugin:2.9:checkstyle (default) @ openjpa-features ---
[INFO] 
[INFO] --- maven-remote-resources-plugin:1.5:process (process-resource-bundles) @ openjpa-features
---
[INFO] 
[INFO] --- karaf-maven-plugin:4.2.0.M2:features-generate-descriptor (compile) @ openjpa-features
---
[ERROR] java.util.NoSuchElementException
      role: org.eclipse.aether.RepositorySystem
  roleHint: 
[INFO] ------------------------------------------------------------------------
[INFO] Reactor Summary:
[INFO] 
[INFO] OpenJPA Parent POM ................................ SUCCESS [11.883s]
[INFO] OpenJPA Utilities Library ......................... SUCCESS [14.426s]
[INFO] OpenJPA Kernel .................................... SUCCESS [11.367s]
[INFO] OpenJPA JDBC ...................................... SUCCESS [8.108s]
[INFO] OpenJPA Persistence ............................... SUCCESS [4.692s]
[INFO] OpenJPA Persistence JDBC .......................... SUCCESS [10:44.528s]
[INFO] OpenJPA Persistence Locking Tests ................. SUCCESS [23:44.127s]
[INFO] OpenJPA tools ..................................... SUCCESS [0.242s]
[INFO] OpenJPA Maven Plugin .............................. SUCCESS [1:01.550s]
[INFO] OpenJPA XML Store ................................. SUCCESS [5.721s]
[INFO] OpenJPA Slice ..................................... SUCCESS [1.915s]
[INFO] OpenJPA JEST ...................................... SUCCESS [5.020s]
[INFO] OpenJPA Aggregate Jar ............................. SUCCESS [6.085s]
[INFO] OpenJPA Aggregate Jar with Dependencies ........... SUCCESS [1.521s]
[INFO] OpenJPA Project Docs and Assemblies ............... SUCCESS [4.872s]
[INFO] OpenJPA Examples .................................. SUCCESS [0.214s]
[INFO] OpenJPA Examples - Simple ......................... SUCCESS [0.642s]
[INFO] OpenJPA Examples - image-gallery .................. SUCCESS [4.278s]
[INFO] OpenJPA Examples - OpenBooks ...................... SUCCESS [6.175s]
[INFO] OpenJPA Integration Tests ......................... SUCCESS [0.197s]
[INFO] OpenJPA Integration Tests - Daytrader ............. SUCCESS [4.514s]
[INFO] OpenJPA Integration Tests - Examples .............. SUCCESS [0.061s]
[INFO] OpenJPA Integration Tests - SLF4JLogFactory ....... SUCCESS [0.381s]
[INFO] OpenJPA Integration Tests - JPA TCK ............... SUCCESS [0.077s]
[INFO] OpenJPA Integration Tests - Bean Validation ....... SUCCESS [2.397s]
[INFO] OpenJPA Integration Tests - JMX Platform MBeans ... SUCCESS [6.415s]
[INFO] OpenJPA Fetching Statistic Tool ................... SUCCESS [0.363s]
[INFO] OpenJPA Fetching Statistic Tool -- WAS Bundle ..... SUCCESS [0.597s]
[INFO] OpenJPA Features .................................. FAILURE [4.163s]
[INFO] ------------------------------------------------------------------------
[INFO] BUILD FAILURE
[INFO] ------------------------------------------------------------------------
[INFO] Total time: 37:18.365s
[INFO] Finished at: Sat May 12 10:28:17 UTC 2018
[INFO] Final Memory: 232M/4603M
[INFO] ------------------------------------------------------------------------
[ERROR] Failed to execute goal org.apache.karaf.tooling:karaf-maven-plugin:4.2.0.M2:features-generate-descriptor
(compile) on project openjpa-features: Unable to create features.xml file: org.apache.maven.plugin.MojoExecutionException:
java.util.NoSuchElementException
[ERROR] role: org.eclipse.aether.RepositorySystem
[ERROR] roleHint:
[ERROR] -> [Help 1]
[ERROR] 
[ERROR] To see the full stack trace of the errors, re-run Maven with the -e switch.
[ERROR] Re-run Maven using the -X switch to enable full debug logging.
[ERROR] 
[ERROR] For more information about the errors and possible solutions, please read the following
articles:
[ERROR] [Help 1] http://cwiki.apache.org/confluence/display/MAVEN/MojoExecutionException
[ERROR] 
[ERROR] After correcting the problems, you can resume the build with the command
[ERROR]   mvn <goals> -rf :openjpa-features
Build step 'Execute shell' marked build as failure
Archiving artifacts
Setting ANT_1_9_7_HOME=/home/jenkins/tools/ant/apache-ant-1.9.7
Setting MAVEN_3_0_4_HOME=/home/jenkins/tools/maven/apache-maven-3.0.4
Setting JDK_1_8_LATEST__HOME=/home/jenkins/tools/java/latest1.8
Recording test results
Setting ANT_1_9_7_HOME=/home/jenkins/tools/ant/apache-ant-1.9.7
Setting MAVEN_3_0_4_HOME=/home/jenkins/tools/maven/apache-maven-3.0.4
Setting JDK_1_8_LATEST__HOME=/home/jenkins/tools/java/latest1.8
Setting ANT_1_9_7_HOME=/home/jenkins/tools/ant/apache-ant-1.9.7
Setting MAVEN_3_0_4_HOME=/home/jenkins/tools/maven/apache-maven-3.0.4
Setting JDK_1_8_LATEST__HOME=/home/jenkins/tools/java/latest1.8

Mime
View raw message