openjpa-commits mailing list archives

Site index · List index
Message view « Date » · « Thread »
Top « Date » · « Thread »
From Apache Jenkins Server <jenk...@builds.apache.org>
Subject Build failed in Jenkins: OpenJPA-2.4.x #1
Date Wed, 19 Jul 2017 15:40:39 GMT
See <https://builds.apache.org/job/OpenJPA-2.4.x/1/display/redirect>

------------------------------------------
[...truncated 5.08 MB...]
[INFO] Installing <https://builds.apache.org/job/OpenJPA-2.4.x/1/artifact/openjpa-all/target/openjpa-all-2.4.3-SNAPSHOT-tests.jar>
to /home/jenkins/.m2/repository/org/apache/openjpa/openjpa-all/2.4.3-SNAPSHOT/openjpa-all-2.4.3-SNAPSHOT-tests.jar
[INFO]                                                                         
[INFO] ------------------------------------------------------------------------
[INFO] Building OpenJPA Project Docs and Assemblies 2.4.3-SNAPSHOT
[INFO] ------------------------------------------------------------------------
[INFO] 
[INFO] --- maven-clean-plugin:2.5:clean (default-clean) @ apache-openjpa ---
[INFO] 
[INFO] --- buildnumber-maven-plugin:1.4:create (default) @ apache-openjpa ---
[INFO] 
[INFO] --- maven-enforcer-plugin:1.3.1:enforce (default) @ apache-openjpa ---
[INFO] 
[INFO] --- maven-checkstyle-plugin:2.9:checkstyle (default) @ apache-openjpa ---
[INFO] 
[INFO] --- maven-remote-resources-plugin:1.5:process (default) @ apache-openjpa ---
[INFO] 
[INFO] --- maven-compiler-plugin:3.5.1:testCompile (test-source-compile) @ apache-openjpa
---
[INFO] No sources to compile
[INFO] 
[INFO] --- maven-assembly-plugin:2.6:attached (bin) @ apache-openjpa ---
[INFO] Reading assembly descriptor: assembly.xml
[INFO] Reading assembly descriptor: source-assembly.xml
[INFO] Reading assembly descriptor: bin-assembly.xml
[WARNING] The assembly descriptor contains a filesystem-root relative reference, which is
not cross platform compatible /
[WARNING] Cannot include project artifact: org.apache.openjpa:apache-openjpa:pom:2.4.3-SNAPSHOT;
it doesn't have an associated file or directory.
[WARNING] Cannot include project artifact: org.apache.openjpa:apache-openjpa:pom:2.4.3-SNAPSHOT;
it doesn't have an associated file or directory.
[INFO] Building zip: <https://builds.apache.org/job/OpenJPA-2.4.x/ws/openjpa-project/target/site/downloads/apache-openjpa-2.4.3-SNAPSHOT-binary.zip>
[INFO] Building zip: <https://builds.apache.org/job/OpenJPA-2.4.x/ws/openjpa-project/target/site/downloads/apache-openjpa-2.4.3-SNAPSHOT-source.zip>
[WARNING] The assembly descriptor contains a filesystem-root relative reference, which is
not cross platform compatible /
[WARNING] Cannot include project artifact: org.apache.openjpa:apache-openjpa:pom:2.4.3-SNAPSHOT;
it doesn't have an associated file or directory.
[WARNING] Cannot include project artifact: org.apache.openjpa:apache-openjpa:pom:2.4.3-SNAPSHOT;
it doesn't have an associated file or directory.
[INFO] Building zip: <https://builds.apache.org/job/OpenJPA-2.4.x/ws/openjpa-project/target/site/downloads/apache-openjpa-2.4.3-SNAPSHOT-binary-nodocs.zip>
[INFO] 
[INFO] --- maven-site-plugin:3.4:attach-descriptor (attach-descriptor) @ apache-openjpa ---
[INFO] 
[INFO] --- ianal-maven-plugin:1.0-alpha-1:verify-legal-files (default) @ apache-openjpa ---
[INFO] Checking legal files in: apache-openjpa-2.4.3-SNAPSHOT-binary.zip
[INFO] Checking legal files in: apache-openjpa-2.4.3-SNAPSHOT-source.zip
[WARNING] Artifact does not contain any legal files: apache-openjpa-2.4.3-SNAPSHOT-source.zip
[INFO] Checking legal files in: apache-openjpa-2.4.3-SNAPSHOT-binary-nodocs.zip
[INFO] 
[INFO] --- apache-rat-plugin:0.11:check (default) @ apache-openjpa ---
[INFO] 51 implicit excludes (use -debug for more details).
[INFO] Exclude: **/.*/**
[INFO] Exclude: **/target/**/*
[INFO] 41 resources included (use -debug for more details)
[INFO] Rat check: Summary of files. Unapproved: 0 unknown: 0 generated: 0 approved: 41 licence.
[INFO] 
[INFO] --- maven-install-plugin:2.5.2:install (default-install) @ apache-openjpa ---
[INFO] Installing <https://builds.apache.org/job/OpenJPA-2.4.x/ws/openjpa-project/pom.xml>
to /home/jenkins/.m2/repository/org/apache/openjpa/apache-openjpa/2.4.3-SNAPSHOT/apache-openjpa-2.4.3-SNAPSHOT.pom
[INFO] Installing <https://builds.apache.org/job/OpenJPA-2.4.x/ws/openjpa-project/target/site/downloads/apache-openjpa-2.4.3-SNAPSHOT-binary.zip>
to /home/jenkins/.m2/repository/org/apache/openjpa/apache-openjpa/2.4.3-SNAPSHOT/apache-openjpa-2.4.3-SNAPSHOT-binary.zip
[INFO] Installing <https://builds.apache.org/job/OpenJPA-2.4.x/ws/openjpa-project/target/site/downloads/apache-openjpa-2.4.3-SNAPSHOT-source.zip>
to /home/jenkins/.m2/repository/org/apache/openjpa/apache-openjpa/2.4.3-SNAPSHOT/apache-openjpa-2.4.3-SNAPSHOT-source.zip
[INFO] Installing <https://builds.apache.org/job/OpenJPA-2.4.x/ws/openjpa-project/target/site/downloads/apache-openjpa-2.4.3-SNAPSHOT-binary-nodocs.zip>
to /home/jenkins/.m2/repository/org/apache/openjpa/apache-openjpa/2.4.3-SNAPSHOT/apache-openjpa-2.4.3-SNAPSHOT-binary-nodocs.zip
[INFO]                                                                         
[INFO] ------------------------------------------------------------------------
[INFO] Building OpenJPA Examples 2.4.3-SNAPSHOT
[INFO] ------------------------------------------------------------------------
[INFO] 
[INFO] --- maven-clean-plugin:2.5:clean (default-clean) @ openjpa-examples ---
[INFO] 
[INFO] --- buildnumber-maven-plugin:1.4:create (default) @ openjpa-examples ---
[INFO] 
[INFO] --- maven-enforcer-plugin:1.3.1:enforce (default) @ openjpa-examples ---
[INFO] 
[INFO] --- maven-checkstyle-plugin:2.9:checkstyle (default) @ openjpa-examples ---
[INFO] 
[INFO] --- maven-remote-resources-plugin:1.5:process (default) @ openjpa-examples ---
[INFO] 
[INFO] --- maven-compiler-plugin:3.5.1:testCompile (test-source-compile) @ openjpa-examples
---
[INFO] No sources to compile
[INFO] 
[INFO] --- maven-site-plugin:3.4:attach-descriptor (attach-descriptor) @ openjpa-examples
---
[INFO] 
[INFO] --- ianal-maven-plugin:1.0-alpha-1:verify-legal-files (default) @ openjpa-examples
---
[INFO] 
[INFO] --- apache-rat-plugin:0.11:check (default) @ openjpa-examples ---
[INFO] 51 implicit excludes (use -debug for more details).
[INFO] Exclude: **/.*/**
[INFO] Exclude: **/target/**/*
[INFO] 168 resources included (use -debug for more details)
[INFO] Rat check: Summary of files. Unapproved: 0 unknown: 0 generated: 0 approved: 167 licence.
[INFO] 
[INFO] --- maven-install-plugin:2.5.2:install (default-install) @ openjpa-examples ---
[INFO] Installing <https://builds.apache.org/job/OpenJPA-2.4.x/ws/openjpa-examples/pom.xml>
to /home/jenkins/.m2/repository/org/apache/openjpa/openjpa-examples/2.4.3-SNAPSHOT/openjpa-examples-2.4.3-SNAPSHOT.pom
[INFO]                                                                         
[INFO] ------------------------------------------------------------------------
[INFO] Building OpenJPA Examples - Simple 2.4.3-SNAPSHOT
[INFO] ------------------------------------------------------------------------
[INFO] 
[INFO] --- maven-clean-plugin:2.5:clean (default-clean) @ simple ---
[INFO] 
[INFO] --- buildnumber-maven-plugin:1.4:create (default) @ simple ---
[INFO] 
[INFO] --- maven-enforcer-plugin:1.3.1:enforce (default) @ simple ---
[INFO] 
[INFO] --- maven-checkstyle-plugin:2.9:checkstyle (default) @ simple ---
[INFO] Starting audit...
Audit done.

[WARNING] Unable to locate Source XRef to link to - DISABLED
[INFO] 
[INFO] --- maven-remote-resources-plugin:1.5:process (default) @ simple ---
[INFO] 
[INFO] --- maven-resources-plugin:2.7:resources (default-resources) @ simple ---
[INFO] Using 'UTF-8' encoding to copy filtered resources.
[INFO] skip non existing resourceDirectory <https://builds.apache.org/job/OpenJPA-2.4.x/ws/openjpa-examples/simple/src/main/resources>
[INFO] Copying 3 resources
[INFO] 
[INFO] --- maven-compiler-plugin:3.5.1:compile (default-compile) @ simple ---
[INFO] Changes detected - recompiling the module!
[INFO] Compiling 12 source files to <https://builds.apache.org/job/OpenJPA-2.4.x/ws/openjpa-examples/simple/target/classes>
[INFO] Some input files use unchecked or unsafe operations.
[INFO] Recompile with -Xlint:unchecked for details.
[INFO] 
[INFO] --- maven-compiler-plugin:3.5.1:testCompile (test-source-compile) @ simple ---
[INFO] Nothing to compile - all classes are up to date
[INFO] 
[INFO] --- maven-resources-plugin:2.7:testResources (default-testResources) @ simple ---
[INFO] Using 'UTF-8' encoding to copy filtered resources.
[INFO] skip non existing resourceDirectory <https://builds.apache.org/job/OpenJPA-2.4.x/ws/openjpa-examples/simple/src/test/resources>
[INFO] Copying 3 resources
[INFO] 
[INFO] --- maven-compiler-plugin:3.5.1:testCompile (default-testCompile) @ simple ---
[INFO] Nothing to compile - all classes are up to date
[INFO] 
[INFO] --- maven-surefire-plugin:2.19.1:test (default-test) @ simple ---
[INFO] 
[INFO] --- maven-jar-plugin:2.6:jar (default-jar) @ simple ---
[INFO] Building jar: <https://builds.apache.org/job/OpenJPA-2.4.x/ws/openjpa-examples/simple/target/simple-2.4.3-SNAPSHOT.jar>
[INFO] 
[INFO] --- maven-site-plugin:3.4:attach-descriptor (attach-descriptor) @ simple ---
[INFO] 
[INFO] --- maven-jar-plugin:2.6:test-jar (attach-tests) @ simple ---
[INFO] Building jar: <https://builds.apache.org/job/OpenJPA-2.4.x/ws/openjpa-examples/simple/target/simple-2.4.3-SNAPSHOT-tests.jar>
[INFO] 
[INFO] --- ianal-maven-plugin:1.0-alpha-1:verify-legal-files (default) @ simple ---
[INFO] Checking legal files in: simple-2.4.3-SNAPSHOT.jar
[INFO] Checking legal files in: simple-2.4.3-SNAPSHOT-tests.jar
[INFO] 
[INFO] --- apache-rat-plugin:0.11:check (default) @ simple ---
[INFO] 51 implicit excludes (use -debug for more details).
[INFO] Exclude: **/.*/**
[INFO] Exclude: **/target/**/*
[INFO] 23 resources included (use -debug for more details)
[INFO] Rat check: Summary of files. Unapproved: 0 unknown: 0 generated: 0 approved: 22 licence.
[INFO] 
[INFO] --- maven-install-plugin:2.5.2:install (default-install) @ simple ---
[INFO] Installing <https://builds.apache.org/job/OpenJPA-2.4.x/ws/openjpa-examples/simple/target/simple-2.4.3-SNAPSHOT.jar>
to /home/jenkins/.m2/repository/org/apache/openjpa/openjpa-examples/simple/2.4.3-SNAPSHOT/simple-2.4.3-SNAPSHOT.jar
[INFO] Installing <https://builds.apache.org/job/OpenJPA-2.4.x/ws/openjpa-examples/simple/pom.xml>
to /home/jenkins/.m2/repository/org/apache/openjpa/openjpa-examples/simple/2.4.3-SNAPSHOT/simple-2.4.3-SNAPSHOT.pom
[INFO] Installing <https://builds.apache.org/job/OpenJPA-2.4.x/ws/openjpa-examples/simple/target/simple-2.4.3-SNAPSHOT-tests.jar>
to /home/jenkins/.m2/repository/org/apache/openjpa/openjpa-examples/simple/2.4.3-SNAPSHOT/simple-2.4.3-SNAPSHOT-tests.jar
[INFO]                                                                         
[INFO] ------------------------------------------------------------------------
[INFO] Building OpenJPA Examples - image-gallery 2.4.3-SNAPSHOT
[INFO] ------------------------------------------------------------------------
[INFO] 
[INFO] --- maven-clean-plugin:2.5:clean (default-clean) @ image-gallery ---
[INFO] 
[INFO] --- buildnumber-maven-plugin:1.4:create (default) @ image-gallery ---
[INFO] 
[INFO] --- maven-enforcer-plugin:1.3.1:enforce (default) @ image-gallery ---
[INFO] 
[INFO] --- maven-checkstyle-plugin:2.9:checkstyle (default) @ image-gallery ---
[INFO] Starting audit...
Audit done.

[WARNING] Unable to locate Source XRef to link to - DISABLED
[INFO] 
[INFO] --- maven-remote-resources-plugin:1.5:process (default) @ image-gallery ---
[INFO] 
[INFO] --- maven-resources-plugin:2.7:resources (default-resources) @ image-gallery ---
[INFO] Using 'UTF-8' encoding to copy filtered resources.
[INFO] skip non existing resourceDirectory <https://builds.apache.org/job/OpenJPA-2.4.x/ws/openjpa-examples/image-gallery/src/main/resources>
[INFO] Copying 3 resources
[INFO] 
[INFO] --- maven-compiler-plugin:3.5.1:compile (default-compile) @ image-gallery ---
[INFO] Nothing to compile - all classes are up to date
[INFO] 
[INFO] --- maven-compiler-plugin:3.5.1:testCompile (test-source-compile) @ image-gallery ---
[INFO] Changes detected - recompiling the module!
[INFO] Compiling 12 source files to <https://builds.apache.org/job/OpenJPA-2.4.x/ws/openjpa-examples/image-gallery/target/test-classes>
[INFO] -------------------------------------------------------------
[ERROR] COMPILATION ERROR : 
[INFO] -------------------------------------------------------------
[ERROR] error: Bad service configuration file, or exception thrown while constructing Processor
object: javax.annotation.processing.Processor: Provider org.apache.openjpa.persistence.meta.AnnotationProcessor6
could not be instantiated: java.lang.OutOfMemoryError: PermGen space
[INFO] 1 error
[INFO] -------------------------------------------------------------
[INFO] ------------------------------------------------------------------------
[INFO] Reactor Summary:
[INFO] 
[INFO] OpenJPA Parent POM ................................ SUCCESS [10.203s]
[INFO] OpenJPA Utilities Library ......................... SUCCESS [12.137s]
[INFO] OpenJPA Kernel .................................... SUCCESS [14.797s]
[INFO] OpenJPA JDBC ...................................... SUCCESS [6.849s]
[INFO] OpenJPA Persistence ............................... SUCCESS [6.412s]
[INFO] OpenJPA Persistence JDBC .......................... SUCCESS [12:06.724s]
[INFO] OpenJPA Persistence Locking Tests ................. SUCCESS [23:44.380s]
[INFO] OpenJPA tools ..................................... SUCCESS [0.307s]
[INFO] OpenJPA Maven Plugin .............................. SUCCESS [1:18.087s]
[INFO] OpenJPA XML Store ................................. SUCCESS [5.900s]
[INFO] OpenJPA Slice ..................................... SUCCESS [1.944s]
[INFO] OpenJPA JEST ...................................... SUCCESS [10.711s]
[INFO] OpenJPA Aggregate Jar ............................. SUCCESS [5.826s]
[INFO] OpenJPA Aggregate Jar with Dependencies ........... SUCCESS [1.392s]
[INFO] OpenJPA Project Docs and Assemblies ............... SUCCESS [7.530s]
[INFO] OpenJPA Examples .................................. SUCCESS [0.101s]
[INFO] OpenJPA Examples - Simple ......................... SUCCESS [2.576s]
[INFO] OpenJPA Examples - image-gallery .................. FAILURE [6.160s]
[INFO] OpenJPA Examples - OpenBooks ...................... SKIPPED
[INFO] OpenJPA Integration Tests ......................... SKIPPED
[INFO] OpenJPA Integration Tests - Daytrader ............. SKIPPED
[INFO] OpenJPA Integration Tests - Examples .............. SKIPPED
[INFO] OpenJPA Integration Tests - SLF4JLogFactory ....... SKIPPED
[INFO] OpenJPA Integration Tests - JPA TCK ............... SKIPPED
[INFO] OpenJPA Integration Tests - Bean Validation ....... SKIPPED
[INFO] OpenJPA Integration Tests - JMX Platform MBeans ... SKIPPED
[INFO] OpenJPA Fetching Statistic Tool ................... SKIPPED
[INFO] OpenJPA Fetching Statistic Tool -- WAS Bundle ..... SKIPPED
[INFO] ------------------------------------------------------------------------
[INFO] BUILD FAILURE
[INFO] ------------------------------------------------------------------------
[INFO] Total time: 38:43.907s
[INFO] Finished at: Wed Jul 19 15:40:28 UTC 2017
[INFO] Final Memory: 71M/3985M
[INFO] ------------------------------------------------------------------------
[ERROR] Failed to execute goal org.apache.maven.plugins:maven-compiler-plugin:3.5.1:testCompile
(test-source-compile) on project image-gallery: Compilation failure
[ERROR] error: Bad service configuration file, or exception thrown while constructing Processor
object: javax.annotation.processing.Processor: Provider org.apache.openjpa.persistence.meta.AnnotationProcessor6
could not be instantiated: java.lang.OutOfMemoryError: PermGen space
[ERROR] -> [Help 1]
[ERROR] 
[ERROR] To see the full stack trace of the errors, re-run Maven with the -e switch.
[ERROR] Re-run Maven using the -X switch to enable full debug logging.
[ERROR] 
[ERROR] For more information about the errors and possible solutions, please read the following
articles:
[ERROR] [Help 1] http://cwiki.apache.org/confluence/display/MAVEN/MojoFailureException
[ERROR] 
[ERROR] After correcting the problems, you can resume the build with the command
[ERROR]   mvn <goals> -rf :image-gallery
Build step 'Execute shell' marked build as failure
Archiving artifacts
Setting ANT_1_9_7_HOME=/home/jenkins/tools/ant/apache-ant-1.9.7
Setting JDK_1_6_LATEST__HOME=/home/jenkins/tools/java/latest1.6
Setting MAVEN_3_0_4_HOME=/home/jenkins/tools/maven/apache-maven-3.0.4
[Fast Archiver] No prior successful build to compare, so performing full copy of artifacts
Recording test results
Setting ANT_1_9_7_HOME=/home/jenkins/tools/ant/apache-ant-1.9.7
Setting JDK_1_6_LATEST__HOME=/home/jenkins/tools/java/latest1.6
Setting MAVEN_3_0_4_HOME=/home/jenkins/tools/maven/apache-maven-3.0.4
Setting ANT_1_9_7_HOME=/home/jenkins/tools/ant/apache-ant-1.9.7
Setting JDK_1_6_LATEST__HOME=/home/jenkins/tools/java/latest1.6
Setting MAVEN_3_0_4_HOME=/home/jenkins/tools/maven/apache-maven-3.0.4

Mime
View raw message