openjpa-commits mailing list archives

Site index · List index
Message view « Date » · « Thread »
Top « Date » · « Thread »
From Apache Jenkins Server <jenk...@builds.apache.org>
Subject Build failed in Jenkins: OpenJPA-trunk #1087
Date Thu, 27 Oct 2016 14:45:03 GMT
See <https://builds.apache.org/job/OpenJPA-trunk/1087/changes>

Changes:

[struberg] OPENJPA-2677 prepare upgrade to BVal-1.1.2

------------------------------------------
[...truncated 11908 lines...]
9447  locking-test  INFO   [pool-1-thread-1 for channel] openjpa.Tool - Enhancer running on
type "class org.apache.openjpa.persistence.lockmgr.LockEmployee".
9642  locking-test  INFO   [pool-1-thread-1 for channel] openjpa.Tool - Enhancer running on
type "class org.apache.openjpa.persistence.lock.extended.TestBasicLockScope".
9720  locking-test  INFO   [pool-1-thread-1 for channel] openjpa.Tool - Enhancer running on
type "class org.apache.openjpa.persistence.lockmgr.TestPessimisticLocks$RefreshWithLock".
9741  locking-test  INFO   [pool-1-thread-1 for channel] openjpa.Tool - Enhancer running on
type "class org.apache.openjpa.persistence.lockmgr.SequencedActionsTest$TestThread".
9754  locking-test  INFO   [pool-1-thread-1 for channel] openjpa.Tool - Enhancer running on
type "class org.apache.openjpa.persistence.test.PersistenceTestCase$1".
9759  locking-test  INFO   [pool-1-thread-1 for channel] openjpa.Tool - Enhancer running on
type "class org.apache.openjpa.persistence.lock.extended.LSEEleCol".
9948  locking-test  INFO   [pool-1-thread-1 for channel] openjpa.Tool - Enhancer running on
type "class org.apache.openjpa.persistence.lockmgr.SequencedActionsTest$1".
10051  locking-test  INFO   [pool-1-thread-1 for channel] openjpa.Tool - Enhancer running
on type "class org.apache.openjpa.persistence.test.SingleEMTestCase".
10125  locking-test  INFO   [pool-1-thread-1 for channel] openjpa.Tool - Enhancer running
on type "class org.apache.openjpa.persistence.lockmgr.TestPessimisticLocks".
10216  locking-test  INFO   [pool-1-thread-1 for channel] openjpa.Tool - Enhancer running
on type "class org.apache.openjpa.persistence.test.AbstractPersistenceTestCase".
10451  locking-test  INFO   [pool-1-thread-1 for channel] openjpa.Tool - Enhancer running
on type "class org.apache.openjpa.persistence.lockmgr.LockEmployeeNonVersion".
10561  locking-test  INFO   [pool-1-thread-1 for channel] openjpa.Tool - Enhancer running
on type "class org.apache.openjpa.persistence.lock.extended.TestBasicLockScope$4".
10633  locking-test  INFO   [pool-1-thread-1 for channel] openjpa.Tool - Enhancer running
on type "class org.apache.openjpa.persistence.lockmgr.TestMixedLockManagerRefreshPermutation".
10670  locking-test  INFO   [pool-1-thread-1 for channel] openjpa.Tool - Enhancer running
on type "class org.apache.openjpa.persistence.lock.extended.LSE1x1LfLzy".
10870  locking-test  INFO   [pool-1-thread-1 for channel] openjpa.Tool - Enhancer running
on type "class org.apache.openjpa.persistence.lockmgr.TestLocking$CommitterThread".
10872  locking-test  INFO   [pool-1-thread-1 for channel] openjpa.Tool - Enhancer running
on type "class org.apache.openjpa.persistence.lock.extended.LSE1xmLfJTEgr".
10957  locking-test  INFO   [pool-1-thread-1 for channel] openjpa.Tool - Enhancer running
on type "class org.apache.openjpa.persistence.lock.extended.LSE1xmLfEgr".
11038  locking-test  INFO   [pool-1-thread-1 for channel] openjpa.Tool - Enhancer running
on type "class org.apache.openjpa.persistence.lockmgr.TestMixedLockManagerLockPermutation".
11141  locking-test  INFO   [pool-1-thread-1 for channel] openjpa.Tool - Enhancer running
on type "class org.apache.openjpa.persistence.lock.extended.LSEJoinCon".
11526  locking-test  INFO   [pool-1-thread-1 for channel] openjpa.Tool - Enhancer running
on type "class org.apache.openjpa.persistence.lock.extended.LSEBase".
11601  locking-test  INFO   [pool-1-thread-1 for channel] openjpa.Tool - Enhancer running
on type "class org.apache.openjpa.persistence.lockmgr.MixedLockManagerGenericTest".
11648  locking-test  INFO   [pool-1-thread-1 for channel] openjpa.Tool - Enhancer running
on type "class org.apache.openjpa.persistence.test.CombinationGenerator".
11687  locking-test  INFO   [pool-1-thread-1 for channel] openjpa.Tool - Enhancer running
on type "class org.apache.openjpa.persistence.lock.extended.LockScopeTestCase".
11762  locking-test  INFO   [pool-1-thread-1 for channel] openjpa.Tool - Enhancer running
on type "class org.apache.openjpa.persistence.lockmgr.TestMixedLockManagerLockBasic".
11766  locking-test  INFO   [pool-1-thread-1 for channel] openjpa.Tool - Enhancer running
on type "class org.apache.openjpa.persistence.test.ContainerEMFTest".
11808  locking-test  INFO   [pool-1-thread-1 for channel] openjpa.Tool - Enhancer running
on type "class org.apache.openjpa.persistence.test.SingleEMFTestCase".
11893  locking-test  INFO   [pool-1-thread-1 for channel] openjpa.Tool - Enhancer running
on type "class org.apache.openjpa.persistence.lock.extended.TestBasicLockScope$1".
12018  locking-test  INFO   [pool-1-thread-1 for channel] openjpa.Tool - Enhancer running
on type "class org.apache.openjpa.persistence.lock.extended.Test1xmLockScope$1".
12107  locking-test  INFO   [pool-1-thread-1 for channel] openjpa.Tool - Enhancer running
on type "class org.apache.openjpa.persistence.lock.extended.LSESecTbl".
12600  locking-test  INFO   [pool-1-thread-1 for channel] openjpa.Tool - Enhancer running
on type "class org.apache.openjpa.persistence.lock.extended.Test1x1LockScope$3".
12671  locking-test  INFO   [pool-1-thread-1 for channel] openjpa.Tool - Enhancer running
on type "class org.apache.openjpa.persistence.lock.extended.TestBasicLockScope$6".
12711  locking-test  INFO   [pool-1-thread-1 for channel] openjpa.Tool - Enhancer running
on type "class org.apache.openjpa.persistence.test.SQLListenerTestCase$SQLAssertions".
12759  locking-test  INFO   [pool-1-thread-1 for channel] openjpa.Tool - Enhancer running
on type "class org.apache.openjpa.persistence.lock.extended.Test1xmLockScope$2".
12783  locking-test  INFO   [pool-1-thread-1 for channel] openjpa.Tool - Enhancer running
on type "class org.apache.openjpa.persistence.lock.extended.Test1x1LockScope".
12924  locking-test  INFO   [pool-1-thread-1 for channel] openjpa.Tool - Enhancer running
on type "class org.apache.openjpa.persistence.test.FilteringJDBCListener".
12963  locking-test  INFO   [pool-1-thread-1 for channel] openjpa.Tool - Enhancer running
on type "class org.apache.openjpa.persistence.test.PersistenceTestCase".
13109  locking-test  INFO   [pool-1-thread-1 for channel] openjpa.Tool - Enhancer running
on type "class org.apache.openjpa.persistence.lock.extended.LSESngTblCon".
13265  locking-test  INFO   [pool-1-thread-1 for channel] openjpa.Tool - Enhancer running
on type "class org.apache.openjpa.persistence.lock.extended.TestBasicLockScope$2".
13345  locking-test  INFO   [pool-1-thread-1 for channel] openjpa.Tool - Enhancer running
on type "class org.apache.openjpa.persistence.lock.extended.Test1x1LockScope$4".
13452  locking-test  INFO   [pool-1-thread-1 for channel] openjpa.Tool - Enhancer running
on type "class org.apache.openjpa.persistence.lockmgr.TestMixedLockManagerFindException".
13502  locking-test  INFO   [pool-1-thread-1 for channel] openjpa.Tool - Enhancer running
on type "class org.apache.openjpa.persistence.lockmgr.TestOptimisticNamedQueryLockMode".
13514  locking-test  INFO   [pool-1-thread-1 for channel] openjpa.Tool - Enhancer running
on type "class org.apache.openjpa.persistence.test.AbstractCachedEMFTestCase$EMFKey".
13546  locking-test  INFO   [pool-1-thread-1 for channel] openjpa.Tool - No metadata was found
for 72 classes; they have been enhanced as persistence-aware. If you intended for any of these
classes to be persistence-capable, then this means that OpenJPA could not find any metadata
for those classes. This can happen if the directory containing your metadata is not in your
CLASSPATH, or if your metadata files are not named properly. See the documentation on metadata
placement for more information. Persistence-aware classes: [class org.apache.openjpa.persistence.lockmgr.TestFetchHints,
class org.apache.openjpa.persistence.lockmgr.TestLocking, class org.apache.openjpa.persistence.lockmgr.TestMixedLockManagerRefreshBasic,
class org.apache.openjpa.persistence.lockmgr.TestNamedQueryLockMode, class org.apache.openjpa.persistence.lock.extended.Test1x1LockScope$2,
class org.apache.openjpa.persistence.test.AbstractCachedEMFTestCase$1, class org.apache.openjpa.persistence.test.ClassSelector$2,
class org.apache.openjpa.persistence.lockmgr.TestMixedLockManagerRefreshException, class org.apache.openjpa.persistence.lock.extended.TestBasicLockScope$5,
class org.apache.openjpa.persistence.lock.extended.TestBasicLockScope, class org.apache.openjpa.persistence.lockmgr.TestPessimisticLocks$RefreshWithLock,
class org.apache.openjpa.persistence.lockmgr.SequencedActionsTest$TestThread, class org.apache.openjpa.persistence.test.PersistenceTestCase$1,
class org.apache.openjpa.persistence.lockmgr.SequencedActionsTest$1, class org.apache.openjpa.persistence.test.SingleEMTestCase,
class org.apache.openjpa.persistence.lockmgr.SequencedActionsTest, class org.apache.openjpa.persistence.lock.extended.Test1xmLockScope,
class org.apache.openjpa.persistence.lock.extended.Test1x1LockScope$5, class org.apache.openjpa.persistence.lockmgr.TestPessimisticLocks,
class org.apache.openjpa.persistence.test.AbstractPersistenceTestCase, class org.apache.openjpa.persistence.lock.extended.Test1x1LockScope$1,
class org.apache.openjpa.persistence.lock.extended.TestBasicLockScope$4, class org.apache.openjpa.persistence.lockmgr.TestMixedLockManagerRefreshPermutation,
class org.apache.openjpa.persistence.lockmgr.TestLocking$CommitterThread, class org.apache.openjpa.persistence.lockmgr.SequencedActionsTest$Act,
class org.apache.openjpa.persistence.test.SQLListenerTestCase$1, class org.apache.openjpa.persistence.lockmgr.TestMixedLockManagerLockPermutation,
class org.apache.openjpa.persistence.lockmgr.TestMixedLockManagerLockException, class org.apache.openjpa.persistence.test.AbstractCachedEMFTestCase$FixedMap,
class org.apache.openjpa.persistence.lock.extended.Test1xmLockScope$4, class org.apache.openjpa.persistence.lock.extended.TestBasicLockScope$7,
class org.apache.openjpa.persistence.test.PersistenceTestCase$EMFKey, class org.apache.openjpa.persistence.test.ClassSelector,
class org.apache.openjpa.persistence.lockmgr.MixedLockManagerGenericTest, class org.apache.openjpa.persistence.lockmgr.TestMixedLockManagerNonVersion,
class org.apache.openjpa.persistence.lockmgr.SequencedActionsTest$DBType, class org.apache.openjpa.persistence.test.AbstractCachedEMFTestCase,
class org.apache.openjpa.persistence.test.CombinationGenerator, class org.apache.openjpa.persistence.lockmgr.TestEmLockMode,
class org.apache.openjpa.persistence.test.SQLListenerTestCase, class org.apache.openjpa.persistence.lockmgr.TestMixedLockManagerFindBasic,
class org.apache.openjpa.persistence.lock.extended.LockScopeTestCase, class org.apache.openjpa.persistence.lockmgr.TestEmLockTimeout,
class org.apache.openjpa.persistence.test.ContainerEMFTest, class org.apache.openjpa.persistence.lockmgr.TestMixedLockManagerLockBasic,
class org.apache.openjpa.persistence.lockmgr.SequencedActionsTest$PlatformSpeedTestThread,
class org.apache.openjpa.persistence.lock.extended.Test1xmLockScope$3, class org.apache.openjpa.persistence.lockmgr.TestMixedLockManagerDeadlock,
class org.apache.openjpa.persistence.test.SingleEMFTestCase, class org.apache.openjpa.persistence.lock.extended.Test1xmLockScope$1,
class org.apache.openjpa.persistence.lock.extended.TestBasicLockScope$1, class org.apache.openjpa.persistence.lock.extended.TestBasicLockScope$3,
class org.apache.openjpa.persistence.test.CombinatorialTestHelper, class org.apache.openjpa.persistence.lock.extended.Test1x1LockScope$3,
class org.apache.openjpa.persistence.lock.extended.TestBasicLockScope$6, class org.apache.openjpa.persistence.test.SQLListenerTestCase$SQLAssertType,
class org.apache.openjpa.persistence.lock.extended.Test1xmLockScope$5, class org.apache.openjpa.persistence.test.FilteringJDBCListener,
class org.apache.openjpa.persistence.lock.extended.Test1x1LockScope, class org.apache.openjpa.persistence.lock.extended.Test1xmLockScope$2,
class org.apache.openjpa.persistence.test.SQLListenerTestCase$SQLAssertions, class org.apache.openjpa.persistence.test.CombinatorialPersistenceTestCase,
class org.apache.openjpa.persistence.test.PersistenceTestCase, class org.apache.openjpa.persistence.lock.extended.Test1x1LockScope$4,
class org.apache.openjpa.persistence.lock.extended.TestBasicLockScope$2, class org.apache.openjpa.persistence.lock.extended.LockScopeTestCase$DBType,
class org.apache.openjpa.persistence.test.PersistenceTestCase$FixedMap, class org.apache.openjpa.persistence.lockmgr.TestMixedLockManagerFindException,
class org.apache.openjpa.persistence.lockmgr.TestOptimisticNamedQueryLockMode, class org.apache.openjpa.persistence.test.ClassSelector$1,
class org.apache.openjpa.persistence.test.AbstractCachedEMFTestCase$EMFKey, class org.apache.openjpa.persistence.lockmgr.TestMixedLockManagerFindPermutation]
[INFO] Executed tasks
[INFO] 
[INFO] --- maven-surefire-plugin:2.19.1:test (default-test) @ openjpa-persistence-locking
---

-------------------------------------------------------
 T E S T S
-------------------------------------------------------
Running org.apache.openjpa.persistence.lockmgr.TestMixedLockManagerRefreshException
Tests run: 3, Failures: 0, Errors: 0, Skipped: 0, Time elapsed: 29.114 sec - in org.apache.openjpa.persistence.lockmgr.TestMixedLockManagerRefreshException
Running org.apache.openjpa.persistence.lockmgr.TestMixedLockManagerRefreshPermutation
Tests run: 25, Failures: 0, Errors: 0, Skipped: 0, Time elapsed: 296.042 sec - in org.apache.openjpa.persistence.lockmgr.TestMixedLockManagerRefreshPermutation
Running org.apache.openjpa.persistence.lockmgr.TestLocking
Tests run: 1, Failures: 0, Errors: 0, Skipped: 0, Time elapsed: 10.96 sec - in org.apache.openjpa.persistence.lockmgr.TestLocking
Running org.apache.openjpa.persistence.lockmgr.TestEmLockMode
Tests run: 4, Failures: 0, Errors: 0, Skipped: 0, Time elapsed: 0.806 sec - in org.apache.openjpa.persistence.lockmgr.TestEmLockMode
Running org.apache.openjpa.persistence.lockmgr.TestOptimisticNamedQueryLockMode
Tests run: 4, Failures: 0, Errors: 0, Skipped: 0, Time elapsed: 0.341 sec - in org.apache.openjpa.persistence.lockmgr.TestOptimisticNamedQueryLockMode
Running org.apache.openjpa.persistence.lockmgr.TestMixedLockManagerFindBasic
Tests run: 7, Failures: 0, Errors: 0, Skipped: 0, Time elapsed: 1.096 sec - in org.apache.openjpa.persistence.lockmgr.TestMixedLockManagerFindBasic
Running org.apache.openjpa.persistence.lockmgr.TestPessimisticLocks
Tests run: 6, Failures: 0, Errors: 0, Skipped: 0, Time elapsed: 302.631 sec - in org.apache.openjpa.persistence.lockmgr.TestPessimisticLocks
Running org.apache.openjpa.persistence.lockmgr.TestMixedLockManagerDeadlock
Tests run: 2, Failures: 0, Errors: 0, Skipped: 0, Time elapsed: 30.015 sec - in org.apache.openjpa.persistence.lockmgr.TestMixedLockManagerDeadlock
Running org.apache.openjpa.persistence.lockmgr.TestEmLockTimeout
Tests run: 3, Failures: 0, Errors: 0, Skipped: 0, Time elapsed: 0.195 sec - in org.apache.openjpa.persistence.lockmgr.TestEmLockTimeout
Running org.apache.openjpa.persistence.lockmgr.TestMixedLockManagerNonVersion
Tests run: 3, Failures: 0, Errors: 0, Skipped: 0, Time elapsed: 1.101 sec - in org.apache.openjpa.persistence.lockmgr.TestMixedLockManagerNonVersion
Running org.apache.openjpa.persistence.lockmgr.TestFetchHints
Tests run: 36, Failures: 0, Errors: 0, Skipped: 0, Time elapsed: 3.247 sec - in org.apache.openjpa.persistence.lockmgr.TestFetchHints
Running org.apache.openjpa.persistence.lockmgr.TestNamedQueryLockMode
Tests run: 5, Failures: 0, Errors: 0, Skipped: 0, Time elapsed: 0.136 sec - in org.apache.openjpa.persistence.lockmgr.TestNamedQueryLockMode
Running org.apache.openjpa.persistence.lockmgr.TestMixedLockManagerRefreshBasic
Tests run: 7, Failures: 0, Errors: 0, Skipped: 0, Time elapsed: 1.018 sec - in org.apache.openjpa.persistence.lockmgr.TestMixedLockManagerRefreshBasic
Running org.apache.openjpa.persistence.lockmgr.TestMixedLockManagerFindPermutation
Tests run: 25, Failures: 0, Errors: 0, Skipped: 0, Time elapsed: 379.61 sec - in org.apache.openjpa.persistence.lockmgr.TestMixedLockManagerFindPermutation
Running org.apache.openjpa.persistence.lockmgr.TestMixedLockManagerFindException
Tests run: 3, Failures: 0, Errors: 0, Skipped: 0, Time elapsed: 21.62 sec - in org.apache.openjpa.persistence.lockmgr.TestMixedLockManagerFindException
Running org.apache.openjpa.persistence.lockmgr.TestMixedLockManagerLockPermutation
Tests run: 25, Failures: 0, Errors: 0, Skipped: 0, Time elapsed: 379.265 sec - in org.apache.openjpa.persistence.lockmgr.TestMixedLockManagerLockPermutation
Running org.apache.openjpa.persistence.lockmgr.TestMixedLockManagerLockBasic
Tests run: 7, Failures: 0, Errors: 0, Skipped: 0, Time elapsed: 1.093 sec - in org.apache.openjpa.persistence.lockmgr.TestMixedLockManagerLockBasic
Running org.apache.openjpa.persistence.lockmgr.TestMixedLockManagerLockException
Tests run: 3, Failures: 0, Errors: 0, Skipped: 0, Time elapsed: 10.597 sec - in org.apache.openjpa.persistence.lockmgr.TestMixedLockManagerLockException
Running org.apache.openjpa.persistence.lock.extended.TestBasicLockScope
Tests run: 12, Failures: 0, Errors: 0, Skipped: 0, Time elapsed: 6.35 sec - in org.apache.openjpa.persistence.lock.extended.TestBasicLockScope
Running org.apache.openjpa.persistence.lock.extended.Test1xmLockScope
Tests run: 8, Failures: 0, Errors: 0, Skipped: 0, Time elapsed: 4.975 sec - in org.apache.openjpa.persistence.lock.extended.Test1xmLockScope
Running org.apache.openjpa.persistence.lock.extended.Test1x1LockScope
Tests run: 8, Failures: 0, Errors: 0, Skipped: 0, Time elapsed: 4.324 sec - in org.apache.openjpa.persistence.lock.extended.Test1x1LockScope

Results :

Tests run: 197, Failures: 0, Errors: 0, Skipped: 0

[JENKINS] Recording test results
[INFO] 
[INFO] --- maven-jar-plugin:3.0.0:jar (default-jar) @ openjpa-persistence-locking ---
[INFO] Building jar: <https://builds.apache.org/job/OpenJPA-trunk/ws/trunk/openjpa-persistence-locking/target/openjpa-persistence-locking-3.0.0-SNAPSHOT.jar>
[INFO] 
[INFO] --- maven-site-plugin:3.5.1:attach-descriptor (attach-descriptor) @ openjpa-persistence-locking
---
[INFO] 
[INFO] --- maven-jar-plugin:3.0.0:test-jar (attach-tests) @ openjpa-persistence-locking ---
[INFO] Building jar: <https://builds.apache.org/job/OpenJPA-trunk/ws/trunk/openjpa-persistence-locking/target/openjpa-persistence-locking-3.0.0-SNAPSHOT-tests.jar>
[INFO] 
[INFO] --- apache-rat-plugin:0.11:check (default) @ openjpa-persistence-locking ---
[INFO] 51 implicit excludes (use -debug for more details).
[INFO] Exclude: **/.*/**
[INFO] Exclude: **/target/**/*
[INFO] 51 resources included (use -debug for more details)
[INFO] Rat check: Summary of files. Unapproved: 0 unknown: 0 generated: 0 approved: 51 licence.
[INFO] 
[INFO] --- maven-install-plugin:2.5.2:install (default-install) @ openjpa-persistence-locking
---
[INFO] Installing <https://builds.apache.org/job/OpenJPA-trunk/ws/trunk/openjpa-persistence-locking/target/openjpa-persistence-locking-3.0.0-SNAPSHOT.jar>
to /home/jenkins/jenkins-slave/maven-repositories/1/org/apache/openjpa/openjpa-persistence-locking/3.0.0-SNAPSHOT/openjpa-persistence-locking-3.0.0-SNAPSHOT.jar
[INFO] Installing <https://builds.apache.org/job/OpenJPA-trunk/ws/trunk/openjpa-persistence-locking/pom.xml>
to /home/jenkins/jenkins-slave/maven-repositories/1/org/apache/openjpa/openjpa-persistence-locking/3.0.0-SNAPSHOT/openjpa-persistence-locking-3.0.0-SNAPSHOT.pom
[INFO] Installing <https://builds.apache.org/job/OpenJPA-trunk/ws/trunk/openjpa-persistence-locking/target/openjpa-persistence-locking-3.0.0-SNAPSHOT-tests.jar>
to /home/jenkins/jenkins-slave/maven-repositories/1/org/apache/openjpa/openjpa-persistence-locking/3.0.0-SNAPSHOT/openjpa-persistence-locking-3.0.0-SNAPSHOT-tests.jar
[INFO]                                                                         
[INFO] ------------------------------------------------------------------------
[INFO] Building OpenJPA tools 3.0.0-SNAPSHOT
[INFO] ------------------------------------------------------------------------
[INFO] 
[INFO] --- maven-clean-plugin:3.0.0:clean (default-clean) @ openjpa-tools ---
[INFO] 
[INFO] --- buildnumber-maven-plugin:1.4:create (default) @ openjpa-tools ---
[INFO] 
[INFO] --- maven-enforcer-plugin:1.4.1:enforce (default) @ openjpa-tools ---
[INFO] 
[INFO] --- maven-checkstyle-plugin:2.9:checkstyle (default) @ openjpa-tools ---
[INFO] 
[INFO] --- maven-remote-resources-plugin:1.5:process (process-resource-bundles) @ openjpa-tools
---
[INFO] 
[INFO] --- maven-compiler-plugin:3.5.1:testCompile (test-source-compile) @ openjpa-tools ---
[INFO] No sources to compile
[INFO] 
[INFO] --- maven-site-plugin:3.5.1:attach-descriptor (attach-descriptor) @ openjpa-tools ---
[INFO] 
[INFO] --- apache-rat-plugin:0.11:check (default) @ openjpa-tools ---
[INFO] 51 implicit excludes (use -debug for more details).
[INFO] Exclude: **/.*/**
[INFO] Exclude: **/target/**/*
[INFO] 62 resources included (use -debug for more details)
[INFO] Rat check: Summary of files. Unapproved: 0 unknown: 0 generated: 0 approved: 60 licence.
[INFO] 
[INFO] --- maven-install-plugin:2.5.2:install (default-install) @ openjpa-tools ---
[INFO] Installing <https://builds.apache.org/job/OpenJPA-trunk/ws/trunk/openjpa-tools/pom.xml>
to /home/jenkins/jenkins-slave/maven-repositories/1/org/apache/openjpa/openjpa-tools/3.0.0-SNAPSHOT/openjpa-tools-3.0.0-SNAPSHOT.pom
[INFO]                                                                         
[INFO] ------------------------------------------------------------------------
[INFO] Building OpenJPA Maven Plugin 3.0.0-SNAPSHOT
[INFO] ------------------------------------------------------------------------
Downloading: http://repository.apache.org/snapshots/org/apache/bval/org.apache.bval.bundle/1.1.2-SNAPSHOT/maven-metadata.xml
Downloading: http://repository.apache.org/snapshots/org/apache/bval/org.apache.bval.bundle/1.1.2-SNAPSHOT/org.apache.bval.bundle-1.1.2-SNAPSHOT.pom
[WARNING] The POM for org.apache.bval:org.apache.bval.bundle:jar:1.1.2-SNAPSHOT is missing,
no dependency information available
Downloading: http://repository.apache.org/snapshots/org/apache/bval/org.apache.bval.bundle/1.1.2-SNAPSHOT/org.apache.bval.bundle-1.1.2-SNAPSHOT.jar
[INFO] ------------------------------------------------------------------------
[INFO] Reactor Summary:
[INFO] 
[INFO] OpenJPA Parent POM ................................ SUCCESS [32.542s]
[INFO] OpenJPA Utilities Library ......................... SUCCESS [54.945s]
[INFO] OpenJPA Kernel .................................... SUCCESS [19.939s]
[INFO] OpenJPA JDBC ...................................... SUCCESS [15.077s]
[INFO] OpenJPA Persistence ............................... SUCCESS [9.387s]
[INFO] OpenJPA Persistence JDBC .......................... SUCCESS [37:21.047s]
[INFO] OpenJPA Persistence Locking Tests ................. SUCCESS [25:20.272s]
[INFO] OpenJPA tools ..................................... SUCCESS [4.792s]
[INFO] OpenJPA Maven Plugin .............................. FAILURE [3.420s]
[INFO] OpenJPA XML Store ................................. SKIPPED
[INFO] OpenJPA Slice ..................................... SKIPPED
[INFO] OpenJPA JEST ...................................... SKIPPED
[INFO] OpenJPA Aggregate Jar ............................. SKIPPED
[INFO] OpenJPA Aggregate Jar with Dependencies ........... SKIPPED
[INFO] OpenJPA Project Docs and Assemblies ............... SKIPPED
[INFO] OpenJPA Examples .................................. SKIPPED
[INFO] OpenJPA Examples - Simple ......................... SKIPPED
[INFO] OpenJPA Examples - image-gallery .................. SKIPPED
[INFO] OpenJPA Examples - OpenBooks ...................... SKIPPED
[INFO] OpenJPA Integration Tests ......................... SKIPPED
[INFO] OpenJPA Integration Tests - Daytrader ............. SKIPPED
[INFO] OpenJPA Integration Tests - Examples .............. SKIPPED
[INFO] OpenJPA Integration Tests - SLF4JLogFactory ....... SKIPPED
[INFO] OpenJPA Integration Tests - JPA TCK ............... SKIPPED
[INFO] OpenJPA Integration Tests - Bean Validation ....... SKIPPED
[INFO] OpenJPA Integration Tests - JMX Platform MBeans ... SKIPPED
[INFO] OpenJPA Fetching Statistic Tool ................... SKIPPED
[INFO] OpenJPA Fetching Statistic Tool -- WAS Bundle ..... SKIPPED
[INFO] OpenJPA Features .................................. SKIPPED
[INFO] ------------------------------------------------------------------------
[INFO] BUILD FAILURE
[INFO] ------------------------------------------------------------------------
[INFO] Total time: 1:05:40.578s
[INFO] Finished at: Thu Oct 27 14:41:49 UTC 2016
[INFO] Final Memory: 51M/927M
[INFO] ------------------------------------------------------------------------
Waiting for Jenkins to finish collecting data
[ERROR] Failed to execute goal on project openjpa-maven-plugin: Could not resolve dependencies
for project org.apache.openjpa:openjpa-maven-plugin:maven-plugin:3.0.0-SNAPSHOT: Could not
find artifact org.apache.bval:org.apache.bval.bundle:jar:1.1.2-SNAPSHOT in Nexus (http://repository.apache.org/snapshots)
-> [Help 1]
[ERROR] 
[ERROR] To see the full stack trace of the errors, re-run Maven with the -e switch.
[ERROR] Re-run Maven using the -X switch to enable full debug logging.
[ERROR] 
[ERROR] For more information about the errors and possible solutions, please read the following
articles:
[ERROR] [Help 1] http://cwiki.apache.org/confluence/display/MAVEN/DependencyResolutionException
[ERROR] 
[ERROR] After correcting the problems, you can resume the build with the command
[ERROR]   mvn <goals> -rf :openjpa-maven-plugin
[JENKINS] Archiving <https://builds.apache.org/job/OpenJPA-trunk/ws/trunk/openjpa-persistence-jdbc/pom.xml>
to org.apache.openjpa/openjpa-persistence-jdbc/3.0.0-SNAPSHOT/openjpa-persistence-jdbc-3.0.0-SNAPSHOT.pom
[JENKINS] Archiving <https://builds.apache.org/job/OpenJPA-trunk/ws/trunk/openjpa-persistence-jdbc/target/openjpa-persistence-jdbc-3.0.0-SNAPSHOT.jar>
to org.apache.openjpa/openjpa-persistence-jdbc/3.0.0-SNAPSHOT/openjpa-persistence-jdbc-3.0.0-SNAPSHOT.jar
[JENKINS] Archiving <https://builds.apache.org/job/OpenJPA-trunk/ws/trunk/openjpa-persistence-jdbc/target/openjpa-persistence-jdbc-3.0.0-SNAPSHOT-tests.jar>
to org.apache.openjpa/openjpa-persistence-jdbc/3.0.0-SNAPSHOT/openjpa-persistence-jdbc-3.0.0-SNAPSHOT-tests.jar
[JENKINS] Archiving <https://builds.apache.org/job/OpenJPA-trunk/ws/trunk/openjpa-examples/openbooks/pom.xml>
to org.apache.openjpa.openjpa-examples/openbooks/3.0.0-SNAPSHOT/openbooks-3.0.0-SNAPSHOT.pom
[JENKINS] Archiving <https://builds.apache.org/job/OpenJPA-trunk/ws/trunk/openjpa-integration/validation/pom.xml>
to org.apache.openjpa/openjpa-integration-validation/3.0.0-SNAPSHOT/openjpa-integration-validation-3.0.0-SNAPSHOT.pom
[JENKINS] Archiving <https://builds.apache.org/job/OpenJPA-trunk/ws/trunk/openjpa-tools/pom.xml>
to org.apache.openjpa/openjpa-tools/3.0.0-SNAPSHOT/openjpa-tools-3.0.0-SNAPSHOT.pom
[JENKINS] Archiving <https://builds.apache.org/job/OpenJPA-trunk/ws/trunk/openjpa-persistence/pom.xml>
to org.apache.openjpa/openjpa-persistence/3.0.0-SNAPSHOT/openjpa-persistence-3.0.0-SNAPSHOT.pom
[JENKINS] Archiving <https://builds.apache.org/job/OpenJPA-trunk/ws/trunk/openjpa-persistence/target/openjpa-persistence-3.0.0-SNAPSHOT.jar>
to org.apache.openjpa/openjpa-persistence/3.0.0-SNAPSHOT/openjpa-persistence-3.0.0-SNAPSHOT.jar
[JENKINS] Archiving <https://builds.apache.org/job/OpenJPA-trunk/ws/trunk/openjpa-persistence/target/openjpa-persistence-3.0.0-SNAPSHOT-tests.jar>
to org.apache.openjpa/openjpa-persistence/3.0.0-SNAPSHOT/openjpa-persistence-3.0.0-SNAPSHOT-tests.jar
[JENKINS] Archiving <https://builds.apache.org/job/OpenJPA-trunk/ws/trunk/openjpa-integration/slf4j/pom.xml>
to org.apache.openjpa/openjpa-integration-slf4j/3.0.0-SNAPSHOT/openjpa-integration-slf4j-3.0.0-SNAPSHOT.pom
[JENKINS] Archiving <https://builds.apache.org/job/OpenJPA-trunk/ws/trunk/openjpa-jest/pom.xml>
to org.apache.openjpa/openjpa-jest/3.0.0-SNAPSHOT/openjpa-jest-3.0.0-SNAPSHOT.pom
[JENKINS] Archiving <https://builds.apache.org/job/OpenJPA-trunk/ws/trunk/openjpa-lib/pom.xml>
to org.apache.openjpa/openjpa-lib/3.0.0-SNAPSHOT/openjpa-lib-3.0.0-SNAPSHOT.pom
[JENKINS] Archiving <https://builds.apache.org/job/OpenJPA-trunk/ws/trunk/openjpa-lib/target/openjpa-lib-3.0.0-SNAPSHOT.jar>
to org.apache.openjpa/openjpa-lib/3.0.0-SNAPSHOT/openjpa-lib-3.0.0-SNAPSHOT.jar
[JENKINS] Archiving <https://builds.apache.org/job/OpenJPA-trunk/ws/trunk/openjpa-lib/target/openjpa-lib-3.0.0-SNAPSHOT-tests.jar>
to org.apache.openjpa/openjpa-lib/3.0.0-SNAPSHOT/openjpa-lib-3.0.0-SNAPSHOT-tests.jar
[JENKINS] Archiving <https://builds.apache.org/job/OpenJPA-trunk/ws/trunk/openjpa-tools/openjpa-fetch-statistics/pom.xml>
to org.apache.openjpa/openjpa-fetch-statistics/3.0.0-SNAPSHOT/openjpa-fetch-statistics-3.0.0-SNAPSHOT.pom
[JENKINS] Archiving <https://builds.apache.org/job/OpenJPA-trunk/ws/trunk/openjpa-integration/pom.xml>
to org.apache.openjpa/openjpa-integration/3.0.0-SNAPSHOT/openjpa-integration-3.0.0-SNAPSHOT.pom
[JENKINS] Archiving <https://builds.apache.org/job/OpenJPA-trunk/ws/trunk/openjpa-features/pom.xml>
to org.apache.openjpa/openjpa-features/3.0.0-SNAPSHOT/openjpa-features-3.0.0-SNAPSHOT.pom
[JENKINS] Archiving <https://builds.apache.org/job/OpenJPA-trunk/ws/trunk/openjpa-examples/image-gallery/pom.xml>
to org.apache.openjpa.openjpa-examples/image-gallery/3.0.0-SNAPSHOT/image-gallery-3.0.0-SNAPSHOT.pom
[JENKINS] Archiving <https://builds.apache.org/job/OpenJPA-trunk/ws/trunk/openjpa-examples/pom.xml>
to org.apache.openjpa/openjpa-examples/3.0.0-SNAPSHOT/openjpa-examples-3.0.0-SNAPSHOT.pom
[JENKINS] Archiving <https://builds.apache.org/job/OpenJPA-trunk/ws/trunk/openjpa-integration/examples/pom.xml>
to org.apache.openjpa/openjpa-integration-examples/3.0.0-SNAPSHOT/openjpa-integration-examples-3.0.0-SNAPSHOT.pom
[JENKINS] Archiving <https://builds.apache.org/job/OpenJPA-trunk/ws/trunk/openjpa-persistence-locking/pom.xml>
to org.apache.openjpa/openjpa-persistence-locking/3.0.0-SNAPSHOT/openjpa-persistence-locking-3.0.0-SNAPSHOT.pom
[JENKINS] Archiving <https://builds.apache.org/job/OpenJPA-trunk/ws/trunk/openjpa-persistence-locking/target/openjpa-persistence-locking-3.0.0-SNAPSHOT.jar>
to org.apache.openjpa/openjpa-persistence-locking/3.0.0-SNAPSHOT/openjpa-persistence-locking-3.0.0-SNAPSHOT.jar
[JENKINS] Archiving <https://builds.apache.org/job/OpenJPA-trunk/ws/trunk/openjpa-persistence-locking/target/openjpa-persistence-locking-3.0.0-SNAPSHOT-tests.jar>
to org.apache.openjpa/openjpa-persistence-locking/3.0.0-SNAPSHOT/openjpa-persistence-locking-3.0.0-SNAPSHOT-tests.jar
[JENKINS] Archiving <https://builds.apache.org/job/OpenJPA-trunk/ws/trunk/openjpa-tools/openjpa-fetch-statistics-was/pom.xml>
to org.apache.openjpa/openjpa-fetch-statistics-was/3.0.0-SNAPSHOT/openjpa-fetch-statistics-was-3.0.0-SNAPSHOT.pom
[JENKINS] Archiving <https://builds.apache.org/job/OpenJPA-trunk/ws/trunk/openjpa-xmlstore/pom.xml>
to org.apache.openjpa/openjpa-xmlstore/3.0.0-SNAPSHOT/openjpa-xmlstore-3.0.0-SNAPSHOT.pom
[JENKINS] Archiving <https://builds.apache.org/job/OpenJPA-trunk/ws/trunk/openjpa-integration/tck/pom.xml>
to org.apache.openjpa/openjpa-integration-tck/3.0.0-SNAPSHOT/openjpa-integration-tck-3.0.0-SNAPSHOT.pom
[JENKINS] Archiving <https://builds.apache.org/job/OpenJPA-trunk/ws/trunk/openjpa-all/pom.xml>
to org.apache.openjpa/openjpa-all/3.0.0-SNAPSHOT/openjpa-all-3.0.0-SNAPSHOT.pom
[JENKINS] Archiving <https://builds.apache.org/job/OpenJPA-trunk/ws/trunk/openjpa/pom.xml>
to org.apache.openjpa/openjpa/3.0.0-SNAPSHOT/openjpa-3.0.0-SNAPSHOT.pom
[JENKINS] Archiving <https://builds.apache.org/job/OpenJPA-trunk/ws/trunk/openjpa-examples/simple/pom.xml>
to org.apache.openjpa.openjpa-examples/simple/3.0.0-SNAPSHOT/simple-3.0.0-SNAPSHOT.pom
[JENKINS] Archiving <https://builds.apache.org/job/OpenJPA-trunk/ws/trunk/openjpa-jdbc/pom.xml>
to org.apache.openjpa/openjpa-jdbc/3.0.0-SNAPSHOT/openjpa-jdbc-3.0.0-SNAPSHOT.pom
[JENKINS] Archiving <https://builds.apache.org/job/OpenJPA-trunk/ws/trunk/openjpa-jdbc/target/openjpa-jdbc-3.0.0-SNAPSHOT.jar>
to org.apache.openjpa/openjpa-jdbc/3.0.0-SNAPSHOT/openjpa-jdbc-3.0.0-SNAPSHOT.jar
[JENKINS] Archiving <https://builds.apache.org/job/OpenJPA-trunk/ws/trunk/openjpa-jdbc/target/openjpa-jdbc-3.0.0-SNAPSHOT-tests.jar>
to org.apache.openjpa/openjpa-jdbc/3.0.0-SNAPSHOT/openjpa-jdbc-3.0.0-SNAPSHOT-tests.jar
[JENKINS] Archiving <https://builds.apache.org/job/OpenJPA-trunk/ws/trunk/openjpa-integration/daytrader/pom.xml>
to org.apache.openjpa/openjpa-integration-daytrader/3.0.0-SNAPSHOT/openjpa-integration-daytrader-3.0.0-SNAPSHOT.pom
[JENKINS] Archiving <https://builds.apache.org/job/OpenJPA-trunk/ws/trunk/openjpa-kernel/pom.xml>
to org.apache.openjpa/openjpa-kernel/3.0.0-SNAPSHOT/openjpa-kernel-3.0.0-SNAPSHOT.pom
[JENKINS] Archiving <https://builds.apache.org/job/OpenJPA-trunk/ws/trunk/openjpa-kernel/target/openjpa-kernel-3.0.0-SNAPSHOT.jar>
to org.apache.openjpa/openjpa-kernel/3.0.0-SNAPSHOT/openjpa-kernel-3.0.0-SNAPSHOT.jar
[JENKINS] Archiving <https://builds.apache.org/job/OpenJPA-trunk/ws/trunk/openjpa-kernel/target/openjpa-kernel-3.0.0-SNAPSHOT-tests.jar>
to org.apache.openjpa/openjpa-kernel/3.0.0-SNAPSHOT/openjpa-kernel-3.0.0-SNAPSHOT-tests.jar
[JENKINS] Archiving <https://builds.apache.org/job/OpenJPA-trunk/ws/trunk/openjpa-integration/jmx/pom.xml>
to org.apache.openjpa/openjpa-integration-jmx/3.0.0-SNAPSHOT/openjpa-integration-jmx-3.0.0-SNAPSHOT.pom
[JENKINS] Archiving <https://builds.apache.org/job/OpenJPA-trunk/ws/trunk/openjpa-project/pom.xml>
to org.apache.openjpa/apache-openjpa/3.0.0-SNAPSHOT/apache-openjpa-3.0.0-SNAPSHOT.pom
[JENKINS] Archiving <https://builds.apache.org/job/OpenJPA-trunk/ws/trunk/openjpa-tools/openjpa-maven-plugin/pom.xml>
to org.apache.openjpa/openjpa-maven-plugin/3.0.0-SNAPSHOT/openjpa-maven-plugin-3.0.0-SNAPSHOT.pom
[JENKINS] Archiving <https://builds.apache.org/job/OpenJPA-trunk/ws/trunk/openjpa-slice/pom.xml>
to org.apache.openjpa/openjpa-slice/3.0.0-SNAPSHOT/openjpa-slice-3.0.0-SNAPSHOT.pom
[JENKINS] Archiving <https://builds.apache.org/job/OpenJPA-trunk/ws/trunk/pom.xml> to
org.apache.openjpa/openjpa-parent/3.0.0-SNAPSHOT/openjpa-parent-3.0.0-SNAPSHOT.pom
[JENKINS] Archiving <https://builds.apache.org/job/OpenJPA-trunk/ws/trunk/target/openjpa-parent-3.0.0-SNAPSHOT-site.xml>
to org.apache.openjpa/openjpa-parent/3.0.0-SNAPSHOT/openjpa-parent-3.0.0-SNAPSHOT-site.xml
Sending e-mails to: commits@openjpa.apache.org
channel stopped

Mime
View raw message