openjpa-commits mailing list archives

Site index · List index
Message view « Date » · « Thread »
Top « Date » · « Thread »
From Apache Jenkins Server <jenk...@builds.apache.org>
Subject Build failed in Jenkins: OpenJPA-trunk #1057
Date Tue, 23 Aug 2016 12:02:55 GMT
See <https://builds.apache.org/job/OpenJPA-trunk/1057/changes>

Changes:

[ilgrosso] [OPENJPA-2660] Maven warnings resolved

------------------------------------------
[...truncated 12386 lines...]
Results :

Tests in error: 
  TestAnnotationBasics>AbstractPersistenceTestCase.run:206->AbstractPersistenceTestCase.runBare:541->AbstractPersistenceTestCase.runBare:565->AbstractPersistenceTestCase.runTest:578->testSingleFieldIdentity:37->AbstractTestCase.currentEntityManager:283
» Persistence
  TestEmbeddableSuperclass>AbstractPersistenceTestCase.run:206->AbstractPersistenceTestCase.runBare:541->AbstractPersistenceTestCase.runBare:565->setUp:41->AbstractTestCase.deleteAll:199
» Persistence
  TestEmbeddedId>AbstractPersistenceTestCase.run:206->AbstractPersistenceTestCase.runBare:541->AbstractPersistenceTestCase.runBare:565->setUp:46->AbstractTestCase.deleteAll:199
» Persistence
  TestEmbeddedId>AbstractPersistenceTestCase.run:206->AbstractPersistenceTestCase.runBare:541->AbstractPersistenceTestCase.runBare:565->setUp:46->AbstractTestCase.deleteAll:199
» Persistence
  TestEmbeddedId>AbstractPersistenceTestCase.run:206->AbstractPersistenceTestCase.runBare:541->AbstractPersistenceTestCase.runBare:565->setUp:46->AbstractTestCase.deleteAll:199
» Persistence
  TestEmbeddedId>AbstractPersistenceTestCase.run:206->AbstractPersistenceTestCase.runBare:541->AbstractPersistenceTestCase.runBare:565->setUp:46->AbstractTestCase.deleteAll:199
» Persistence
  TestEmbeddedId>AbstractPersistenceTestCase.run:206->AbstractPersistenceTestCase.runBare:541->AbstractPersistenceTestCase.runBare:565->setUp:46->AbstractTestCase.deleteAll:199
» Persistence
  TestEmbeddedId>AbstractPersistenceTestCase.run:206->AbstractPersistenceTestCase.runBare:541->AbstractPersistenceTestCase.runBare:565->setUp:46->AbstractTestCase.deleteAll:199
» Persistence
  TestEnumerated>AbstractPersistenceTestCase.run:206->AbstractPersistenceTestCase.runBare:541->AbstractPersistenceTestCase.runBare:565->setUp:46->AbstractTestCase.deleteAll:199
» Persistence
  TestFlatInheritance>AbstractPersistenceTestCase.run:206->AbstractPersistenceTestCase.runBare:541->AbstractPersistenceTestCase.runBare:565->setUp:42->AbstractTestCase.deleteAll:199
» Persistence
  TestGenerators>AbstractPersistenceTestCase.run:206->AbstractPersistenceTestCase.runBare:541->AbstractPersistenceTestCase.runBare:565->setUp:43->AbstractTestCase.deleteAll:199
» Persistence
  TestGenerators>AbstractPersistenceTestCase.run:206->AbstractPersistenceTestCase.runBare:541->AbstractPersistenceTestCase.runBare:565->setUp:43->AbstractTestCase.deleteAll:199
» Persistence
  TestGenerators>AbstractPersistenceTestCase.run:206->AbstractPersistenceTestCase.runBare:541->AbstractPersistenceTestCase.runBare:565->setUp:43->AbstractTestCase.deleteAll:199
» Persistence
  TestJoinedInheritance>AbstractPersistenceTestCase.run:206->AbstractPersistenceTestCase.runBare:541->AbstractPersistenceTestCase.runBare:565->setUp:46->AbstractTestCase.deleteAll:199
» Persistence
  TestManyToMany>AbstractPersistenceTestCase.run:206->AbstractPersistenceTestCase.runBare:541->AbstractPersistenceTestCase.runBare:565->setUp:41->AbstractTestCase.deleteAll:199
» Persistence
  TestManyToMany>AbstractPersistenceTestCase.run:206->AbstractPersistenceTestCase.runBare:541->AbstractPersistenceTestCase.runBare:565->setUp:41->AbstractTestCase.deleteAll:199
» Persistence
  TestMapKey>AbstractPersistenceTestCase.run:206->AbstractPersistenceTestCase.runBare:541->AbstractPersistenceTestCase.runBare:565->setUp:48->AbstractTestCase.deleteAll:199
» Persistence
  TestMappedSuperClass>AbstractPersistenceTestCase.run:206->AbstractPersistenceTestCase.runBare:541->AbstractPersistenceTestCase.runBare:565->setUp:49->AbstractTestCase.deleteAll:199
» Persistence
  TestMappedSuperClass>AbstractPersistenceTestCase.run:206->AbstractPersistenceTestCase.runBare:541->AbstractPersistenceTestCase.runBare:565->setUp:49->AbstractTestCase.deleteAll:199
» Persistence
  TestOneToMany>AbstractPersistenceTestCase.run:206->AbstractPersistenceTestCase.runBare:541->AbstractPersistenceTestCase.runBare:565->setUp:42->AbstractTestCase.deleteAll:199
» Persistence
  TestOneToMany>AbstractPersistenceTestCase.run:206->AbstractPersistenceTestCase.runBare:541->AbstractPersistenceTestCase.runBare:565->setUp:42->AbstractTestCase.deleteAll:199
» Persistence
  TestOneToOne>AbstractPersistenceTestCase.run:206->AbstractPersistenceTestCase.runBare:541->AbstractPersistenceTestCase.runBare:565->setUp:40->AbstractTestCase.deleteAll:199
» Persistence
  TestOneToOne>AbstractPersistenceTestCase.run:206->AbstractPersistenceTestCase.runBare:541->AbstractPersistenceTestCase.runBare:565->setUp:40->AbstractTestCase.deleteAll:199
» Persistence
  TestOneToOne>AbstractPersistenceTestCase.run:206->AbstractPersistenceTestCase.runBare:541->AbstractPersistenceTestCase.runBare:565->setUp:40->AbstractTestCase.deleteAll:199
» Persistence
  TestOneToOne>AbstractPersistenceTestCase.run:206->AbstractPersistenceTestCase.runBare:541->AbstractPersistenceTestCase.runBare:565->setUp:40->AbstractTestCase.deleteAll:199
» Persistence
  TestOneToOne>AbstractPersistenceTestCase.run:206->AbstractPersistenceTestCase.runBare:541->AbstractPersistenceTestCase.runBare:565->setUp:40->AbstractTestCase.deleteAll:199
» Persistence
  TestSerializedLobs>AbstractPersistenceTestCase.run:206->AbstractPersistenceTestCase.runBare:541->AbstractPersistenceTestCase.runBare:565->setUp:46->AbstractTestCase.deleteAll:199
» Persistence
  TestSerializedLobs>AbstractPersistenceTestCase.run:206->AbstractPersistenceTestCase.runBare:541->AbstractPersistenceTestCase.runBare:565->setUp:46->AbstractTestCase.deleteAll:199
» Persistence
  TestSerializedLobs>AbstractPersistenceTestCase.run:206->AbstractPersistenceTestCase.runBare:541->AbstractPersistenceTestCase.runBare:565->setUp:46->AbstractTestCase.deleteAll:199
» Persistence
  TestTablePerClassInheritance>AbstractPersistenceTestCase.run:206->AbstractPersistenceTestCase.runBare:541->AbstractPersistenceTestCase.runBare:565->AbstractPersistenceTestCase.runTest:578->testInsertAndRetrieve:72->AbstractTestCase.deleteAll:199
» Persistence
  TestEJBClauses>AbstractPersistenceTestCase.run:206->AbstractPersistenceTestCase.runBare:541->AbstractPersistenceTestCase.runBare:565->setUp:38->AbstractTestCase.deleteAll:199
» Persistence
  TestEJBClauses>AbstractPersistenceTestCase.run:206->AbstractPersistenceTestCase.runBare:541->AbstractPersistenceTestCase.runBare:565->setUp:38->AbstractTestCase.deleteAll:199
» Persistence
  TestEJBClauses>AbstractPersistenceTestCase.run:206->AbstractPersistenceTestCase.runBare:541->AbstractPersistenceTestCase.runBare:565->setUp:38->AbstractTestCase.deleteAll:199
» Persistence
  TestEJBClauses>AbstractPersistenceTestCase.run:206->AbstractPersistenceTestCase.runBare:541->AbstractPersistenceTestCase.runBare:565->setUp:38->AbstractTestCase.deleteAll:199
» Persistence
  TestEJBClauses>AbstractPersistenceTestCase.run:206->AbstractPersistenceTestCase.runBare:541->AbstractPersistenceTestCase.runBare:565->setUp:38->AbstractTestCase.deleteAll:199
» Persistence
  TestEJBClauses>AbstractPersistenceTestCase.run:206->AbstractPersistenceTestCase.runBare:541->AbstractPersistenceTestCase.runBare:565->setUp:38->AbstractTestCase.deleteAll:199
» Persistence
  TestEJBClauses>AbstractPersistenceTestCase.run:206->AbstractPersistenceTestCase.runBare:541->AbstractPersistenceTestCase.runBare:565->setUp:38->AbstractTestCase.deleteAll:199
» Persistence
  TestEJBClauses>AbstractPersistenceTestCase.run:206->AbstractPersistenceTestCase.runBare:541->AbstractPersistenceTestCase.runBare:565->setUp:38->AbstractTestCase.deleteAll:199
» Persistence
  TestEJBClauses>AbstractPersistenceTestCase.run:206->AbstractPersistenceTestCase.runBare:541->AbstractPersistenceTestCase.runBare:565->setUp:38->AbstractTestCase.deleteAll:199
» Persistence
  TestEJBDeleteUpdateImpl>AbstractPersistenceTestCase.run:206->AbstractPersistenceTestCase.runBare:541->AbstractPersistenceTestCase.runBare:565->setUp:38->AbstractTestCase.deleteAll:199
» Persistence
  TestEJBDeleteUpdateImpl>AbstractPersistenceTestCase.run:206->AbstractPersistenceTestCase.runBare:541->AbstractPersistenceTestCase.runBare:565->setUp:38->AbstractTestCase.deleteAll:199
» Persistence
  TestEJBDeleteUpdateImpl>AbstractPersistenceTestCase.run:206->AbstractPersistenceTestCase.runBare:541->AbstractPersistenceTestCase.runBare:565->setUp:38->AbstractTestCase.deleteAll:199
» Persistence
  TestEJBDeleteUpdateImpl>AbstractPersistenceTestCase.run:206->AbstractPersistenceTestCase.runBare:541->AbstractPersistenceTestCase.runBare:565->setUp:38->AbstractTestCase.deleteAll:199
» Persistence
  TestEJBPolymorphicQuery>AbstractPersistenceTestCase.run:206->AbstractPersistenceTestCase.runBare:541->AbstractPersistenceTestCase.runBare:565->setUp:35->AbstractTestCase.deleteAll:199
» Persistence
  TestEJBPolymorphicQuery>AbstractPersistenceTestCase.run:206->AbstractPersistenceTestCase.runBare:541->AbstractPersistenceTestCase.runBare:565->setUp:35->AbstractTestCase.deleteAll:199
» Persistence
  TestEJBQueryInterface>AbstractPersistenceTestCase.run:206->AbstractPersistenceTestCase.runBare:541->AbstractPersistenceTestCase.runBare:565->setUp:38->AbstractTestCase.deleteAll:199
» Persistence
  TestEJBQueryInterface>AbstractPersistenceTestCase.run:206->AbstractPersistenceTestCase.runBare:541->AbstractPersistenceTestCase.runBare:565->setUp:38->AbstractTestCase.deleteAll:199
» Persistence
  TestEJBQueryInterface>AbstractPersistenceTestCase.run:206->AbstractPersistenceTestCase.runBare:541->AbstractPersistenceTestCase.runBare:565->setUp:38->AbstractTestCase.deleteAll:199
» Persistence
  TestEJBQueryInterface>AbstractPersistenceTestCase.run:206->AbstractPersistenceTestCase.runBare:541->AbstractPersistenceTestCase.runBare:565->setUp:38->AbstractTestCase.deleteAll:199
» Persistence
  TestEJBQueryInterface>AbstractPersistenceTestCase.run:206->AbstractPersistenceTestCase.runBare:541->AbstractPersistenceTestCase.runBare:565->setUp:38->AbstractTestCase.deleteAll:199
» Persistence
  TestEntityTypeExpression>AbstractPersistenceTestCase.run:206->AbstractPersistenceTestCase.runBare:541->AbstractPersistenceTestCase.runBare:565->setUp:38->AbstractTestCase.deleteAll:199
» Persistence
  TestEntityTypeExpression>AbstractPersistenceTestCase.run:206->AbstractPersistenceTestCase.runBare:541->AbstractPersistenceTestCase.runBare:565->setUp:38->AbstractTestCase.deleteAll:199
» Persistence
  TestInMemoryScalarExpressions>AbstractPersistenceTestCase.run:206->AbstractPersistenceTestCase.runBare:541->AbstractPersistenceTestCase.runBare:565->setUp:48->AbstractTestCase.deleteAll:199
» Persistence
  TestInMemoryScalarExpressions>AbstractPersistenceTestCase.run:206->AbstractPersistenceTestCase.runBare:541->AbstractPersistenceTestCase.runBare:565->setUp:48->AbstractTestCase.deleteAll:199
» Persistence
  TestInMemoryScalarExpressions>AbstractPersistenceTestCase.run:206->AbstractPersistenceTestCase.runBare:541->AbstractPersistenceTestCase.runBare:565->setUp:48->AbstractTestCase.deleteAll:199
» Persistence
  TestInMemoryScalarExpressions>AbstractPersistenceTestCase.run:206->AbstractPersistenceTestCase.runBare:541->AbstractPersistenceTestCase.runBare:565->setUp:48->AbstractTestCase.deleteAll:199
» Persistence
  TestJPQLScalarExpressions>AbstractPersistenceTestCase.run:206->AbstractPersistenceTestCase.runBare:541->AbstractPersistenceTestCase.runBare:565->setUp:48->AbstractTestCase.deleteAll:199
» Persistence
  TestJPQLScalarExpressions>AbstractPersistenceTestCase.run:206->AbstractPersistenceTestCase.runBare:541->AbstractPersistenceTestCase.runBare:565->setUp:48->AbstractTestCase.deleteAll:199
» Persistence
  TestJPQLScalarExpressions>AbstractPersistenceTestCase.run:206->AbstractPersistenceTestCase.runBare:541->AbstractPersistenceTestCase.runBare:565->setUp:48->AbstractTestCase.deleteAll:199
» Persistence
  TestJPQLScalarExpressions>AbstractPersistenceTestCase.run:206->AbstractPersistenceTestCase.runBare:541->AbstractPersistenceTestCase.runBare:565->setUp:48->AbstractTestCase.deleteAll:199
» Persistence
  TestJPQLScalarExpressions>AbstractPersistenceTestCase.run:206->AbstractPersistenceTestCase.runBare:541->AbstractPersistenceTestCase.runBare:565->setUp:48->AbstractTestCase.deleteAll:199
» Persistence
  TestJPQLScalarExpressions>AbstractPersistenceTestCase.run:206->AbstractPersistenceTestCase.runBare:541->AbstractPersistenceTestCase.runBare:565->setUp:48->AbstractTestCase.deleteAll:199
» Persistence
  TestJPQLScalarExpressions>AbstractPersistenceTestCase.run:206->AbstractPersistenceTestCase.runBare:541->AbstractPersistenceTestCase.runBare:565->setUp:48->AbstractTestCase.deleteAll:199
» Persistence
  TestEJBQLFunction>AbstractPersistenceTestCase.run:206->AbstractPersistenceTestCase.runBare:541->AbstractPersistenceTestCase.runBare:565->setUp:50->AbstractTestCase.deleteAll:199
» Persistence
  TestEJBQLFunction>AbstractPersistenceTestCase.run:206->AbstractPersistenceTestCase.runBare:541->AbstractPersistenceTestCase.runBare:565->setUp:50->AbstractTestCase.deleteAll:199
» Persistence
  TestEJBQLFunction>AbstractPersistenceTestCase.run:206->AbstractPersistenceTestCase.runBare:541->AbstractPersistenceTestCase.runBare:565->setUp:50->AbstractTestCase.deleteAll:199
» Persistence
  TestEJBQLFunction>AbstractPersistenceTestCase.run:206->AbstractPersistenceTestCase.runBare:541->AbstractPersistenceTestCase.runBare:565->setUp:50->AbstractTestCase.deleteAll:199
» Persistence
  TestEJBQLFunction>AbstractPersistenceTestCase.run:206->AbstractPersistenceTestCase.runBare:541->AbstractPersistenceTestCase.runBare:565->setUp:50->AbstractTestCase.deleteAll:199
» Persistence
  TestEJBQLFunction>AbstractPersistenceTestCase.run:206->AbstractPersistenceTestCase.runBare:541->AbstractPersistenceTestCase.runBare:565->setUp:50->AbstractTestCase.deleteAll:199
» Persistence
  TestEJBQLFunction>AbstractPersistenceTestCase.run:206->AbstractPersistenceTestCase.runBare:541->AbstractPersistenceTestCase.runBare:565->setUp:50->AbstractTestCase.deleteAll:199
» Persistence
  TestEJBQLFunction>AbstractPersistenceTestCase.run:206->AbstractPersistenceTestCase.runBare:541->AbstractPersistenceTestCase.runBare:565->setUp:50->AbstractTestCase.deleteAll:199
» Persistence
  TestEJBQLFunction>AbstractPersistenceTestCase.run:206->AbstractPersistenceTestCase.runBare:541->AbstractPersistenceTestCase.runBare:565->setUp:50->AbstractTestCase.deleteAll:199
» Persistence
  TestEJBQLFunction>AbstractPersistenceTestCase.run:206->AbstractPersistenceTestCase.runBare:541->AbstractPersistenceTestCase.runBare:565->setUp:50->AbstractTestCase.deleteAll:199
» Persistence
  TestEJBQLFunction>AbstractPersistenceTestCase.run:206->AbstractPersistenceTestCase.runBare:541->AbstractPersistenceTestCase.runBare:565->setUp:50->AbstractTestCase.deleteAll:199
» Persistence
  TestEJBQLFunction>AbstractPersistenceTestCase.run:206->AbstractPersistenceTestCase.runBare:541->AbstractPersistenceTestCase.runBare:565->setUp:50->AbstractTestCase.deleteAll:199
» Persistence
  TestEJBQLFunction>AbstractPersistenceTestCase.run:206->AbstractPersistenceTestCase.runBare:541->AbstractPersistenceTestCase.runBare:565->setUp:50->AbstractTestCase.deleteAll:199
» Persistence
  TestEJBQLFunction>AbstractPersistenceTestCase.run:206->AbstractPersistenceTestCase.runBare:541->AbstractPersistenceTestCase.runBare:565->setUp:50->AbstractTestCase.deleteAll:199
» Persistence
  TestEJBQLFunction>AbstractPersistenceTestCase.run:206->AbstractPersistenceTestCase.runBare:541->AbstractPersistenceTestCase.runBare:565->setUp:50->AbstractTestCase.deleteAll:199
» Persistence
  TestEJBQLFunction>AbstractPersistenceTestCase.run:206->AbstractPersistenceTestCase.runBare:541->AbstractPersistenceTestCase.runBare:565->setUp:50->AbstractTestCase.deleteAll:199
» Persistence
  TestEJBJoins>AbstractPersistenceTestCase.run:206->AbstractPersistenceTestCase.runBare:541->AbstractPersistenceTestCase.runBare:565->setUp:38->AbstractTestCase.deleteAll:199
» Persistence
  TestEJBJoins>AbstractPersistenceTestCase.run:206->AbstractPersistenceTestCase.runBare:541->AbstractPersistenceTestCase.runBare:565->setUp:38->AbstractTestCase.deleteAll:199
» Persistence
  TestEJBJoins>AbstractPersistenceTestCase.run:206->AbstractPersistenceTestCase.runBare:541->AbstractPersistenceTestCase.runBare:565->setUp:38->AbstractTestCase.deleteAll:199
» Persistence
  TestEJBJoins>AbstractPersistenceTestCase.run:206->AbstractPersistenceTestCase.runBare:541->AbstractPersistenceTestCase.runBare:565->setUp:38->AbstractTestCase.deleteAll:199
» Persistence
  TestEJBJoins>AbstractPersistenceTestCase.run:206->AbstractPersistenceTestCase.runBare:541->AbstractPersistenceTestCase.runBare:565->setUp:38->AbstractTestCase.deleteAll:199
» Persistence
  TestEJBJoins>AbstractPersistenceTestCase.run:206->AbstractPersistenceTestCase.runBare:541->AbstractPersistenceTestCase.runBare:565->setUp:38->AbstractTestCase.deleteAll:199
» Persistence
  TestEJBJoins>AbstractPersistenceTestCase.run:206->AbstractPersistenceTestCase.runBare:541->AbstractPersistenceTestCase.runBare:565->setUp:38->AbstractTestCase.deleteAll:199
» Persistence
  TestAccessPathsOfSubqueries>AbstractPersistenceTestCase.run:206->AbstractPersistenceTestCase.runBare:541->AbstractPersistenceTestCase.runBare:565->AbstractPersistenceTestCase.runTest:578->testRelationTraversalSubqueryAccessPath:72
» General
  TestAccessPathsOfSubqueries>AbstractPersistenceTestCase.run:206->AbstractPersistenceTestCase.runBare:541->AbstractPersistenceTestCase.runBare:565->AbstractPersistenceTestCase.runTest:578->testSimpleSubqueryAccessPath:53
» General
  TestComplexQueries>AbstractPersistenceTestCase.run:206->AbstractPersistenceTestCase.runBare:541->AbstractPersistenceTestCase.runBare:565->setUp:54->clear:58->AbstractTestCase.deleteAll:199
» Persistence
  TestComplexQueries>AbstractPersistenceTestCase.run:206->AbstractPersistenceTestCase.runBare:541->AbstractPersistenceTestCase.runBare:565->setUp:54->clear:58->AbstractTestCase.deleteAll:199
» Persistence
  TestComplexQueries>AbstractPersistenceTestCase.run:206->AbstractPersistenceTestCase.runBare:541->AbstractPersistenceTestCase.runBare:565->setUp:54->clear:58->AbstractTestCase.deleteAll:199
» Persistence
  TestComplexQueries>AbstractPersistenceTestCase.run:206->AbstractPersistenceTestCase.runBare:541->AbstractPersistenceTestCase.runBare:565->setUp:54->clear:58->AbstractTestCase.deleteAll:199
» Persistence
  TestComplexQueries>AbstractPersistenceTestCase.run:206->AbstractPersistenceTestCase.runBare:541->AbstractPersistenceTestCase.runBare:565->setUp:54->clear:58->AbstractTestCase.deleteAll:199
» Persistence
  TestComplexQueries>AbstractPersistenceTestCase.run:206->AbstractPersistenceTestCase.runBare:541->AbstractPersistenceTestCase.runBare:565->setUp:54->clear:58->AbstractTestCase.deleteAll:199
» Persistence
  TestComplexQueries>AbstractPersistenceTestCase.run:206->AbstractPersistenceTestCase.runBare:541->AbstractPersistenceTestCase.runBare:565->setUp:54->clear:58->AbstractTestCase.deleteAll:199
» Persistence
  TestComplexQueries>AbstractPersistenceTestCase.run:206->AbstractPersistenceTestCase.runBare:541->AbstractPersistenceTestCase.runBare:565->setUp:54->clear:58->AbstractTestCase.deleteAll:199
» Persistence
  TestComplexQueries>AbstractPersistenceTestCase.run:206->AbstractPersistenceTestCase.runBare:541->AbstractPersistenceTestCase.runBare:565->setUp:54->clear:58->AbstractTestCase.deleteAll:199
» Persistence
  TestComplexQueries>AbstractPersistenceTestCase.run:206->AbstractPersistenceTestCase.runBare:541->AbstractPersistenceTestCase.runBare:565->setUp:54->clear:58->AbstractTestCase.deleteAll:199
» Persistence
  TestComplexQueries>AbstractPersistenceTestCase.run:206->AbstractPersistenceTestCase.runBare:541->AbstractPersistenceTestCase.runBare:565->setUp:54->clear:58->AbstractTestCase.deleteAll:199
» Persistence
  TestComplexQueries>AbstractPersistenceTestCase.run:206->AbstractPersistenceTestCase.runBare:541->AbstractPersistenceTestCase.runBare:565->setUp:54->clear:58->AbstractTestCase.deleteAll:199
» Persistence
  TestComplexQueries>AbstractPersistenceTestCase.run:206->AbstractPersistenceTestCase.runBare:541->AbstractPersistenceTestCase.runBare:565->setUp:54->clear:58->AbstractTestCase.deleteAll:199
» Persistence
  TestEJBDeleteUpdateImpl>AbstractPersistenceTestCase.run:206->AbstractPersistenceTestCase.runBare:541->AbstractPersistenceTestCase.runBare:565->setUp:40->AbstractTestCase.deleteAll:199
» Persistence
  TestEJBDeleteUpdateImpl>AbstractPersistenceTestCase.run:206->AbstractPersistenceTestCase.runBare:541->AbstractPersistenceTestCase.runBare:565->setUp:40->AbstractTestCase.deleteAll:199
» Persistence
  TestEJBDeleteUpdateImpl>AbstractPersistenceTestCase.run:206->AbstractPersistenceTestCase.runBare:541->AbstractPersistenceTestCase.runBare:565->setUp:40->AbstractTestCase.deleteAll:199
» Persistence
  TestEJBDeleteUpdateImpl>AbstractPersistenceTestCase.run:206->AbstractPersistenceTestCase.runBare:541->AbstractPersistenceTestCase.runBare:565->setUp:40->AbstractTestCase.deleteAll:199
» Persistence
  TestEJBDeleteUpdateImpl>AbstractPersistenceTestCase.run:206->AbstractPersistenceTestCase.runBare:541->AbstractPersistenceTestCase.runBare:565->setUp:40->AbstractTestCase.deleteAll:199
» Persistence
  TestEJBPolymorphicQuery>AbstractPersistenceTestCase.run:206->AbstractPersistenceTestCase.runBare:541->AbstractPersistenceTestCase.runBare:565->setUp:36->AbstractTestCase.deleteAll:199
» Persistence
  TestEJBPolymorphicQuery>AbstractPersistenceTestCase.run:206->AbstractPersistenceTestCase.runBare:541->AbstractPersistenceTestCase.runBare:565->setUp:36->AbstractTestCase.deleteAll:199
» Persistence
  TestEJBQueryInterface>AbstractPersistenceTestCase.run:206->AbstractPersistenceTestCase.runBare:541->AbstractPersistenceTestCase.runBare:565->setUp:51->AbstractTestCase.endTx:300
» Rollback
  TestEJBQueryInterface>AbstractPersistenceTestCase.run:206->AbstractPersistenceTestCase.runBare:541->AbstractPersistenceTestCase.runBare:565->setUp:40->AbstractTestCase.currentEntityManager:283
» Persistence
  TestEJBQueryInterface>AbstractPersistenceTestCase.run:206->AbstractPersistenceTestCase.runBare:541->AbstractPersistenceTestCase.runBare:565->setUp:51->AbstractTestCase.endTx:300
» Rollback
  TestEJBQueryInterface>AbstractPersistenceTestCase.run:206->AbstractPersistenceTestCase.runBare:541->AbstractPersistenceTestCase.runBare:565->setUp:51->AbstractTestCase.endTx:300
» Rollback
  TestEJBQueryInterface>AbstractPersistenceTestCase.run:206->AbstractPersistenceTestCase.runBare:541->AbstractPersistenceTestCase.runBare:565->setUp:51->AbstractTestCase.endTx:300
» Rollback
  TestEJBQueryInterface>AbstractPersistenceTestCase.run:206->AbstractPersistenceTestCase.runBare:541->AbstractPersistenceTestCase.runBare:565->setUp:51->AbstractTestCase.endTx:300
» Rollback
  TestEJBQueryInterface>AbstractPersistenceTestCase.run:206->AbstractPersistenceTestCase.runBare:541->AbstractPersistenceTestCase.runBare:565->setUp:51->AbstractTestCase.endTx:300
» Rollback
  TestJPAQuerySubclassFunc>AbstractPersistenceTestCase.run:206->AbstractPersistenceTestCase.runBare:541->AbstractPersistenceTestCase.runBare:565->setUp:36->AbstractTestCase.deleteAll:199
» Persistence
  TestJPAQuerySubclassFunc>AbstractPersistenceTestCase.run:206->AbstractPersistenceTestCase.runBare:541->AbstractPersistenceTestCase.runBare:565->setUp:36->AbstractTestCase.deleteAll:199
» Persistence
  TestMathQueries>AbstractPersistenceTestCase.run:206->AbstractPersistenceTestCase.runBare:541->AbstractPersistenceTestCase.runBare:565->setUp:48->AbstractTestCase.deleteAll:199
» Persistence
  TestNamedQueries>AbstractPersistenceTestCase.run:206->AbstractPersistenceTestCase.runBare:541->AbstractPersistenceTestCase.runBare:565->setUp:54->AbstractTestCase.deleteAll:199
» Persistence
  TestNamedQueries>AbstractPersistenceTestCase.run:206->AbstractPersistenceTestCase.runBare:541->AbstractPersistenceTestCase.runBare:565->setUp:54->AbstractTestCase.deleteAll:199
» Persistence
  TestNamedQueries>AbstractPersistenceTestCase.run:206->AbstractPersistenceTestCase.runBare:541->AbstractPersistenceTestCase.runBare:565->setUp:54->AbstractTestCase.deleteAll:199
» Persistence
  TestNamedQueries>AbstractPersistenceTestCase.run:206->AbstractPersistenceTestCase.runBare:541->AbstractPersistenceTestCase.runBare:565->setUp:54->AbstractTestCase.deleteAll:199
» Persistence
  TestQueryLock>AbstractPersistenceTestCase.run:206->AbstractPersistenceTestCase.runBare:541->AbstractPersistenceTestCase.runBare:565->setUp:38->AbstractTestCase.deleteAll:199
» Persistence
  TestQueryLock>AbstractPersistenceTestCase.run:206->AbstractPersistenceTestCase.runBare:541->AbstractPersistenceTestCase.runBare:565->setUp:38->AbstractTestCase.deleteAll:199
» Persistence
  TestQueryLock>AbstractPersistenceTestCase.run:206->AbstractPersistenceTestCase.runBare:541->AbstractPersistenceTestCase.runBare:565->setUp:38->AbstractTestCase.deleteAll:199
» Persistence
  TestQueryResults>AbstractPersistenceTestCase.run:206->AbstractPersistenceTestCase.runBare:541->AbstractPersistenceTestCase.runBare:565->setUp:49->AbstractTestCase.deleteAll:199
» Persistence
  TestQueryResults>AbstractPersistenceTestCase.run:206->AbstractPersistenceTestCase.runBare:541->AbstractPersistenceTestCase.runBare:565->setUp:49->AbstractTestCase.deleteAll:199
» Persistence
  TestQueryResults>AbstractPersistenceTestCase.run:206->AbstractPersistenceTestCase.runBare:541->AbstractPersistenceTestCase.runBare:565->setUp:49->AbstractTestCase.deleteAll:199
» Persistence
  TestQueryResults>AbstractPersistenceTestCase.run:206->AbstractPersistenceTestCase.runBare:541->AbstractPersistenceTestCase.runBare:565->setUp:49->AbstractTestCase.deleteAll:199
» Persistence
  TestQueryResults>AbstractPersistenceTestCase.run:206->AbstractPersistenceTestCase.runBare:541->AbstractPersistenceTestCase.runBare:565->setUp:49->AbstractTestCase.deleteAll:199
» Persistence
  TestQueryResults>AbstractPersistenceTestCase.run:206->AbstractPersistenceTestCase.runBare:541->AbstractPersistenceTestCase.runBare:565->setUp:49->AbstractTestCase.deleteAll:199
» Persistence
  TestQueryResults>AbstractPersistenceTestCase.run:206->AbstractPersistenceTestCase.runBare:541->AbstractPersistenceTestCase.runBare:565->setUp:49->AbstractTestCase.deleteAll:199
» Persistence
  TestQueryResults>AbstractPersistenceTestCase.run:206->AbstractPersistenceTestCase.runBare:541->AbstractPersistenceTestCase.runBare:565->setUp:49->AbstractTestCase.deleteAll:199
» Persistence
  TestQueryResults>AbstractPersistenceTestCase.run:206->AbstractPersistenceTestCase.runBare:541->AbstractPersistenceTestCase.runBare:565->setUp:49->AbstractTestCase.deleteAll:199
» Persistence
  TestQueryResults>AbstractPersistenceTestCase.run:206->AbstractPersistenceTestCase.runBare:541->AbstractPersistenceTestCase.runBare:565->setUp:49->AbstractTestCase.deleteAll:199
» Persistence
  TestQueryResults>AbstractPersistenceTestCase.run:206->AbstractPersistenceTestCase.runBare:541->AbstractPersistenceTestCase.runBare:565->setUp:49->AbstractTestCase.deleteAll:199
» Persistence
  TestQueryResults>AbstractPersistenceTestCase.run:206->AbstractPersistenceTestCase.runBare:541->AbstractPersistenceTestCase.runBare:565->setUp:49->AbstractTestCase.deleteAll:199
» Persistence
  TestQueryResults>AbstractPersistenceTestCase.run:206->AbstractPersistenceTestCase.runBare:541->AbstractPersistenceTestCase.runBare:565->setUp:49->AbstractTestCase.deleteAll:199
» Persistence
  TestQueryResults>AbstractPersistenceTestCase.run:206->AbstractPersistenceTestCase.runBare:541->AbstractPersistenceTestCase.runBare:565->setUp:49->AbstractTestCase.deleteAll:199
» Persistence
  TestQueryResults>AbstractPersistenceTestCase.run:206->AbstractPersistenceTestCase.runBare:541->AbstractPersistenceTestCase.runBare:565->setUp:49->AbstractTestCase.deleteAll:199
» Persistence
  TestQueryResults>AbstractPersistenceTestCase.run:206->AbstractPersistenceTestCase.runBare:541->AbstractPersistenceTestCase.runBare:565->setUp:49->AbstractTestCase.deleteAll:199
» Persistence
  TestQueryResults>AbstractPersistenceTestCase.run:206->AbstractPersistenceTestCase.runBare:541->AbstractPersistenceTestCase.runBare:565->setUp:49->AbstractTestCase.deleteAll:199
» Persistence
  TestQueryResults>AbstractPersistenceTestCase.run:206->AbstractPersistenceTestCase.runBare:541->AbstractPersistenceTestCase.runBare:565->setUp:49->AbstractTestCase.deleteAll:199
» Persistence
  TestQueryResults>AbstractPersistenceTestCase.run:206->AbstractPersistenceTestCase.runBare:541->AbstractPersistenceTestCase.runBare:565->setUp:49->AbstractTestCase.deleteAll:199
» Persistence
  TestQueryResults>AbstractPersistenceTestCase.run:206->AbstractPersistenceTestCase.runBare:541->AbstractPersistenceTestCase.runBare:565->setUp:49->AbstractTestCase.deleteAll:199
» Persistence
  TestQueryResults>AbstractPersistenceTestCase.run:206->AbstractPersistenceTestCase.runBare:541->AbstractPersistenceTestCase.runBare:565->setUp:49->AbstractTestCase.deleteAll:199
» Persistence
  TestQueryResults>AbstractPersistenceTestCase.run:206->AbstractPersistenceTestCase.runBare:541->AbstractPersistenceTestCase.runBare:565->setUp:49->AbstractTestCase.deleteAll:199
» Persistence
  TestQueryResults>AbstractPersistenceTestCase.run:206->AbstractPersistenceTestCase.runBare:541->AbstractPersistenceTestCase.runBare:565->setUp:49->AbstractTestCase.deleteAll:199
» Persistence
  TestQueryResults>AbstractPersistenceTestCase.run:206->AbstractPersistenceTestCase.runBare:541->AbstractPersistenceTestCase.runBare:565->setUp:49->AbstractTestCase.deleteAll:199
» Persistence
  TestSimple>AbstractPersistenceTestCase.run:206->AbstractPersistenceTestCase.runBare:541->AbstractPersistenceTestCase.runBare:565->setUp:37->AbstractTestCase.deleteAll:199
» Persistence

Tests run: 2579, Failures: 0, Errors: 150, Skipped: 0

[JENKINS] Recording test results
[INFO] ------------------------------------------------------------------------
[INFO] Reactor Summary:
[INFO] 
[INFO] OpenJPA Parent POM ................................ SUCCESS [21.047s]
[INFO] OpenJPA Utilities Library ......................... SUCCESS [35.976s]
[INFO] OpenJPA Kernel .................................... SUCCESS [35.176s]
[INFO] OpenJPA JDBC ...................................... SUCCESS [24.460s]
[INFO] OpenJPA Persistence ............................... SUCCESS [19.447s]
[INFO] OpenJPA Persistence JDBC .......................... FAILURE [10:34.595s]
[INFO] OpenJPA Persistence Locking Tests ................. SKIPPED
[INFO] OpenJPA tools ..................................... SKIPPED
[INFO] OpenJPA Maven Plugin .............................. SKIPPED
[INFO] OpenJPA XML Store ................................. SKIPPED
[INFO] OpenJPA Slice ..................................... SKIPPED
[INFO] OpenJPA JEST ...................................... SKIPPED
[INFO] OpenJPA Aggregate Jar ............................. SKIPPED
[INFO] OpenJPA Aggregate Jar with Dependencies ........... SKIPPED
[INFO] OpenJPA Project Docs and Assemblies ............... SKIPPED
[INFO] OpenJPA Examples .................................. SKIPPED
[INFO] OpenJPA Examples - Simple ......................... SKIPPED
[INFO] OpenJPA Examples - image-gallery .................. SKIPPED
[INFO] OpenJPA Examples - OpenBooks ...................... SKIPPED
[INFO] OpenJPA Integration Tests ......................... SKIPPED
[INFO] OpenJPA Integration Tests - Daytrader ............. SKIPPED
[INFO] OpenJPA Integration Tests - Examples .............. SKIPPED
[INFO] OpenJPA Integration Tests - SLF4JLogFactory ....... SKIPPED
[INFO] OpenJPA Integration Tests - JPA TCK ............... SKIPPED
[INFO] OpenJPA Integration Tests - Bean Validation ....... SKIPPED
[INFO] OpenJPA Integration Tests - JMX Platform MBeans ... SKIPPED
[INFO] OpenJPA Fetching Statistic Tool ................... SKIPPED
[INFO] OpenJPA Fetching Statistic Tool -- WAS Bundle ..... SKIPPED
[INFO] ------------------------------------------------------------------------
[INFO] BUILD FAILURE
[INFO] ------------------------------------------------------------------------
[INFO] Total time: 13:03.128s
[INFO] Finished at: Tue Aug 23 12:00:21 UTC 2016
[INFO] Final Memory: 57M/739M
[INFO] ------------------------------------------------------------------------
Waiting for Jenkins to finish collecting data
[ERROR] Failed to execute goal org.apache.maven.plugins:maven-surefire-plugin:2.19.1:test
(default-test) on project openjpa-persistence-jdbc: Execution default-test of goal org.apache.maven.plugins:maven-surefire-plugin:2.19.1:test
failed: The forked VM terminated without properly saying goodbye. VM crash or System.exit
called?
[ERROR] Command was /bin/sh -c cd <https://builds.apache.org/job/OpenJPA-trunk/ws/trunk/openjpa-persistence-jdbc>
&& /home/jenkins/tools/java/latest1.6/bin/java -Xmx1024m -XX:MaxPermSize=512m -XX:+HeapDumpOnOutOfMemoryError
-jar <https://builds.apache.org/job/OpenJPA-trunk/ws/trunk/openjpa-persistence-jdbc/target/surefire/surefirebooter7696485596796071668.jar>
<https://builds.apache.org/job/OpenJPA-trunk/ws/trunk/openjpa-persistence-jdbc/target/surefire/surefire8201159934530577883tmp>
<https://builds.apache.org/job/OpenJPA-trunk/ws/trunk/openjpa-persistence-jdbc/target/surefire/surefire_45867247355381562775tmp>
[ERROR] -> [Help 1]
[ERROR] 
[ERROR] To see the full stack trace of the errors, re-run Maven with the -e switch.
[ERROR] Re-run Maven using the -X switch to enable full debug logging.
[ERROR] 
[ERROR] For more information about the errors and possible solutions, please read the following
articles:
[ERROR] [Help 1] http://cwiki.apache.org/confluence/display/MAVEN/PluginExecutionException
[ERROR] 
[ERROR] After correcting the problems, you can resume the build with the command
[ERROR]   mvn <goals> -rf :openjpa-persistence-jdbc
[JENKINS] Archiving <https://builds.apache.org/job/OpenJPA-trunk/ws/trunk/openjpa-persistence-jdbc/pom.xml>
to org.apache.openjpa/openjpa-persistence-jdbc/3.0.0-SNAPSHOT/openjpa-persistence-jdbc-3.0.0-SNAPSHOT.pom
Compressed 58.16 KB of artifacts by 55.0% relative to #1056
[JENKINS] Archiving <https://builds.apache.org/job/OpenJPA-trunk/ws/trunk/openjpa-examples/openbooks/pom.xml>
to org.apache.openjpa.openjpa-examples/openbooks/3.0.0-SNAPSHOT/openbooks-3.0.0-SNAPSHOT.pom
[JENKINS] Archiving <https://builds.apache.org/job/OpenJPA-trunk/ws/trunk/openjpa-integration/validation/pom.xml>
to org.apache.openjpa/openjpa-integration-validation/3.0.0-SNAPSHOT/openjpa-integration-validation-3.0.0-SNAPSHOT.pom
[JENKINS] Archiving <https://builds.apache.org/job/OpenJPA-trunk/ws/trunk/openjpa-tools/pom.xml>
to org.apache.openjpa/openjpa-tools/3.0.0-SNAPSHOT/openjpa-tools-3.0.0-SNAPSHOT.pom
[JENKINS] Archiving <https://builds.apache.org/job/OpenJPA-trunk/ws/trunk/openjpa-persistence/pom.xml>
to org.apache.openjpa/openjpa-persistence/3.0.0-SNAPSHOT/openjpa-persistence-3.0.0-SNAPSHOT.pom
[JENKINS] Archiving <https://builds.apache.org/job/OpenJPA-trunk/ws/trunk/openjpa-persistence/target/openjpa-persistence-3.0.0-SNAPSHOT.jar>
to org.apache.openjpa/openjpa-persistence/3.0.0-SNAPSHOT/openjpa-persistence-3.0.0-SNAPSHOT.jar
[JENKINS] Archiving <https://builds.apache.org/job/OpenJPA-trunk/ws/trunk/openjpa-persistence/target/openjpa-persistence-3.0.0-SNAPSHOT-tests.jar>
to org.apache.openjpa/openjpa-persistence/3.0.0-SNAPSHOT/openjpa-persistence-3.0.0-SNAPSHOT-tests.jar
[JENKINS] Archiving <https://builds.apache.org/job/OpenJPA-trunk/ws/trunk/openjpa-integration/slf4j/pom.xml>
to org.apache.openjpa/openjpa-integration-slf4j/3.0.0-SNAPSHOT/openjpa-integration-slf4j-3.0.0-SNAPSHOT.pom
[JENKINS] Archiving <https://builds.apache.org/job/OpenJPA-trunk/ws/trunk/openjpa-jest/pom.xml>
to org.apache.openjpa/openjpa-jest/3.0.0-SNAPSHOT/openjpa-jest-3.0.0-SNAPSHOT.pom
[JENKINS] Archiving <https://builds.apache.org/job/OpenJPA-trunk/ws/trunk/openjpa-lib/pom.xml>
to org.apache.openjpa/openjpa-lib/3.0.0-SNAPSHOT/openjpa-lib-3.0.0-SNAPSHOT.pom
[JENKINS] Archiving <https://builds.apache.org/job/OpenJPA-trunk/ws/trunk/openjpa-lib/target/openjpa-lib-3.0.0-SNAPSHOT.jar>
to org.apache.openjpa/openjpa-lib/3.0.0-SNAPSHOT/openjpa-lib-3.0.0-SNAPSHOT.jar
[JENKINS] Archiving <https://builds.apache.org/job/OpenJPA-trunk/ws/trunk/openjpa-lib/target/openjpa-lib-3.0.0-SNAPSHOT-tests.jar>
to org.apache.openjpa/openjpa-lib/3.0.0-SNAPSHOT/openjpa-lib-3.0.0-SNAPSHOT-tests.jar
[JENKINS] Archiving <https://builds.apache.org/job/OpenJPA-trunk/ws/trunk/openjpa-tools/openjpa-fetch-statistics/pom.xml>
to org.apache.openjpa/openjpa-fetch-statistics/3.0.0-SNAPSHOT/openjpa-fetch-statistics-3.0.0-SNAPSHOT.pom
[JENKINS] Archiving <https://builds.apache.org/job/OpenJPA-trunk/ws/trunk/openjpa-integration/pom.xml>
to org.apache.openjpa/openjpa-integration/3.0.0-SNAPSHOT/openjpa-integration-3.0.0-SNAPSHOT.pom
[JENKINS] Archiving <https://builds.apache.org/job/OpenJPA-trunk/ws/trunk/openjpa-examples/image-gallery/pom.xml>
to org.apache.openjpa.openjpa-examples/image-gallery/3.0.0-SNAPSHOT/image-gallery-3.0.0-SNAPSHOT.pom
[JENKINS] Archiving <https://builds.apache.org/job/OpenJPA-trunk/ws/trunk/openjpa-examples/pom.xml>
to org.apache.openjpa/openjpa-examples/3.0.0-SNAPSHOT/openjpa-examples-3.0.0-SNAPSHOT.pom
[JENKINS] Archiving <https://builds.apache.org/job/OpenJPA-trunk/ws/trunk/openjpa-integration/examples/pom.xml>
to org.apache.openjpa/openjpa-integration-examples/3.0.0-SNAPSHOT/openjpa-integration-examples-3.0.0-SNAPSHOT.pom
[JENKINS] Archiving <https://builds.apache.org/job/OpenJPA-trunk/ws/trunk/openjpa-persistence-locking/pom.xml>
to org.apache.openjpa/openjpa-persistence-locking/3.0.0-SNAPSHOT/openjpa-persistence-locking-3.0.0-SNAPSHOT.pom
[JENKINS] Archiving <https://builds.apache.org/job/OpenJPA-trunk/ws/trunk/openjpa-tools/openjpa-fetch-statistics-was/pom.xml>
to org.apache.openjpa/openjpa-fetch-statistics-was/3.0.0-SNAPSHOT/openjpa-fetch-statistics-was-3.0.0-SNAPSHOT.pom
[JENKINS] Archiving <https://builds.apache.org/job/OpenJPA-trunk/ws/trunk/openjpa-xmlstore/pom.xml>
to org.apache.openjpa/openjpa-xmlstore/3.0.0-SNAPSHOT/openjpa-xmlstore-3.0.0-SNAPSHOT.pom
[JENKINS] Archiving <https://builds.apache.org/job/OpenJPA-trunk/ws/trunk/openjpa-integration/tck/pom.xml>
to org.apache.openjpa/openjpa-integration-tck/3.0.0-SNAPSHOT/openjpa-integration-tck-3.0.0-SNAPSHOT.pom
[JENKINS] Archiving <https://builds.apache.org/job/OpenJPA-trunk/ws/trunk/openjpa-all/pom.xml>
to org.apache.openjpa/openjpa-all/3.0.0-SNAPSHOT/openjpa-all-3.0.0-SNAPSHOT.pom
[JENKINS] Archiving <https://builds.apache.org/job/OpenJPA-trunk/ws/trunk/openjpa/pom.xml>
to org.apache.openjpa/openjpa/3.0.0-SNAPSHOT/openjpa-3.0.0-SNAPSHOT.pom
[JENKINS] Archiving <https://builds.apache.org/job/OpenJPA-trunk/ws/trunk/openjpa-examples/simple/pom.xml>
to org.apache.openjpa.openjpa-examples/simple/3.0.0-SNAPSHOT/simple-3.0.0-SNAPSHOT.pom
[JENKINS] Archiving <https://builds.apache.org/job/OpenJPA-trunk/ws/trunk/openjpa-jdbc/pom.xml>
to org.apache.openjpa/openjpa-jdbc/3.0.0-SNAPSHOT/openjpa-jdbc-3.0.0-SNAPSHOT.pom
[JENKINS] Archiving <https://builds.apache.org/job/OpenJPA-trunk/ws/trunk/openjpa-jdbc/target/openjpa-jdbc-3.0.0-SNAPSHOT.jar>
to org.apache.openjpa/openjpa-jdbc/3.0.0-SNAPSHOT/openjpa-jdbc-3.0.0-SNAPSHOT.jar
[JENKINS] Archiving <https://builds.apache.org/job/OpenJPA-trunk/ws/trunk/openjpa-jdbc/target/openjpa-jdbc-3.0.0-SNAPSHOT-tests.jar>
to org.apache.openjpa/openjpa-jdbc/3.0.0-SNAPSHOT/openjpa-jdbc-3.0.0-SNAPSHOT-tests.jar
[JENKINS] Archiving <https://builds.apache.org/job/OpenJPA-trunk/ws/trunk/openjpa-integration/daytrader/pom.xml>
to org.apache.openjpa/openjpa-integration-daytrader/3.0.0-SNAPSHOT/openjpa-integration-daytrader-3.0.0-SNAPSHOT.pom
[JENKINS] Archiving <https://builds.apache.org/job/OpenJPA-trunk/ws/trunk/openjpa-kernel/pom.xml>
to org.apache.openjpa/openjpa-kernel/3.0.0-SNAPSHOT/openjpa-kernel-3.0.0-SNAPSHOT.pom
[JENKINS] Archiving <https://builds.apache.org/job/OpenJPA-trunk/ws/trunk/openjpa-kernel/target/openjpa-kernel-3.0.0-SNAPSHOT.jar>
to org.apache.openjpa/openjpa-kernel/3.0.0-SNAPSHOT/openjpa-kernel-3.0.0-SNAPSHOT.jar
[JENKINS] Archiving <https://builds.apache.org/job/OpenJPA-trunk/ws/trunk/openjpa-kernel/target/openjpa-kernel-3.0.0-SNAPSHOT-tests.jar>
to org.apache.openjpa/openjpa-kernel/3.0.0-SNAPSHOT/openjpa-kernel-3.0.0-SNAPSHOT-tests.jar
[JENKINS] Archiving <https://builds.apache.org/job/OpenJPA-trunk/ws/trunk/openjpa-integration/jmx/pom.xml>
to org.apache.openjpa/openjpa-integration-jmx/3.0.0-SNAPSHOT/openjpa-integration-jmx-3.0.0-SNAPSHOT.pom
[JENKINS] Archiving <https://builds.apache.org/job/OpenJPA-trunk/ws/trunk/openjpa-project/pom.xml>
to org.apache.openjpa/apache-openjpa/3.0.0-SNAPSHOT/apache-openjpa-3.0.0-SNAPSHOT.pom
[JENKINS] Archiving <https://builds.apache.org/job/OpenJPA-trunk/ws/trunk/openjpa-tools/openjpa-maven-plugin/pom.xml>
to org.apache.openjpa/openjpa-maven-plugin/3.0.0-SNAPSHOT/openjpa-maven-plugin-3.0.0-SNAPSHOT.pom
[JENKINS] Archiving <https://builds.apache.org/job/OpenJPA-trunk/ws/trunk/openjpa-slice/pom.xml>
to org.apache.openjpa/openjpa-slice/3.0.0-SNAPSHOT/openjpa-slice-3.0.0-SNAPSHOT.pom
[JENKINS] Archiving <https://builds.apache.org/job/OpenJPA-trunk/ws/trunk/pom.xml> to
org.apache.openjpa/openjpa-parent/3.0.0-SNAPSHOT/openjpa-parent-3.0.0-SNAPSHOT.pom
[JENKINS] Archiving <https://builds.apache.org/job/OpenJPA-trunk/ws/trunk/target/openjpa-parent-3.0.0-SNAPSHOT-site.xml>
to org.apache.openjpa/openjpa-parent/3.0.0-SNAPSHOT/openjpa-parent-3.0.0-SNAPSHOT-site.xml
Compressed 55.78 KB of artifacts by 57.4% relative to #1056
Sending e-mails to: commits@openjpa.apache.org
channel stopped

Mime
View raw message