openjpa-commits mailing list archives

Site index · List index
Message view « Date » · « Thread »
Top « Date » · « Thread »
From Apache Jenkins Server <jenk...@builds.apache.org>
Subject Build failed in Jenkins: OpenJPA-21x-deploy #163
Date Sun, 18 Oct 2015 06:45:57 GMT
See <https://builds.apache.org/job/OpenJPA-21x-deploy/163/changes>

Changes:

[hthomann] OPENJPA-2603: Merging an unmanaged entity multiple (3) times leads to an exception.

------------------------------------------
Started by an SCM change
[EnvInject] - Loading node environment variables.
Building remotely on ubuntu-1 (docker Ubuntu ubuntu ubuntu1) in workspace <https://builds.apache.org/job/OpenJPA-21x-deploy/ws/>
Cleaning up <https://builds.apache.org/job/OpenJPA-21x-deploy/ws/2.1.x>
Deleting <https://builds.apache.org/job/OpenJPA-21x-deploy/ws/2.1.x/target>
Updating https://svn.apache.org/repos/asf/openjpa/branches/2.1.x at revision '2015-10-18T06:45:08.551
+0000'
U         openjpa-jdbc/src/main/java/org/apache/openjpa/jdbc/meta/strats/RelationToManyInverseKeyFieldStrategy.java
A         openjpa-persistence-jdbc/src/test/java/org/apache/openjpa/persistence/merge/LineItemPK.java
A         openjpa-persistence-jdbc/src/test/java/org/apache/openjpa/persistence/merge/LineItem.java
A         openjpa-persistence-jdbc/src/test/java/org/apache/openjpa/persistence/merge/Order.java
A         openjpa-persistence-jdbc/src/test/java/org/apache/openjpa/persistence/merge/TestMultipleMerge.java
At revision 1709239
Parsing POMs
Established TCP socket on 48172
maven-agent.jar already up to date
classworlds.jar already up to date
maven-interceptor.jar already up to date
maven2.1-interceptor.jar already up to date
[2.1.x] $ /home/jenkins/tools/java/latest1.6/bin/java -Xmx1024m -XX:MaxPermSize=512m -cp /home/jenkins/jenkins-slave/maven-agent.jar:/home/jenkins/jenkins-slave/classworlds.jar
hudson.maven.agent.Main /home/jenkins/tools/maven/apache-maven-2.2.1 /home/jenkins/jenkins-slave/slave.jar
/home/jenkins/jenkins-slave/maven-interceptor.jar 48172 /home/jenkins/jenkins-slave/maven2.1-interceptor.jar
<===[JENKINS REMOTING CAPACITY]===>   channel started
Executing Maven:  -B -f <https://builds.apache.org/job/OpenJPA-21x-deploy/ws/2.1.x/pom.xml>
-Dmaven.repo.local=/home/jenkins/jenkins-slave/maven-repositories/0 clean deploy
[INFO] Scanning for projects...
[INFO] Reactor build order: 
[INFO]   OpenJPA Parent POM
[INFO]   OpenJPA Utilities Library
[INFO]   OpenJPA Kernel
[INFO]   OpenJPA JDBC
[INFO]   OpenJPA Persistence
[INFO]   OpenJPA Persistence JDBC
[INFO]   OpenJPA Persistence Locking Tests
[INFO]   OpenJPA XML Store
[INFO]   OpenJPA Slice
[INFO]   OpenJPA Aggregate Jar
[INFO]   OpenJPA Aggregate Jar with Dependencies
[INFO]   OpenJPA Project Docs and Assemblies
[INFO]   OpenJPA Examples
[INFO]   OpenJPA Examples - Simple
[INFO]   OpenJPA Examples - image-gallery
[INFO]   OpenJPA Examples - OpenBooks
[INFO]   OpenJPA Integration Tests
[INFO]   OpenJPA Integration Tests - Daytrader
[INFO]   OpenJPA Integration Tests - Examples
[INFO]   OpenJPA Integration Tests - SLF4JLogFactory
[INFO]   OpenJPA Integration Tests - JPA TCK
[INFO]   OpenJPA Integration Tests - Bean Validation
[INFO]   OpenJPA Integration Tests - JMX Platform MBeans
[INFO] ------------------------------------------------------------------------
[INFO] Building OpenJPA Parent POM
[INFO]    task-segment: [clean, deploy]
[INFO] ------------------------------------------------------------------------
[INFO] [clean:clean {execution: default-clean}]
[INFO] [buildnumber:create {execution: default}]
[INFO] Checking for local modifications: skipped.
[INFO] Updating project files from SCM: skipped.
[INFO] Executing: /bin/sh -c cd <https://builds.apache.org/job/OpenJPA-21x-deploy/ws/2.1.x>
&& svn --non-interactive info
[INFO] Working directory: <https://builds.apache.org/job/OpenJPA-21x-deploy/ws/2.1.x>
[INFO] Storing buildNumber: 1709201 at timestamp: October 18, 2015 at 6:46 AM
[INFO] Executing: /bin/sh -c cd <https://builds.apache.org/job/OpenJPA-21x-deploy/ws/2.1.x>
&& svn --non-interactive info
[INFO] Working directory: <https://builds.apache.org/job/OpenJPA-21x-deploy/ws/2.1.x>
[INFO] Storing buildScmBranch: branches/2.1.x
[INFO] [enforcer:enforce {execution: default}]
Setting property: classpath.resource.loader.class => 'org.codehaus.plexus.velocity.ContextClassLoaderResourceLoader'.
Setting property: site.resource.loader.class => 'org.codehaus.plexus.velocity.SiteResourceLoader'.
Setting property: velocimacro.messages.on => 'false'.
Setting property: resource.loader => 'classpath,site'.
Setting property: runtime.log.invalid.references => 'false'.
Setting property: resource.manager.logwhenfound => 'false'.
Setting property: velocimacro.permissions.allow.inline.to.replace.global => 'true'.
[INFO] [checkstyle:checkstyle {execution: default}]
[INFO] Source directory does not exist - skipping report.
[ERROR] VM #displayTree: error : too few arguments to macro. Wanted 2 got 0
[ERROR] VM #menuItem: error : too few arguments to macro. Wanted 1 got 0
[INFO] Setting property: classpath.resource.loader.class => 'org.codehaus.plexus.velocity.ContextClassLoaderResourceLoader'.
[INFO] Setting property: velocimacro.messages.on => 'false'.
[INFO] Setting property: resource.loader => 'classpath'.
[INFO] Setting property: resource.manager.logwhenfound => 'false'.
[INFO] [remote-resources:process {execution: default}]
[INFO] [site:attach-descriptor {execution: default-attach-descriptor}]
[INFO] Parent project loaded from repository.
[INFO] [ianal:verify-legal-files {execution: default}]
[INFO] [apache-rat:check {execution: default}]
[INFO] Exclude: **/.*/**
[INFO] Exclude: **/target/**/*
[INFO] [install:install {execution: default-install}]
[INFO] Installing <https://builds.apache.org/job/OpenJPA-21x-deploy/ws/2.1.x/pom.xml>
to /home/jenkins/jenkins-slave/maven-repositories/0/org/apache/openjpa/openjpa-parent/2.1.2-SNAPSHOT/openjpa-parent-2.1.2-SNAPSHOT.pom
[INFO] [deploy:deploy {execution: default-deploy}]
[INFO] Retrieving previous build number from apache.snapshots.https
[INFO] ------------------------------------------------------------------------
[ERROR] BUILD ERROR
[INFO] ------------------------------------------------------------------------
[INFO] Error retrieving previous build number for artifact 'org.apache.openjpa:openjpa-parent:pom':
repository metadata for: 'snapshot org.apache.openjpa:openjpa-parent:2.1.2-SNAPSHOT' could
not be retrieved from repository: apache.snapshots.https due to an error: Error transferring
file: java.lang.RuntimeException: Could not generate DH keypair

Prime size must be multiple of 64, and can only range from 512 to 1024 (inclusive)
[INFO] ------------------------------------------------------------------------
[INFO] For more information, run Maven with the -e switch
[INFO] ------------------------------------------------------------------------
[INFO] Total time: 24 seconds
[INFO] Finished at: Sun Oct 18 06:46:43 UTC 2015
[INFO] Final Memory: 52M/403M
[INFO] ------------------------------------------------------------------------
[JENKINS] Archiving <https://builds.apache.org/job/OpenJPA-21x-deploy/ws/2.1.x/pom.xml>
to org.apache.openjpa/openjpa-parent/2.1.2-SNAPSHOT/openjpa-parent-2.1.2-SNAPSHOT.pom
Sending e-mails to: commits@openjpa.apache.org
channel stopped

Mime
View raw message