openjpa-commits mailing list archives

Site index · List index
Message view « Date » · « Thread »
Top « Date » · « Thread »
From Apache Jenkins Server <jenk...@builds.apache.org>
Subject Build failed in Jenkins: OpenJPA-trunk-deploy » OpenJPA Integration Tests - SLF4JLogFactory #441
Date Wed, 18 Jun 2014 08:02:48 GMT
See <https://builds.apache.org/job/OpenJPA-trunk-deploy/org.apache.openjpa$openjpa-integration-slf4j/441/>

------------------------------------------
[INFO] ------------------------------------------------------------------------
[INFO] Building OpenJPA Integration Tests - SLF4JLogFactory
[INFO]    task-segment: [clean, deploy]
[INFO] ------------------------------------------------------------------------
[INFO] [clean:clean {execution: default-clean}]
[INFO] Deleting file set: <https://builds.apache.org/job/OpenJPA-trunk-deploy/org.apache.openjpa$openjpa-integration-slf4j/ws/target>
(included: [**], excluded: [])
[INFO] [buildnumber:create {execution: default}]
[INFO] [enforcer:enforce {execution: default}]
[INFO] [checkstyle:checkstyle {execution: default}]
[INFO] [remote-resources:process {execution: default}]
[INFO] [resources:resources {execution: default-resources}]
[INFO] Using 'UTF-8' encoding to copy filtered resources.
[INFO] skip non existing resourceDirectory <https://builds.apache.org/job/OpenJPA-trunk-deploy/org.apache.openjpa$openjpa-integration-slf4j/ws/src/main/resources>
[INFO] Copying 3 resources
[INFO] [compiler:compile {execution: default-compile}]
[INFO] No sources to compile
[INFO] [compiler:testCompile {execution: test-source-compile}]
[INFO] Compiling 1 source file to <https://builds.apache.org/job/OpenJPA-trunk-deploy/org.apache.openjpa$openjpa-integration-slf4j/ws/target/test-classes>
[INFO] [resources:testResources {execution: default-testResources}]
[INFO] Using 'UTF-8' encoding to copy filtered resources.
[INFO] Copying 1 resource
[INFO] Copying 3 resources
[INFO] [compiler:testCompile {execution: default-testCompile}]
[INFO] Nothing to compile - all classes are up to date
[INFO] [dependency:unpack {execution: unpack}]
[INFO] Configured Artifact: org.apache.openjpa:openjpa-persistence-jdbc:2.4.0-SNAPSHOT:test-jar
[INFO] Unpacking /home/jenkins/jenkins-slave/maven-repositories/1/org/apache/openjpa/openjpa-persistence-jdbc/2.4.0-SNAPSHOT/openjpa-persistence-jdbc-2.4.0-SNAPSHOT-tests.jar
to
  <https://builds.apache.org/job/OpenJPA-trunk-deploy/org.apache.openjpa$openjpa-integration-slf4j/ws/target/test-classes>
   with includes org/apache/openjpa/persistence/test/*.class and excludes:null
[WARNING] DEPRECATED [systemProperties]: Use systemPropertyVariables instead.
[INFO] [surefire:test {execution: default-test}]
[INFO] Surefire report directory: <https://builds.apache.org/job/OpenJPA-trunk-deploy/org.apache.openjpa$openjpa-integration-slf4j/ws/target/surefire-reports>

-------------------------------------------------------
 T E S T S
-------------------------------------------------------
Running org.apache.openjpa.integration.slf4j.TestLogFactory
93 [main] INFO openjpa.Runtime - OpenJPA dynamically loaded a validation provider.
113 [main] INFO openjpa.Runtime - Starting OpenJPA 2.4.0-SNAPSHOT
178 [main] INFO openjpa.jdbc.JDBC - Using dictionary class "org.apache.openjpa.jdbc.sql.DerbyDictionary".
8693 [main] INFO openjpa.jdbc.JDBC - Connected to Apache Derby version 10.10 using JDBC driver
Apache Derby Embedded JDBC Driver version 10.8.2.2 - (1181258). 
8751 [main] INFO Tests - Log class=org.apache.openjpa.lib.log.SLF4JLogFactory$LogAdapter
Tests run: 1, Failures: 0, Errors: 0, Skipped: 0, Time elapsed: 9.086 sec

Results :

Tests run: 1, Failures: 0, Errors: 0, Skipped: 0

[JENKINS] Recording test results
[INFO] [jar:jar {execution: default-jar}]
[INFO] Building jar: <https://builds.apache.org/job/OpenJPA-trunk-deploy/org.apache.openjpa$openjpa-integration-slf4j/ws/target/openjpa-integration-slf4j-2.4.0-SNAPSHOT.jar>
[INFO] [jar:jar {execution: default-jar}]
[INFO] [jar:test-jar {execution: attach-tests}]
[INFO] Building jar: <https://builds.apache.org/job/OpenJPA-trunk-deploy/org.apache.openjpa$openjpa-integration-slf4j/ws/target/openjpa-integration-slf4j-2.4.0-SNAPSHOT-tests.jar>
[INFO] [ianal:verify-legal-files {execution: default}]
[INFO] Checking legal files in: openjpa-integration-slf4j-2.4.0-SNAPSHOT.jar
[INFO] Checking legal files in: openjpa-integration-slf4j-2.4.0-SNAPSHOT-tests.jar
[INFO] [apache-rat:check {execution: default}]
[INFO] Exclude: **/.*/**
[INFO] Exclude: **/target/**/*
[INFO] [install:install {execution: default-install}]
[INFO] Installing <https://builds.apache.org/job/OpenJPA-trunk-deploy/org.apache.openjpa$openjpa-integration-slf4j/ws/target/openjpa-integration-slf4j-2.4.0-SNAPSHOT.jar>
to /home/jenkins/jenkins-slave/maven-repositories/1/org/apache/openjpa/openjpa-integration-slf4j/2.4.0-SNAPSHOT/openjpa-integration-slf4j-2.4.0-SNAPSHOT.jar
[INFO] Installing <https://builds.apache.org/job/OpenJPA-trunk-deploy/org.apache.openjpa$openjpa-integration-slf4j/ws/target/openjpa-integration-slf4j-2.4.0-SNAPSHOT-tests.jar>
to /home/jenkins/jenkins-slave/maven-repositories/1/org/apache/openjpa/openjpa-integration-slf4j/2.4.0-SNAPSHOT/openjpa-integration-slf4j-2.4.0-SNAPSHOT-tests.jar
[INFO] [deploy:deploy {execution: default-deploy}]
[INFO] Retrieving previous build number from apache.snapshots.https
[WARNING] *** CHECKSUM FAILED - Checksum failed on download: local = '5abc1e0b074fb3992b309b7f0dc4c003158210f4';
remote = 'b4d95d228c3362430e979803b9e8dda9266ac5c2' - RETRYING
[WARNING] *** CHECKSUM FAILED - Checksum failed on download: local = '5abc1e0b074fb3992b309b7f0dc4c003158210f4';
remote = 'b4d95d228c3362430e979803b9e8dda9266ac5c2' - IGNORING
Uploading: https://repository.apache.org/content/repositories/snapshots/org/apache/openjpa/openjpa-integration-slf4j/2.4.0-SNAPSHOT/openjpa-integration-slf4j-2.4.0-20140618.064908-9.jar
7K uploaded  (openjpa-integration-slf4j-2.4.0-20140618.064908-9.jar)
[INFO] Retrieving previous metadata from apache.snapshots.https
[INFO] Uploading repository metadata for: 'artifact org.apache.openjpa:openjpa-integration-slf4j'
[INFO] Uploading project information for openjpa-integration-slf4j 2.4.0-20140618.064908-9
[INFO] Retrieving previous metadata from apache.snapshots.https
[WARNING] *** CHECKSUM FAILED - Checksum failed on download: local = '5abc1e0b074fb3992b309b7f0dc4c003158210f4';
remote = 'b4d95d228c3362430e979803b9e8dda9266ac5c2' - RETRYING
[WARNING] *** CHECKSUM FAILED - Checksum failed on download: local = '5abc1e0b074fb3992b309b7f0dc4c003158210f4';
remote = 'b4d95d228c3362430e979803b9e8dda9266ac5c2' - IGNORING
[INFO] Uploading repository metadata for: 'snapshot org.apache.openjpa:openjpa-integration-slf4j:2.4.0-SNAPSHOT'
[INFO] ------------------------------------------------------------------------
[ERROR] BUILD ERROR
[INFO] ------------------------------------------------------------------------
[INFO] Error installing artifact's metadata: Error while deploying metadata: Failed to transfer
file: https://repository.apache.org/content/repositories/snapshots/org/apache/openjpa/openjpa-integration-slf4j/2.4.0-SNAPSHOT/maven-metadata.xml.md5.
Return code is: 503

[INFO] ------------------------------------------------------------------------
[INFO] For more information, run Maven with the -e switch
[INFO] ------------------------------------------------------------------------
[INFO] Total time: 73 minutes 32 seconds
[INFO] Finished at: Wed Jun 18 08:01:18 UTC 2014
[INFO] Final Memory: 164M/556M
[INFO] ------------------------------------------------------------------------

Mime
View raw message