openjpa-commits mailing list archives

Site index · List index
Message view « Date » · « Thread »
Top « Date » · « Thread »
From Apache Jenkins Server <jenk...@builds.apache.org>
Subject Build failed in Jenkins: OpenJPA-trunk #925
Date Tue, 27 May 2014 19:40:24 GMT
See <https://builds.apache.org/job/OpenJPA-trunk/925/changes>

Changes:

[hthomann] OPENJPA-2478: Fixed erroneous message from the enhancer when a Mapped Superclass
contains an @Id.

[hthomann] OPENJPA-2476: Fixed OptimisticLockEx due to rounding of a Timestamp

[jgrassel] OPENJPA-2368: Undo revert on trunk (Move www.apache.org/openjpa/ns/orm to openjpa.apache.org/ns/orm)

[kwsutter] OPENJPA-2492.  Committing a variation of the patch as provided by Romain Manni-Bucau.
 This patch clears up the ConcurrentHashMap issues relating to the KeySetView return type.
 This patch also adds a couple of asserts to an existing testcase to verify the results.

[kwsutter] OPENJPA-2491.  One other minor spelling update for a testcase name...

[kwsutter] OPENJPA-2489.  Committing patch as provided by Romain Manni-Bucau.   This patch
just modifies the testcase to skip attempting to process some new Java 8 methods that are
not needed yet...

[kwsutter] OPENJPA-2491.  Variation of the patch as provided by Romain Manni-Bucau.  Besides
clearing the cache, I also corrected the spelling of "parameter" in this testcase name and
another related testcase.

[kwsutter] OPENJPA-2442.  Just using ProxyConcurrentMaps for proxying the Map methods.  Since
this extends ProxyMaps anyway, this is pretty safe change.  This change resolves the TestProxyManager
errors in openjpa-kernel when testing with Java 8 runtime.  And, it doesn't affect Java 7
runtime at all.  Refer to the Comments section for more details.

[kwsutter] OPENJPA-2487.  This patch provided by Romain Manni-Bucau looks good.  As stated
in the Comments, this patch by itself is not sufficient for Java 8 runtime support, but it
is a crucial step.  Follow the linked JIRAs for additional fixes required to fully support
Java 8.

[hthomann] OPENJPA-2286: ArgumentException: Attempt to compare incompatible types class java.util.Date
and class org.apache.openjpa.jdbc.sql.Raw

[hthomann] OPENJPA-1986: Extra queries being generated when cascading a persist - added another/similar
check to the ones added by Rick.

[hthomann] OPENJPA-2475: A query with LEFT FETCH JOIN returns incorrect results - applied
fix to trunk.

[struberg] update copyright year

[curtisr7] OPENJPA-2482: Cache column alias on colum+pathjoins rather than just column.

[curtisr7] OPENJPA-2441: Remove usage of NullSafeConcurrentHashMap. Patch contributed by Dalia
Abo Sheasha.

[curtisr7] OPENJPA-2285: Recommitted DataCacheStoreManager improvement.

[curtisr7] OPENJPA-2389: Update message to be more descriptive. Patch contributed by Ben (?)
and Dalia Abo Sheasha.

[curtisr7] OPENJPA-2022 : Minor change to SchemaGenerator. Patch contributed by Jason Zwolak.

[hthomann] OPENJPA-2453: Add support to retain milliseconds of 'un-rounded' Date field.

[curtisr7] OPENJPA-2472: Fix concurrency bug in ClassMetaData. Patch contributed by Dalia
Abo Sheasha.

[curtisr7] OPENJPA-2134: Deprecate EntityManagerImpl.prepareForPooling().

[curtisr7] OPENJPA-2467: Fix detection of property access method names. Patch contributed
by Dalia Abo Sheasha.

[jgrassel] OPENJPA-2423: Added null-check to DB2Dictionary update

[jgrassel] OPENJPA-2450: Option to disable execution of ALTER SEQUENCE...INCREMENT BY statement
for sequences.

[curtisr7] OPENJPA-2470 : Update DataCacheManagerImpl to use a ConcurrentHashMap rather than
a HashMap.

------------------------------------------
Started by an SCM change
Building remotely on ubuntu3 (Ubuntu ubuntu) in workspace <https://builds.apache.org/job/OpenJPA-trunk/ws/>
Updating https://svn.apache.org/repos/asf/openjpa/trunk at revision '2014-05-27T19:36:10.299
+0000'
U         openjpa-jdbc/src/main/java/org/apache/openjpa/jdbc/sql/DB2Dictionary.java
U         openjpa-jdbc/src/main/java/org/apache/openjpa/jdbc/sql/SelectImpl.java
U         openjpa-jdbc/src/main/java/org/apache/openjpa/jdbc/sql/DBDictionary.java
U         openjpa-jdbc/src/main/java/org/apache/openjpa/jdbc/kernel/exps/CompareExpression.java
U         openjpa-jdbc/src/main/java/org/apache/openjpa/jdbc/kernel/NativeJDBCSeq.java
U         openjpa-jdbc/src/main/java/org/apache/openjpa/jdbc/schema/SchemaGenerator.java
U         openjpa-jdbc/src/main/java/org/apache/openjpa/jdbc/meta/strats/StoreCollectionFieldStrategy.java
U         openjpa-jdbc/src/main/resources/org/apache/openjpa/jdbc/kernel/localizer.properties
U         openjpa-project/src/doc/manual/ref_guide_dbsetup.xml
D         openjpa-lib/src/test/java/org/apache/openjpa/lib/util/concurrent/TestNullSafeConcurrentHashMap.java
D         openjpa-lib/src/test/java/org/apache/openjpa/lib/util/concurrent/TestConcurrentMap.java
U         openjpa-lib/src/main/java/org/apache/openjpa/lib/util/concurrent/SizedConcurrentHashMap.java
U         openjpa-lib/src/main/java/org/apache/openjpa/lib/util/concurrent/NullSafeConcurrentHashMap.java
U         openjpa-lib/src/main/java/org/apache/openjpa/lib/meta/XMLMetaDataParser.java
U         openjpa-kernel/src/main/java/org/apache/openjpa/meta/ClassMetaData.java
U         openjpa-kernel/src/main/java/org/apache/openjpa/meta/FieldMetaData.java
U         openjpa-kernel/src/main/java/org/apache/openjpa/datacache/AbstractQueryCache.java
U         openjpa-kernel/src/main/java/org/apache/openjpa/datacache/DataCacheStoreManager.java
U         openjpa-kernel/src/main/java/org/apache/openjpa/datacache/DataCacheManagerImpl.java
U         openjpa-kernel/src/main/java/org/apache/openjpa/util/ProxyConcurrentMaps.java
U         openjpa-kernel/src/main/java/org/apache/openjpa/util/ProxyManagerImpl.java
U         openjpa-kernel/src/main/java/org/apache/openjpa/util/ProxyMaps.java
U         openjpa-kernel/src/main/java/org/apache/openjpa/kernel/QueryStatistics.java
U         openjpa-kernel/src/main/java/org/apache/openjpa/kernel/StateManagerImpl.java
U         openjpa-kernel/src/main/java/org/apache/openjpa/kernel/SingleFieldManager.java
U         openjpa-kernel/src/main/java/org/apache/openjpa/enhance/PCEnhancer.java
U         openjpa-kernel/src/main/java/org/apache/openjpa/enhance/CodeGenerator.java
U         openjpa-kernel/src/main/java/org/apache/openjpa/enhance/Reflection.java
U         openjpa-kernel/src/main/java/org/apache/openjpa/enhance/AsmAdaptor.java
U         openjpa-kernel/src/test/java/org/apache/openjpa/util/TestProxyManager.java
U         openjpa-kernel/pom.xml
U         openjpa-persistence/src/main/resources/org/apache/openjpa/persistence/extendable-orm.xsd
U         openjpa-persistence/src/main/resources/org/apache/openjpa/persistence/openjpa-orm.xsd
U         openjpa-persistence/src/main/java/org/apache/openjpa/persistence/PersistenceMetaDataDefaults.java
U         openjpa-persistence/src/main/java/org/apache/openjpa/persistence/PersistenceMetaDataFactory.java
U         openjpa-persistence/src/main/java/org/apache/openjpa/persistence/EntityManagerImpl.java
U         openjpa-persistence-jdbc/src/test/java/org/apache/openjpa/persistence/proxy/delayed/DelayedProxyCollectionsTestCase.java
U         openjpa-persistence-jdbc/src/test/java/org/apache/openjpa/persistence/cascade/TestCascadePersist.java
U         openjpa-persistence-jdbc/src/test/java/org/apache/openjpa/persistence/enhance/identity/TestMultipleLevelDerivedIdentity1.java
A         openjpa-persistence-jdbc/src/test/java/org/apache/openjpa/persistence/optlockex
A         openjpa-persistence-jdbc/src/test/java/org/apache/openjpa/persistence/optlockex/timestamp
A         openjpa-persistence-jdbc/src/test/java/org/apache/openjpa/persistence/optlockex/timestamp/TestTimestampOptLockEx.java
A         openjpa-persistence-jdbc/src/test/java/org/apache/openjpa/persistence/optlockex/timestamp/VersionTSEntity.java
U         openjpa-persistence-jdbc/src/test/java/org/apache/openjpa/persistence/temporal/TestTemporalTimestamp.java
AU        openjpa-persistence-jdbc/src/test/java/org/apache/openjpa/persistence/access/PropertyAccessCapitalizationOldBehavior.java
AU        openjpa-persistence-jdbc/src/test/java/org/apache/openjpa/persistence/access/PropertyAccessCapitalization.java
AU        openjpa-persistence-jdbc/src/test/java/org/apache/openjpa/persistence/access/TestPropertyAccessCapitalization.java
D         openjpa-persistence-jdbc/src/test/java/org/apache/openjpa/persistence/jdbc/sqlcache/TestMultithreadedReparametrization.java
D         openjpa-persistence-jdbc/src/test/java/org/apache/openjpa/persistence/jdbc/sqlcache/TestInExpressionParamaterBinding.java
A         openjpa-persistence-jdbc/src/test/java/org/apache/openjpa/persistence/jdbc/sqlcache/TestMultithreadedReparameterization.java
A         openjpa-persistence-jdbc/src/test/java/org/apache/openjpa/persistence/jdbc/sqlcache/TestInExpressionParameterBinding.java
A         openjpa-persistence-jdbc/src/test/java/org/apache/openjpa/persistence/jpql/joins/leftfetch
A         openjpa-persistence-jdbc/src/test/java/org/apache/openjpa/persistence/jpql/joins/leftfetch/PersonTest.java
A         openjpa-persistence-jdbc/src/test/java/org/apache/openjpa/persistence/jpql/joins/leftfetch/DepartmentTest.java
A         openjpa-persistence-jdbc/src/test/java/org/apache/openjpa/persistence/jpql/joins/leftfetch/TestJoinLeftFetch.java
U         openjpa-persistence-jdbc/src/test/java/org/apache/openjpa/persistence/query/TestJDBCEscapeDate.java
U         openjpa-persistence-jdbc/src/test/java/org/apache/openjpa/persistence/datacache/TestStatistics.java
A         openjpa-persistence-jdbc/src/test/java/org/apache/openjpa/persistence/datacache/TestDataCacheStoreLazyFk.java
A         openjpa-persistence-jdbc/src/test/java/org/apache/openjpa/persistence/datacache/TestJPAEmbeddableDataCache.java
A         openjpa-persistence-jdbc/src/test/java/org/apache/openjpa/persistence/datacache/entities
AU        openjpa-persistence-jdbc/src/test/java/org/apache/openjpa/persistence/datacache/entities/Person.java
AU        openjpa-persistence-jdbc/src/test/java/org/apache/openjpa/persistence/datacache/entities/ContactInfo.java
AU        openjpa-persistence-jdbc/src/test/java/org/apache/openjpa/persistence/datacache/entities/Phone.java
U         openjpa-persistence-jdbc/src/test/java/org/apache/openjpa/persistence/relations/TestConcurrentMap.java
U         openjpa-persistence-jdbc/src/test/resources/META-INF/version-columns-orm.xml
U         openjpa-persistence-jdbc/src/test/resources/META-INF/fetch-groups-orm.xml
U         openjpa-persistence-jdbc/src/test/resources/META-INF/nonstandard-orm.xml
U         openjpa-persistence-jdbc/src/test/resources/META-INF/foreign-key-orm.xml
U         openjpa-persistence-jdbc/src/test/resources/org/apache/openjpa/persistence/embed/lazy/embed-lazy-orm.xml
U         NOTICE
 U        .
At revision 1597856
Parsing POMs
Modules changed, recalculating dependency graph
maven-agent.jar already up to date
classworlds.jar already up to date
maven-interceptor.jar already up to date
maven2.1-interceptor.jar already up to date
[trunk] $ /home/hudson/tools/java/latest1.6/bin/java -Xmx1280m -XX:MaxPermSize=512m -cp /home/jenkins/jenkins-slave/maven-agent.jar:/home/jenkins/jenkins-slave/classworlds.jar
hudson.maven.agent.Main /home/hudson/tools/maven/apache-maven-2.2.1 /x1/jenkins/jenkins-slave/slave.jar
/home/jenkins/jenkins-slave/maven-interceptor.jar 59833 /home/jenkins/jenkins-slave/maven2.1-interceptor.jar
<===[JENKINS REMOTING CAPACITY]===>   channel started
log4j:WARN No appenders could be found for logger (org.apache.commons.beanutils.converters.BooleanConverter).
log4j:WARN Please initialize the log4j system properly.
Executing Maven:  -B -f <https://builds.apache.org/job/OpenJPA-trunk/ws/trunk/pom.xml>
-Dmaven.repo.local=/home/jenkins/jenkins-slave/maven-repositories/1 clean install
[INFO] Scanning for projects...
[INFO] Reactor build order: 
[INFO]   OpenJPA Parent POM
[INFO]   OpenJPA Utilities Library
[INFO]   OpenJPA Kernel
[INFO]   OpenJPA JDBC
[INFO]   OpenJPA Persistence
[INFO]   OpenJPA Persistence JDBC
[INFO]   OpenJPA Persistence Locking Tests
[INFO]   OpenJPA tools
[INFO]   OpenJPA Maven Plugin
[INFO]   OpenJPA XML Store
[INFO]   OpenJPA Slice
[INFO]   OpenJPA JEST
[INFO]   OpenJPA Aggregate Jar
[INFO]   OpenJPA Aggregate Jar with Dependencies
[INFO]   OpenJPA Project Docs and Assemblies
[INFO]   OpenJPA Examples
[INFO]   OpenJPA Examples - Simple
[INFO]   OpenJPA Examples - image-gallery
[INFO]   OpenJPA Examples - OpenBooks
[INFO]   OpenJPA Integration Tests
[INFO]   OpenJPA Integration Tests - Daytrader
[INFO]   OpenJPA Integration Tests - Examples
[INFO]   OpenJPA Integration Tests - SLF4JLogFactory
[INFO]   OpenJPA Integration Tests - JPA TCK
[INFO]   OpenJPA Integration Tests - Bean Validation
[INFO]   OpenJPA Integration Tests - JMX Platform MBeans
[INFO]   OpenJPA Fetching Statistic Tool
[INFO]   OpenJPA Fetching Statistic Tool -- WAS Bundle
[INFO] ------------------------------------------------------------------------
[INFO] Building OpenJPA Parent POM
[INFO]    task-segment: [clean, install]
[INFO] ------------------------------------------------------------------------
[INFO] [clean:clean {execution: default-clean}]
[INFO] Deleting file set: <https://builds.apache.org/job/OpenJPA-trunk/ws/trunk/target>
(included: [**], excluded: [])
[INFO] [buildnumber:create {execution: default}]
[INFO] Checking for local modifications: skipped.
[INFO] Updating project files from SCM: skipped.
[INFO] Executing: /bin/sh -c cd <https://builds.apache.org/job/OpenJPA-trunk/ws/trunk>
&& svn --non-interactive info
[INFO] Working directory: <https://builds.apache.org/job/OpenJPA-trunk/ws/trunk>
[INFO] Storing buildNumber: 1591689 at timestamp: May 27, 2014 at 7:39 PM
[INFO] Executing: /bin/sh -c cd <https://builds.apache.org/job/OpenJPA-trunk/ws/trunk>
&& svn --non-interactive info
[INFO] Working directory: <https://builds.apache.org/job/OpenJPA-trunk/ws/trunk>
[INFO] Storing buildScmBranch: trunk
[INFO] [enforcer:enforce {execution: default}]
Setting property: classpath.resource.loader.class => 'org.codehaus.plexus.velocity.ContextClassLoaderResourceLoader'.
Setting property: site.resource.loader.class => 'org.codehaus.plexus.velocity.SiteResourceLoader'.
Setting property: velocimacro.messages.on => 'false'.
Setting property: resource.loader => 'classpath,site'.
Setting property: runtime.log.invalid.references => 'false'.
Setting property: resource.manager.logwhenfound => 'false'.
Setting property: classpath.resource.loader.class => 'org.codehaus.plexus.velocity.ContextClassLoaderResourceLoader'.
Setting property: site.resource.loader.class => 'org.codehaus.plexus.velocity.SiteResourceLoader'.
Setting property: velocimacro.messages.on => 'false'.
Setting property: resource.loader => 'classpath,site'.
Setting property: runtime.log.invalid.references => 'false'.
Setting property: resource.manager.logwhenfound => 'false'.
Setting property: velocimacro.permissions.allow.inline.to.replace.global => 'true'.
[INFO] [checkstyle:checkstyle {execution: default}]
[INFO] Setting property: classpath.resource.loader.class => 'org.codehaus.plexus.velocity.ContextClassLoaderResourceLoader'.
[INFO] Setting property: velocimacro.messages.on => 'false'.
[INFO] Setting property: resource.loader => 'classpath'.
[INFO] Setting property: resource.manager.logwhenfound => 'false'.
[INFO] [remote-resources:process {execution: default}]
[INFO] [compiler:testCompile {execution: test-source-compile}]
[INFO] No sources to compile
[INFO] [site:attach-descriptor {execution: default-attach-descriptor}]
[INFO] Unable to load parent project from a relative path: Could not find the model file '<https://builds.apache.org/job/OpenJPA-trunk/ws/pom.xml'.>
for project unknown
[INFO] Parent project loaded from repository.
[INFO] [ianal:verify-legal-files {execution: default}]
[INFO] [apache-rat:check {execution: default}]
[INFO] Exclude: **/.*/**
[INFO] Exclude: **/target/**/*
[INFO] [install:install {execution: default-install}]
[INFO] Installing <https://builds.apache.org/job/OpenJPA-trunk/ws/trunk/pom.xml> to
/home/jenkins/jenkins-slave/maven-repositories/1/org/apache/openjpa/openjpa-parent/2.4.0-SNAPSHOT/openjpa-parent-2.4.0-SNAPSHOT.pom
[INFO] ------------------------------------------------------------------------
[INFO] Building OpenJPA Utilities Library
[INFO]    task-segment: [clean, install]
[INFO] ------------------------------------------------------------------------
[INFO] [clean:clean {execution: default-clean}]
[INFO] Deleting file set: <https://builds.apache.org/job/OpenJPA-trunk/ws/trunk/openjpa-lib/target>
(included: [**], excluded: [])
[INFO] [buildnumber:create {execution: default}]
[INFO] [enforcer:enforce {execution: default}]
[INFO] [checkstyle:checkstyle {execution: default}]
[INFO] Starting audit...
Audit done.

[WARNING] Unable to locate Source XRef to link to - DISABLED
[ERROR] VM #image: error : too few arguments to macro. Wanted 5 got 0
[ERROR] VM #image: error : too few arguments to macro. Wanted 5 got 0
[ERROR] VM #displayTree: error : too few arguments to macro. Wanted 2 got 0
[ERROR] VM #menuItem: error : too few arguments to macro. Wanted 1 got 0
[INFO] [remote-resources:process {execution: default}]
[INFO] [resources:resources {execution: default-resources}]
[INFO] Using 'UTF-8' encoding to copy filtered resources.
[INFO] Copying 9 resources
[INFO] Copying 3 resources
[INFO] [compiler:compile {execution: default-compile}]
[INFO] Compiling 161 source files to <https://builds.apache.org/job/OpenJPA-trunk/ws/trunk/openjpa-lib/target/classes>
[INFO] -------------------------------------------------------------
[ERROR] COMPILATION ERROR : 
[INFO] -------------------------------------------------------------
[ERROR] Failure executing javac, but could not parse the error:
javac: invalid target release: 1.7
Usage: javac <options> <source files>
use -help for a list of possible options

[INFO] 1 error
[INFO] -------------------------------------------------------------
[INFO] ------------------------------------------------------------------------
[ERROR] BUILD FAILURE
[INFO] ------------------------------------------------------------------------
[INFO] Compilation failure
Failure executing javac, but could not parse the error:
javac: invalid target release: 1.7
Usage: javac <options> <source files>
use -help for a list of possible options


[INFO] ------------------------------------------------------------------------
[INFO] For more information, run Maven with the -e switch
[INFO] ------------------------------------------------------------------------
[INFO] Total time: 39 seconds
[INFO] Finished at: Tue May 27 19:40:01 UTC 2014
[INFO] Final Memory: 59M/326M
[INFO] ------------------------------------------------------------------------
Waiting for Jenkins to finish collecting data
[JENKINS] Archiving <https://builds.apache.org/job/OpenJPA-trunk/ws/trunk/openjpa-lib/pom.xml>
to org.apache.openjpa/openjpa-lib/2.4.0-SNAPSHOT/openjpa-lib-2.4.0-SNAPSHOT.pom
[JENKINS] Archiving /home/jenkins/jenkins-slave/maven-repositories/1/org/apache/openjpa/openjpa-parent/2.4.0-SNAPSHOT/openjpa-parent-2.4.0-SNAPSHOT.pom
to org.apache.openjpa/openjpa-parent/2.4.0-SNAPSHOT/openjpa-parent-2.4.0-SNAPSHOT.pom
/x1/jenkins/jenkins-slave/maven-repositories/1/org/apache/openjpa/openjpa-parent/2.4.0-SNAPSHOT/openjpa-parent-2.4.0-SNAPSHOT.pom
is not inside /x1/jenkins/jenkins-slave/workspace/OpenJPA-trunk/trunk/; will archive in a
separate pass
Sending e-mails to: commits@openjpa.apache.org
channel stopped

Mime
View raw message