openjpa-commits mailing list archives

Site index · List index
Message view « Date » · « Thread »
Top « Date » · « Thread »
From Apache Jenkins Server <jenk...@builds.apache.org>
Subject Build failed in Jenkins: OpenJPA-trunk-deploy #435
Date Thu, 02 Jan 2014 10:53:51 GMT
See <https://builds.apache.org/job/OpenJPA-trunk-deploy/435/>

------------------------------------------
Started by an SCM change
Building remotely on ubuntu4 in workspace <https://builds.apache.org/job/OpenJPA-trunk-deploy/ws/>
Updating https://svn.apache.org/repos/asf/openjpa/trunk at revision '2014-01-02T10:51:15.761
+0000'
U         openjpa-jdbc/src/main/java/org/apache/openjpa/jdbc/meta/ReverseMappingTool.java
U         openjpa-kernel/src/main/resources/org/apache/openjpa/enhance/localizer.properties
U         openjpa-kernel/src/main/java/org/apache/openjpa/enhance/PCEnhancer.java
A         openjpa-persistence-jdbc/src/test/java/org/apache/openjpa/persistence/enhance/TestEmbeddableEntityWithIDAnnotation.java
A         openjpa-persistence-jdbc/src/test/java/org/apache/openjpa/persistence/enhance/common/apps/EmbeddableEntityWithIDAnnotation.java
A         openjpa-persistence-jdbc/src/test/java/org/apache/openjpa/persistence/enhance/common/apps/IDOwningClassTestEntity.java
At revision 1554785
Parsing POMs
maven-agent.jar already up to date
classworlds.jar already up to date
maven-interceptor.jar already up to date
maven2.1-interceptor.jar already up to date
[trunk] $ /home/hudson/tools/java/latest1.6/bin/java -Xmx1280m -XX:MaxPermSize=512m -cp /home/jenkins/jenkins-slave/maven-agent.jar:/home/jenkins/jenkins-slave/classworlds.jar
hudson.maven.agent.Main /home/hudson/tools/maven/apache-maven-2.2.1 /home/jenkins/jenkins-slave/slave.jar
/home/jenkins/jenkins-slave/maven-interceptor.jar 42164 /home/jenkins/jenkins-slave/maven2.1-interceptor.jar
<===[JENKINS REMOTING CAPACITY]===>channel started
   log4j:WARN No appenders could be found for logger (org.apache.commons.beanutils.converters.BooleanConverter).
log4j:WARN Please initialize the log4j system properly.
[INFO] Scanning for projects...
Executing Maven:  -B -f <https://builds.apache.org/job/OpenJPA-trunk-deploy/ws/trunk/pom.xml>
-Dmaven.repo.local=/home/jenkins/jenkins-slave/maven-repositories/1 clean deploy
[INFO] Reactor build order: 
[INFO]   OpenJPA Parent POM
[INFO]   OpenJPA Utilities Library
[INFO]   OpenJPA Kernel
[INFO]   OpenJPA JDBC
[INFO]   OpenJPA Persistence
[INFO]   OpenJPA Persistence JDBC
[INFO]   OpenJPA Persistence Locking Tests
[INFO]   OpenJPA tools
[INFO]   OpenJPA Maven Plugin
[INFO]   OpenJPA XML Store
[INFO]   OpenJPA Slice
[INFO]   OpenJPA JEST
[INFO]   OpenJPA Aggregate Jar
[INFO]   OpenJPA Aggregate Jar with Dependencies
[INFO]   OpenJPA Project Docs and Assemblies
[INFO]   OpenJPA Examples
[INFO]   OpenJPA Examples - Simple
[INFO]   OpenJPA Examples - image-gallery
[INFO]   OpenJPA Examples - OpenBooks
[INFO]   OpenJPA Integration Tests
[INFO]   OpenJPA Integration Tests - Daytrader
[INFO]   OpenJPA Integration Tests - Examples
[INFO]   OpenJPA Integration Tests - SLF4JLogFactory
[INFO]   OpenJPA Integration Tests - JPA TCK
[INFO]   OpenJPA Integration Tests - Bean Validation
[INFO]   OpenJPA Integration Tests - JMX Platform MBeans
[INFO]   OpenJPA Fetching Statistic Tool
[INFO]   OpenJPA Fetching Statistic Tool -- WAS Bundle
[INFO] ------------------------------------------------------------------------
[INFO] Building OpenJPA Parent POM
[INFO]    task-segment: [clean, deploy]
[INFO] ------------------------------------------------------------------------
[INFO] [clean:clean {execution: default-clean}]
[INFO] Deleting file set: <https://builds.apache.org/job/OpenJPA-trunk-deploy/ws/trunk/target>
(included: [**], excluded: [])
[INFO] [buildnumber:create {execution: default}]
[INFO] Checking for local modifications: skipped.
[INFO] Updating project files from SCM: skipped.
[INFO] Executing: /bin/sh -c cd <https://builds.apache.org/job/OpenJPA-trunk-deploy/ws/trunk>
&& svn --non-interactive info
[INFO] Working directory: <https://builds.apache.org/job/OpenJPA-trunk-deploy/ws/trunk>
[INFO] Storing buildNumber: 1551449 at timestamp: January 2, 2014 at 10:52 AM
[INFO] Executing: /bin/sh -c cd <https://builds.apache.org/job/OpenJPA-trunk-deploy/ws/trunk>
&& svn --non-interactive info
[INFO] Working directory: <https://builds.apache.org/job/OpenJPA-trunk-deploy/ws/trunk>
[INFO] Storing buildScmBranch: trunk
[INFO] [enforcer:enforce {execution: default}]
Setting property: classpath.resource.loader.class => 'org.codehaus.plexus.velocity.ContextClassLoaderResourceLoader'.
Setting property: site.resource.loader.class => 'org.codehaus.plexus.velocity.SiteResourceLoader'.
Setting property: velocimacro.messages.on => 'false'.
Setting property: resource.loader => 'classpath,site'.
Setting property: runtime.log.invalid.references => 'false'.
Setting property: resource.manager.logwhenfound => 'false'.
Setting property: classpath.resource.loader.class => 'org.codehaus.plexus.velocity.ContextClassLoaderResourceLoader'.
Setting property: site.resource.loader.class => 'org.codehaus.plexus.velocity.SiteResourceLoader'.
Setting property: velocimacro.messages.on => 'false'.
Setting property: resource.loader => 'classpath,site'.
Setting property: runtime.log.invalid.references => 'false'.
Setting property: resource.manager.logwhenfound => 'false'.
Setting property: velocimacro.permissions.allow.inline.to.replace.global => 'true'.
[INFO] [checkstyle:checkstyle {execution: default}]
[INFO] Setting property: classpath.resource.loader.class => 'org.codehaus.plexus.velocity.ContextClassLoaderResourceLoader'.
[INFO] Setting property: velocimacro.messages.on => 'false'.
[INFO] Setting property: resource.loader => 'classpath'.
[INFO] Setting property: resource.manager.logwhenfound => 'false'.
[INFO] [remote-resources:process {execution: default}]
[INFO] [compiler:testCompile {execution: test-source-compile}]
[INFO] No sources to compile
[INFO] [site:attach-descriptor {execution: default-attach-descriptor}]
[INFO] Unable to load parent project from a relative path: Could not find the model file '<https://builds.apache.org/job/OpenJPA-trunk-deploy/ws/pom.xml'.>
for project unknown
[INFO] Parent project loaded from repository.
[INFO] [ianal:verify-legal-files {execution: default}]
[INFO] [apache-rat:check {execution: default}]
[INFO] Exclude: **/.*/**
[INFO] Exclude: **/target/**/*
[INFO] [install:install {execution: default-install}]
[INFO] Installing <https://builds.apache.org/job/OpenJPA-trunk-deploy/ws/trunk/pom.xml>
to /home/jenkins/jenkins-slave/maven-repositories/1/org/apache/openjpa/openjpa-parent/2.4.0-SNAPSHOT/openjpa-parent-2.4.0-SNAPSHOT.pom
[INFO] [deploy:deploy {execution: default-deploy}]
[INFO] Retrieving previous build number from apache.snapshots.https
[WARNING] *** CHECKSUM FAILED - Checksum failed on download: local = '3996fbe51574d14330ba0be229428c27b8dc1b7e';
remote = '2292d9549112f6083d4c9fdf3cba3cb9abd926c9' - RETRYING
[WARNING] *** CHECKSUM FAILED - Checksum failed on download: local = '3996fbe51574d14330ba0be229428c27b8dc1b7e';
remote = '2292d9549112f6083d4c9fdf3cba3cb9abd926c9' - IGNORING
Uploading: https://repository.apache.org/content/repositories/snapshots/org/apache/openjpa/openjpa-parent/2.4.0-SNAPSHOT/openjpa-parent-2.4.0-20140102.105323-11.pom
52K uploaded  (openjpa-parent-2.4.0-20140102.105323-11.pom)
[INFO] Uploading site descriptor for openjpa-parent 2.4.0-20140102.105323-11 site.xml
[INFO] Retrieving previous metadata from apache.snapshots.https
[INFO] Uploading repository metadata for: 'artifact org.apache.openjpa:openjpa-parent'
[INFO] Retrieving previous metadata from apache.snapshots.https
[WARNING] *** CHECKSUM FAILED - Checksum failed on download: local = '3996fbe51574d14330ba0be229428c27b8dc1b7e';
remote = '2292d9549112f6083d4c9fdf3cba3cb9abd926c9' - RETRYING
[WARNING] *** CHECKSUM FAILED - Checksum failed on download: local = '3996fbe51574d14330ba0be229428c27b8dc1b7e';
remote = '2292d9549112f6083d4c9fdf3cba3cb9abd926c9' - IGNORING
[INFO] Uploading repository metadata for: 'snapshot org.apache.openjpa:openjpa-parent:2.4.0-SNAPSHOT'
[INFO] ------------------------------------------------------------------------
[INFO] Building OpenJPA Utilities Library
[INFO]    task-segment: [clean, deploy]
[INFO] ------------------------------------------------------------------------
[INFO] [clean:clean {execution: default-clean}]
[INFO] Deleting file set: <https://builds.apache.org/job/OpenJPA-trunk-deploy/ws/trunk/openjpa-lib/target>
(included: [**], excluded: [])
[INFO] [buildnumber:create {execution: default}]
[INFO] [enforcer:enforce {execution: default}]
[INFO] [checkstyle:checkstyle {execution: default}]
[INFO] Starting audit...
Audit done.

[WARNING] Unable to locate Source XRef to link to - DISABLED
[ERROR] VM #image: error : too few arguments to macro. Wanted 5 got 0
[ERROR] VM #image: error : too few arguments to macro. Wanted 5 got 0
[ERROR] VM #displayTree: error : too few arguments to macro. Wanted 2 got 0
[ERROR] VM #menuItem: error : too few arguments to macro. Wanted 1 got 0
[INFO] [remote-resources:process {execution: default}]
[INFO] [resources:resources {execution: default-resources}]
[INFO] Using 'UTF-8' encoding to copy filtered resources.
[INFO] Copying 9 resources
[INFO] Copying 3 resources
[INFO] [compiler:compile {execution: default-compile}]
[INFO] Compiling 161 source files to <https://builds.apache.org/job/OpenJPA-trunk-deploy/ws/trunk/openjpa-lib/target/classes>
[INFO] -------------------------------------------------------------
[ERROR] COMPILATION ERROR : 
[INFO] -------------------------------------------------------------
[ERROR] Failure executing javac, but could not parse the error:
javac: invalid target release: 1.7
Usage: javac <options> <source files>
use -help for a list of possible options

[INFO] 1 error
[INFO] -------------------------------------------------------------
[INFO] ------------------------------------------------------------------------
[ERROR] BUILD FAILURE
[INFO] ------------------------------------------------------------------------
[INFO] Compilation failure
Failure executing javac, but could not parse the error:
javac: invalid target release: 1.7
Usage: javac <options> <source files>
use -help for a list of possible options


[INFO] ------------------------------------------------------------------------
[INFO] For more information, run Maven with the -e switch
[INFO] ------------------------------------------------------------------------
[INFO] Total time: 1 minute 36 seconds
[INFO] Finished at: Thu Jan 02 10:53:37 UTC 2014
[INFO] Final Memory: 63M/487M
[INFO] ------------------------------------------------------------------------
[JENKINS] Archiving <https://builds.apache.org/job/OpenJPA-trunk-deploy/ws/trunk/openjpa-lib/pom.xml>
to org.apache.openjpa/openjpa-lib/2.4.0-SNAPSHOT/openjpa-lib-2.4.0-SNAPSHOT.pom
[JENKINS] Archiving <https://builds.apache.org/job/OpenJPA-trunk-deploy/ws/trunk/pom.xml>
to org.apache.openjpa/openjpa-parent/2.4.0-SNAPSHOT/openjpa-parent-2.4.0-SNAPSHOT.pom
[JENKINS] Archiving /home/jenkins/jenkins-slave/maven-repositories/1/org/apache/openjpa/openjpa-parent/2.4.0-SNAPSHOT/openjpa-parent-2.4.0-SNAPSHOT.pom
to org.apache.openjpa/openjpa-parent/2.4.0-20140102.105323-11/openjpa-parent-2.4.0-20140102.105323-11.pom
/home/jenkins/jenkins-slave/maven-repositories/1/org/apache/openjpa/openjpa-parent/2.4.0-SNAPSHOT/openjpa-parent-2.4.0-SNAPSHOT.pom
is not inside <https://builds.apache.org/job/OpenJPA-trunk-deploy/ws/trunk/;> will archive
in a separate pass
Sending e-mails to: commits@openjpa.apache.org
channel stopped

Mime
View raw message