openjpa-commits mailing list archives

Site index · List index
Message view « Date » · « Thread »
Top « Date » · « Thread »
From Apache Jenkins Server <jenk...@builds.apache.org>
Subject Build failed in Jenkins: OpenJPA-trunk-deploy #348
Date Wed, 12 Dec 2012 06:50:41 GMT
See <https://builds.apache.org/job/OpenJPA-trunk-deploy/348/changes>

Changes:

[ppoddar] OPENJPA-2305: Change inheritance hierarchy of generated canonical metamodel

[ppoddar] OPENJPA-2304: Protect the expressin list for concurrent access

------------------------------------------
[...truncated 463 lines...]
Results :

Tests run: 21, Failures: 0, Errors: 0, Skipped: 0

[JENKINS] Recording test results
[INFO] [jar:jar {execution: default-jar}]
[INFO] Building jar: <https://builds.apache.org/job/OpenJPA-trunk-deploy/ws/trunk/openjpa-jdbc/target/openjpa-jdbc-2.3.0-SNAPSHOT.jar>
[INFO] [jar:jar {execution: default-jar}]
[INFO] [jar:test-jar {execution: attach-tests}]
[INFO] Building jar: <https://builds.apache.org/job/OpenJPA-trunk-deploy/ws/trunk/openjpa-jdbc/target/openjpa-jdbc-2.3.0-SNAPSHOT-tests.jar>
[INFO] [ianal:verify-legal-files {execution: default}]
[INFO] Checking legal files in: openjpa-jdbc-2.3.0-SNAPSHOT.jar
[INFO] Checking legal files in: openjpa-jdbc-2.3.0-SNAPSHOT-tests.jar
[INFO] [apache-rat:check {execution: default}]
[INFO] Exclude: **/.*/**
[INFO] Exclude: **/target/**/*
[INFO] [install:install {execution: default-install}]
[INFO] Installing <https://builds.apache.org/job/OpenJPA-trunk-deploy/ws/trunk/openjpa-jdbc/target/openjpa-jdbc-2.3.0-SNAPSHOT.jar>
to /home/hudson/hudson-slave/maven-repositories/1/org/apache/openjpa/openjpa-jdbc/2.3.0-SNAPSHOT/openjpa-jdbc-2.3.0-SNAPSHOT.jar
[INFO] Installing <https://builds.apache.org/job/OpenJPA-trunk-deploy/ws/trunk/openjpa-jdbc/target/openjpa-jdbc-2.3.0-SNAPSHOT-tests.jar>
to /home/hudson/hudson-slave/maven-repositories/1/org/apache/openjpa/openjpa-jdbc/2.3.0-SNAPSHOT/openjpa-jdbc-2.3.0-SNAPSHOT-tests.jar
[INFO] [deploy:deploy {execution: default-deploy}]
[INFO] Retrieving previous build number from apache.snapshots.https
[WARNING] *** CHECKSUM FAILED - Checksum failed on download: local = 'e3bbc288ae24d33c27b3418d8fb040998d195fd0';
remote = '041ab3acb56120a3c2294e3966ffbb60981ec232' - RETRYING
[WARNING] *** CHECKSUM FAILED - Checksum failed on download: local = 'e3bbc288ae24d33c27b3418d8fb040998d195fd0';
remote = '041ab3acb56120a3c2294e3966ffbb60981ec232' - IGNORING
Uploading: https://repository.apache.org/content/repositories/snapshots/org/apache/openjpa/openjpa-jdbc/2.3.0-SNAPSHOT/openjpa-jdbc-2.3.0-20121212.064817-99.jar
1387K uploaded  (openjpa-jdbc-2.3.0-20121212.064817-99.jar)
[INFO] Uploading project information for openjpa-jdbc 2.3.0-20121212.064817-99
[INFO] Retrieving previous metadata from apache.snapshots.https
[INFO] Uploading repository metadata for: 'artifact org.apache.openjpa:openjpa-jdbc'
[INFO] Retrieving previous metadata from apache.snapshots.https
[WARNING] *** CHECKSUM FAILED - Checksum failed on download: local = 'e3bbc288ae24d33c27b3418d8fb040998d195fd0';
remote = '041ab3acb56120a3c2294e3966ffbb60981ec232' - RETRYING
[WARNING] *** CHECKSUM FAILED - Checksum failed on download: local = 'e3bbc288ae24d33c27b3418d8fb040998d195fd0';
remote = '041ab3acb56120a3c2294e3966ffbb60981ec232' - IGNORING
[INFO] Uploading repository metadata for: 'snapshot org.apache.openjpa:openjpa-jdbc:2.3.0-SNAPSHOT'
[INFO] Retrieving previous build number from apache.snapshots.https
Uploading: https://repository.apache.org/content/repositories/snapshots/org/apache/openjpa/openjpa-jdbc/2.3.0-SNAPSHOT/openjpa-jdbc-2.3.0-20121212.064817-99-tests.jar
41K uploaded  (openjpa-jdbc-2.3.0-20121212.064817-99-tests.jar)
[JENKINS] Archiving <https://builds.apache.org/job/OpenJPA-trunk-deploy/ws/trunk/openjpa-jdbc/pom.xml>
to /home/hudson/hudson/jobs/OpenJPA-trunk-deploy/modules/org.apache.openjpa$openjpa-jdbc/builds/2012-12-12_06-46-42/archive/org.apache.openjpa/openjpa-jdbc/2.3.0-SNAPSHOT/openjpa-jdbc-2.3.0-SNAPSHOT.pom
[JENKINS] Archiving <https://builds.apache.org/job/OpenJPA-trunk-deploy/ws/trunk/openjpa-jdbc/target/openjpa-jdbc-2.3.0-SNAPSHOT.jar>
to /home/hudson/hudson/jobs/OpenJPA-trunk-deploy/modules/org.apache.openjpa$openjpa-jdbc/builds/2012-12-12_06-46-42/archive/org.apache.openjpa/openjpa-jdbc/2.3.0-20121212.064817-99/openjpa-jdbc-2.3.0-20121212.064817-99.jar
[JENKINS] Archiving <https://builds.apache.org/job/OpenJPA-trunk-deploy/ws/trunk/openjpa-jdbc/target/openjpa-jdbc-2.3.0-SNAPSHOT-tests.jar>
to /home/hudson/hudson/jobs/OpenJPA-trunk-deploy/modules/org.apache.openjpa$openjpa-jdbc/builds/2012-12-12_06-46-42/archive/org.apache.openjpa/openjpa-jdbc/2.3.0-20121212.064817-99/openjpa-jdbc-2.3.0-20121212.064817-99-tests.jar
[INFO] ------------------------------------------------------------------------
[INFO] Building OpenJPA Persistence
[INFO]    task-segment: [clean, deploy]
[INFO] ------------------------------------------------------------------------
[INFO] [clean:clean {execution: default-clean}]
[INFO] Deleting file set: <https://builds.apache.org/job/OpenJPA-trunk-deploy/ws/trunk/openjpa-persistence/target>
(included: [**], excluded: [])
[INFO] [buildnumber:create {execution: default}]
[INFO] [enforcer:enforce {execution: default}]
[INFO] [checkstyle:checkstyle {execution: default}]
[INFO] Starting audit...
Audit done.

[WARNING] Unable to locate Source XRef to link to - DISABLED
[INFO] [remote-resources:process {execution: default}]
[INFO] [resources:resources {execution: default-resources}]
[INFO] Using 'UTF-8' encoding to copy filtered resources.
[INFO] Copying 14 resources
[INFO] Copying 3 resources
[INFO] [compiler:compile {execution: default-compile}]
[INFO] Compiling 233 source files to <https://builds.apache.org/job/OpenJPA-trunk-deploy/ws/trunk/openjpa-persistence/target/classes>
[INFO] [compiler:testCompile {execution: test-source-compile}]
[INFO] Compiling 2 source files to <https://builds.apache.org/job/OpenJPA-trunk-deploy/ws/trunk/openjpa-persistence/target/test-classes>
[INFO] [resources:testResources {execution: default-testResources}]
[INFO] Using 'UTF-8' encoding to copy filtered resources.
[INFO] Copying 3 resources
[INFO] Copying 3 resources
[INFO] [compiler:testCompile {execution: default-testCompile}]
[INFO] Nothing to compile - all classes are up to date
[WARNING] DEPRECATED [systemProperties]: Use systemPropertyVariables instead.
[INFO] [surefire:test {execution: default-test}]
[INFO] Surefire report directory: <https://builds.apache.org/job/OpenJPA-trunk-deploy/ws/trunk/openjpa-persistence/target/surefire-reports>

-------------------------------------------------------
 T E S T S
-------------------------------------------------------
Running org.apache.openjpa.persistence.TestEnumToKernelConstantMappings
Tests run: 7, Failures: 0, Errors: 0, Skipped: 0, Time elapsed: 0.032 sec
Running org.apache.openjpa.persistence.TestPersistenceProductDerivation
Tests run: 5, Failures: 0, Errors: 0, Skipped: 0, Time elapsed: 0.308 sec

Results :

Tests run: 12, Failures: 0, Errors: 0, Skipped: 0

[JENKINS] Recording test results
[INFO] [jar:jar {execution: default-jar}]
[INFO] Building jar: <https://builds.apache.org/job/OpenJPA-trunk-deploy/ws/trunk/openjpa-persistence/target/openjpa-persistence-2.3.0-SNAPSHOT.jar>
[INFO] [jar:jar {execution: default-jar}]
[INFO] [jar:test-jar {execution: attach-tests}]
[INFO] Building jar: <https://builds.apache.org/job/OpenJPA-trunk-deploy/ws/trunk/openjpa-persistence/target/openjpa-persistence-2.3.0-SNAPSHOT-tests.jar>
[INFO] [ianal:verify-legal-files {execution: default}]
[INFO] Checking legal files in: openjpa-persistence-2.3.0-SNAPSHOT.jar
[INFO] Checking legal files in: openjpa-persistence-2.3.0-SNAPSHOT-tests.jar
[INFO] [apache-rat:check {execution: default}]
[INFO] Exclude: **/.*/**
[INFO] Exclude: **/target/**/*
[INFO] [install:install {execution: default-install}]
[INFO] Installing <https://builds.apache.org/job/OpenJPA-trunk-deploy/ws/trunk/openjpa-persistence/target/openjpa-persistence-2.3.0-SNAPSHOT.jar>
to /home/hudson/hudson-slave/maven-repositories/1/org/apache/openjpa/openjpa-persistence/2.3.0-SNAPSHOT/openjpa-persistence-2.3.0-SNAPSHOT.jar
[INFO] Installing <https://builds.apache.org/job/OpenJPA-trunk-deploy/ws/trunk/openjpa-persistence/target/openjpa-persistence-2.3.0-SNAPSHOT-tests.jar>
to /home/hudson/hudson-slave/maven-repositories/1/org/apache/openjpa/openjpa-persistence/2.3.0-SNAPSHOT/openjpa-persistence-2.3.0-SNAPSHOT-tests.jar
[INFO] [deploy:deploy {execution: default-deploy}]
[INFO] Retrieving previous build number from apache.snapshots.https
[WARNING] *** CHECKSUM FAILED - Checksum failed on download: local = 'e98cbee0f56874980b766e23d29a98251aadbb4d';
remote = 'ddb5967ae26f08924bdad2c2d8c8e5a42a8053a8' - RETRYING
[WARNING] *** CHECKSUM FAILED - Checksum failed on download: local = 'e98cbee0f56874980b766e23d29a98251aadbb4d';
remote = 'ddb5967ae26f08924bdad2c2d8c8e5a42a8053a8' - IGNORING
Uploading: https://repository.apache.org/content/repositories/snapshots/org/apache/openjpa/openjpa-persistence/2.3.0-SNAPSHOT/openjpa-persistence-2.3.0-20121212.064817-99.jar
809K uploaded  (openjpa-persistence-2.3.0-20121212.064817-99.jar)
[INFO] Uploading project information for openjpa-persistence 2.3.0-20121212.064817-99
[INFO] Retrieving previous metadata from apache.snapshots.https
[WARNING] *** CHECKSUM FAILED - Checksum failed on download: local = 'e98cbee0f56874980b766e23d29a98251aadbb4d';
remote = 'ddb5967ae26f08924bdad2c2d8c8e5a42a8053a8' - RETRYING
[WARNING] *** CHECKSUM FAILED - Checksum failed on download: local = 'e98cbee0f56874980b766e23d29a98251aadbb4d';
remote = 'ddb5967ae26f08924bdad2c2d8c8e5a42a8053a8' - IGNORING
[INFO] Uploading repository metadata for: 'snapshot org.apache.openjpa:openjpa-persistence:2.3.0-SNAPSHOT'
[INFO] Retrieving previous metadata from apache.snapshots.https
[INFO] Uploading repository metadata for: 'artifact org.apache.openjpa:openjpa-persistence'
[INFO] Retrieving previous build number from apache.snapshots.https
Uploading: https://repository.apache.org/content/repositories/snapshots/org/apache/openjpa/openjpa-persistence/2.3.0-SNAPSHOT/openjpa-persistence-2.3.0-20121212.064817-99-tests.jar
29K uploaded  (openjpa-persistence-2.3.0-20121212.064817-99-tests.jar)
[JENKINS] Archiving <https://builds.apache.org/job/OpenJPA-trunk-deploy/ws/trunk/openjpa-persistence/pom.xml>
to /home/hudson/hudson/jobs/OpenJPA-trunk-deploy/modules/org.apache.openjpa$openjpa-persistence/builds/2012-12-12_06-46-42/archive/org.apache.openjpa/openjpa-persistence/2.3.0-SNAPSHOT/openjpa-persistence-2.3.0-SNAPSHOT.pom
[JENKINS] Archiving <https://builds.apache.org/job/OpenJPA-trunk-deploy/ws/trunk/openjpa-persistence/target/openjpa-persistence-2.3.0-SNAPSHOT.jar>
to /home/hudson/hudson/jobs/OpenJPA-trunk-deploy/modules/org.apache.openjpa$openjpa-persistence/builds/2012-12-12_06-46-42/archive/org.apache.openjpa/openjpa-persistence/2.3.0-20121212.064817-99/openjpa-persistence-2.3.0-20121212.064817-99.jar
[JENKINS] Archiving <https://builds.apache.org/job/OpenJPA-trunk-deploy/ws/trunk/openjpa-persistence/target/openjpa-persistence-2.3.0-SNAPSHOT-tests.jar>
to /home/hudson/hudson/jobs/OpenJPA-trunk-deploy/modules/org.apache.openjpa$openjpa-persistence/builds/2012-12-12_06-46-42/archive/org.apache.openjpa/openjpa-persistence/2.3.0-20121212.064817-99/openjpa-persistence-2.3.0-20121212.064817-99-tests.jar
[INFO] ------------------------------------------------------------------------
[INFO] Building OpenJPA Persistence JDBC
[INFO]    task-segment: [clean, deploy]
[INFO] ------------------------------------------------------------------------
[INFO] [clean:clean {execution: default-clean}]
[INFO] Deleting file set: <https://builds.apache.org/job/OpenJPA-trunk-deploy/ws/trunk/openjpa-persistence-jdbc/target>
(included: [**], excluded: [])
[INFO] [buildnumber:create {execution: default}]
[INFO] [enforcer:enforce {execution: default}]
[INFO] [checkstyle:checkstyle {execution: default}]
[INFO] Starting audit...
Audit done.

[WARNING] Unable to locate Source XRef to link to - DISABLED
[INFO] [remote-resources:process {execution: default}]
[INFO] [resources:resources {execution: default-resources}]
[INFO] Using 'UTF-8' encoding to copy filtered resources.
[INFO] Copying 2 resources
[INFO] Copying 3 resources
[INFO] [compiler:compile {execution: default-compile}]
[INFO] Compiling 65 source files to <https://builds.apache.org/job/OpenJPA-trunk-deploy/ws/trunk/openjpa-persistence-jdbc/target/classes>
[INFO] [compiler:testCompile {execution: test-source-compile}]
[INFO] Compiling 2702 source files to <https://builds.apache.org/job/OpenJPA-trunk-deploy/ws/trunk/openjpa-persistence-jdbc/target/test-classes>
[INFO] [resources:testResources {execution: default-testResources}]
[INFO] Using 'UTF-8' encoding to copy filtered resources.
[INFO] Copying 105 resources
[INFO] Copying 3 resources
[INFO] [compiler:testCompile {execution: default-testCompile}]
[INFO] Nothing to compile - all classes are up to date
[INFO] [antrun:run {execution: default}]
[INFO] Executing tasks

enhance:

enhance.all.entities:
     [echo]  running enhancer
org.apache.commons.lang.exception.NestableRuntimeException: Error extracting class information
from "<https://builds.apache.org/job/OpenJPA-trunk-deploy/ws/trunk/openjpa-persistence-jdbc/target/test-classes/org/apache/openjpa/persistence/distinctjoin/Lecturer.class".>
	at org.apache.openjpa.lib.meta.ClassArgParser.parseTypeNames(ClassArgParser.java:226)
	at org.apache.openjpa.lib.meta.ClassArgParser.parseTypes(ClassArgParser.java:161)
	at org.apache.openjpa.enhance.PCEnhancer.run(PCEnhancer.java:4864)
	at org.apache.openjpa.ant.PCEnhancerTask.executeOn(PCEnhancerTask.java:89)
	at org.apache.openjpa.lib.ant.AbstractTask.execute(AbstractTask.java:184)
	at org.apache.tools.ant.UnknownElement.execute(UnknownElement.java:288)
	at sun.reflect.GeneratedMethodAccessor26.invoke(Unknown Source)
	at sun.reflect.DelegatingMethodAccessorImpl.invoke(DelegatingMethodAccessorImpl.java:25)
	at java.lang.reflect.Method.invoke(Method.java:597)
	at org.apache.tools.ant.dispatch.DispatchUtils.execute(DispatchUtils.java:106)
	at org.apache.tools.ant.Task.perform(Task.java:348)
	at org.apache.tools.ant.Target.execute(Target.java:357)
	at org.apache.tools.ant.Target.performTasks(Target.java:385)
	at org.apache.tools.ant.Project.executeSortedTargets(Project.java:1337)
	at org.apache.tools.ant.helper.SingleCheckExecutor.executeTargets(SingleCheckExecutor.java:38)
	at org.apache.tools.ant.Project.executeTargets(Project.java:1189)
	at org.apache.tools.ant.taskdefs.Ant.execute(Ant.java:416)
	at org.apache.tools.ant.taskdefs.CallTarget.execute(CallTarget.java:105)
	at org.apache.tools.ant.UnknownElement.execute(UnknownElement.java:288)
	at sun.reflect.GeneratedMethodAccessor26.invoke(Unknown Source)
	at sun.reflect.DelegatingMethodAccessorImpl.invoke(DelegatingMethodAccessorImpl.java:25)
	at java.lang.reflect.Method.invoke(Method.java:597)
	at org.apache.tools.ant.dispatch.DispatchUtils.execute(DispatchUtils.java:106)
	at org.apache.tools.ant.Task.perform(Task.java:348)
	at org.apache.tools.ant.Target.execute(Target.java:357)
	at org.apache.tools.ant.Target.performTasks(Target.java:385)
	at org.apache.tools.ant.Project.executeSortedTargets(Project.java:1337)
	at org.apache.tools.ant.helper.SingleCheckExecutor.executeTargets(SingleCheckExecutor.java:38)
	at org.apache.tools.ant.Project.executeTargets(Project.java:1189)
	at org.apache.tools.ant.taskdefs.Ant.execute(Ant.java:416)
	at org.apache.tools.ant.UnknownElement.execute(UnknownElement.java:288)
	at sun.reflect.GeneratedMethodAccessor26.invoke(Unknown Source)
	at sun.reflect.DelegatingMethodAccessorImpl.invoke(DelegatingMethodAccessorImpl.java:25)
	at java.lang.reflect.Method.invoke(Method.java:597)
	at org.apache.tools.ant.dispatch.DispatchUtils.execute(DispatchUtils.java:106)
	at org.apache.tools.ant.Task.perform(Task.java:348)
	at org.apache.tools.ant.Target.execute(Target.java:357)
	at org.apache.maven.plugin.antrun.AbstractAntMojo.executeTasks(AbstractAntMojo.java:118)
	at org.apache.maven.plugin.antrun.AntRunMojo.execute(AntRunMojo.java:98)
	at org.apache.maven.plugin.DefaultPluginManager.executeMojo(DefaultPluginManager.java:490)
	at hudson.maven.agent.PluginManagerInterceptor.executeMojo(PluginManagerInterceptor.java:182)
	at org.apache.maven.lifecycle.DefaultLifecycleExecutor.executeGoals(DefaultLifecycleExecutor.java:694)
	at org.apache.maven.lifecycle.DefaultLifecycleExecutor.executeGoalWithLifecycle(DefaultLifecycleExecutor.java:556)
	at org.apache.maven.lifecycle.DefaultLifecycleExecutor.executeGoal(DefaultLifecycleExecutor.java:535)
	at org.apache.maven.lifecycle.DefaultLifecycleExecutor.executeGoalAndHandleFailures(DefaultLifecycleExecutor.java:387)
	at org.apache.maven.lifecycle.DefaultLifecycleExecutor.executeTaskSegments(DefaultLifecycleExecutor.java:348)
	at org.apache.maven.lifecycle.DefaultLifecycleExecutor.execute(DefaultLifecycleExecutor.java:180)
	at org.apache.maven.lifecycle.LifecycleExecutorInterceptor.execute(LifecycleExecutorInterceptor.java:65)
	at org.apache.maven.DefaultMaven.doExecute(DefaultMaven.java:328)
	at org.apache.maven.DefaultMaven.execute(DefaultMaven.java:138)
	at org.apache.maven.cli.MavenCli.main(MavenCli.java:362)
	at sun.reflect.NativeMethodAccessorImpl.invoke0(Native Method)
	at sun.reflect.NativeMethodAccessorImpl.invoke(NativeMethodAccessorImpl.java:39)
	at sun.reflect.DelegatingMethodAccessorImpl.invoke(DelegatingMethodAccessorImpl.java:25)
	at java.lang.reflect.Method.invoke(Method.java:597)
	at org.codehaus.classworlds.Launcher.launchEnhanced(Launcher.java:315)
	at org.codehaus.classworlds.Launcher.launch(Launcher.java:255)
	at hudson.maven.agent.Main.launch(Main.java:185)
	at hudson.maven.MavenBuilder.call(MavenBuilder.java:151)
	at hudson.maven.Maven2Builder.call(Maven2Builder.java:77)
	at hudson.maven.Maven2Builder.call(Maven2Builder.java:53)
	at hudson.remoting.UserRequest.perform(UserRequest.java:118)
	at hudson.remoting.UserRequest.perform(UserRequest.java:48)
	at hudson.remoting.Request$2.run(Request.java:326)
	at hudson.remoting.InterceptingExecutorService$1.call(InterceptingExecutorService.java:72)
	at java.util.concurrent.FutureTask$Sync.innerRun(FutureTask.java:303)
	at java.util.concurrent.FutureTask.run(FutureTask.java:138)
	at java.util.concurrent.ThreadPoolExecutor$Worker.runTask(ThreadPoolExecutor.java:886)
	at java.util.concurrent.ThreadPoolExecutor$Worker.run(ThreadPoolExecutor.java:908)
	at java.lang.Thread.run(Thread.java:662)
Caused by: java.io.FileNotFoundException: <https://builds.apache.org/job/OpenJPA-trunk-deploy/ws/trunk/openjpa-persistence-jdbc/target/test-classes/org/apache/openjpa/persistence/distinctjoin/Lecturer.class>
(Too many open files)
	at java.io.FileInputStream.open(Native Method)
	at java.io.FileInputStream.<init>(FileInputStream.java:120)
	at org.apache.openjpa.lib.util.J2DoPrivHelper$30.run(J2DoPrivHelper.java:710)
	at org.apache.openjpa.lib.util.J2DoPrivHelper$30.run(J2DoPrivHelper.java:708)
	at java.security.AccessController.doPrivileged(Native Method)
	at org.apache.openjpa.lib.meta.ClassArgParser.getFromClassFile(ClassArgParser.java:306)
	at org.apache.openjpa.lib.meta.ClassArgParser.parseTypeNames(ClassArgParser.java:217)
	... 69 more
[JENKINS] Archiving <https://builds.apache.org/job/OpenJPA-trunk-deploy/ws/trunk/openjpa-persistence-jdbc/pom.xml>
to /home/hudson/hudson/jobs/OpenJPA-trunk-deploy/modules/org.apache.openjpa$openjpa-persistence-jdbc/builds/2012-12-12_06-46-42/archive/org.apache.openjpa/openjpa-persistence-jdbc/2.3.0-SNAPSHOT/openjpa-persistence-jdbc-2.3.0-SNAPSHOT.pom
[INFO] ------------------------------------------------------------------------
[ERROR] BUILD ERROR
[INFO] ------------------------------------------------------------------------
[INFO] An Ant BuildException has occured: The following error occurred while executing this
line:
<https://builds.apache.org/job/OpenJPA-trunk-deploy/ws/trunk/openjpa-persistence-jdbc/src/main/ant/enhancer.xml>:51:
The following error occurred while executing this line:
<https://builds.apache.org/job/OpenJPA-trunk-deploy/ws/trunk/openjpa-persistence-jdbc/src/main/ant/enhancer.xml>:89:
org.apache.commons.lang.exception.NestableRuntimeException: Error extracting class information
from "<https://builds.apache.org/job/OpenJPA-trunk-deploy/ws/trunk/openjpa-persistence-jdbc/target/test-classes/org/apache/openjpa/persistence/distinctjoin/Lecturer.class".>

<https://builds.apache.org/job/OpenJPA-trunk-deploy/ws/trunk/openjpa-persistence-jdbc/target/test-classes/org/apache/openjpa/persistence/distinctjoin/Lecturer.class>
(Too many open files)
[INFO] ------------------------------------------------------------------------
[INFO] For more information, run Maven with the -e switch
[INFO] ------------------------------------------------------------------------
[INFO] Total time: 3 minutes 20 seconds
[INFO] Finished at: Wed Dec 12 06:50:38 UTC 2012
[INFO] Final Memory: 115M/592M
[INFO] ------------------------------------------------------------------------
Sending e-mails to: commits@openjpa.apache.org
channel stopped

Mime
View raw message