openjpa-commits mailing list archives

Site index · List index
Message view « Date » · « Thread »
Top « Date » · « Thread »
From Apache Jenkins Server <jenk...@builds.apache.org>
Subject Build failed in Jenkins: OpenJPA-trunk #513
Date Tue, 02 Aug 2011 15:44:07 GMT
See <https://builds.apache.org/job/OpenJPA-trunk/513/changes>

Changes:

[curtisr7] OPENJPA-2029: Add additional tests for query named to positional parameter conversion.
Patch contributed by Jacob Nowosatka.

------------------------------------------
[...truncated 289 lines...]
org.apache.openjpa.util.java$util$Hashtable$proxy
org.apache.openjpa.util.java$util$LinkedList$proxy
org.apache.openjpa.util.java$util$Properties$proxy
org.apache.openjpa.util.java$util$TreeMap$proxy
org.apache.openjpa.util.java$util$TreeSet$proxy
org.apache.openjpa.util.java$util$Vector$proxy
org.apache.openjpa.util.java$util$EnumMap$proxy
org.apache.openjpa.util.java$util$IdentityHashMap$proxy
org.apache.openjpa.util.java$util$LinkedHashMap$proxy
org.apache.openjpa.util.java$util$LinkedHashSet$proxy
org.apache.openjpa.util.java$util$PriorityQueue$proxy
[INFO] Executed tasks
[INFO] [resources:testResources {execution: default-testResources}]
[INFO] Using 'UTF-8' encoding to copy filtered resources.
[INFO] skip non existing resourceDirectory <https://builds.apache.org/job/OpenJPA-trunk/ws/trunk/openjpa-kernel/src/test/resources>
[INFO] Copying 3 resources
[INFO] [compiler:testCompile {execution: default-testCompile}]
[INFO] Compiling 11 source files to <https://builds.apache.org/job/OpenJPA-trunk/ws/trunk/openjpa-kernel/target/test-classes>
[WARNING] DEPRECATED [systemProperties]: Use systemPropertyVariables instead.
[INFO] [surefire:test {execution: default-test}]
[INFO] Surefire report directory: <https://builds.apache.org/job/OpenJPA-trunk/ws/trunk/openjpa-kernel/target/surefire-reports>

-------------------------------------------------------
 T E S T S
-------------------------------------------------------
Running org.apache.openjpa.meta.TestMemberProvider
Tests run: 2, Failures: 0, Errors: 0, Skipped: 0, Time elapsed: 0.046 sec
Running org.apache.openjpa.meta.TestJavaTypes
Tests run: 1, Failures: 0, Errors: 0, Skipped: 0, Time elapsed: 0.02 sec
Running org.apache.openjpa.kernel.TestPCDataSerialization
Tests run: 1, Failures: 0, Errors: 0, Skipped: 0, Time elapsed: 0.192 sec
Running org.apache.openjpa.conf.TestSpecification
Tests run: 3, Failures: 0, Errors: 0, Skipped: 0, Time elapsed: 0.004 sec
Running org.apache.openjpa.enhance.TestPCSubclassNameConversion
Tests run: 1, Failures: 0, Errors: 0, Skipped: 0, Time elapsed: 0.018 sec
Running org.apache.openjpa.meta.TestAccessCode
Tests run: 8, Failures: 0, Errors: 0, Skipped: 0, Time elapsed: 0.01 sec
Running org.apache.openjpa.enhance.TestGetDeclaredMethod
Tests run: 3, Failures: 0, Errors: 0, Skipped: 0, Time elapsed: 0.012 sec
Running org.apache.openjpa.util.TestProxyManager
Tests run: 41, Failures: 0, Errors: 0, Skipped: 0, Time elapsed: 0.212 sec
Running org.apache.openjpa.ee.TestOSGiManagedRuntime
Tests run: 4, Failures: 0, Errors: 0, Skipped: 0, Time elapsed: 0.008 sec
Running org.apache.openjpa.util.TestResultShape
Tests run: 8, Failures: 0, Errors: 0, Skipped: 0, Time elapsed: 0.01 sec
Running org.apache.openjpa.ee.TestWASManagedRuntime
Tests run: 1, Failures: 0, Errors: 0, Skipped: 0, Time elapsed: 0.004 sec

Results :

Tests run: 73, Failures: 0, Errors: 0, Skipped: 0

[JENKINS] Recording test results
[INFO] [jar:jar {execution: default-jar}]
[INFO] Building jar: <https://builds.apache.org/job/OpenJPA-trunk/ws/trunk/openjpa-kernel/target/openjpa-kernel-2.2.0-SNAPSHOT.jar>
[INFO] [jar:jar {execution: default-jar}]
[INFO] [jar:test-jar {execution: attach-tests}]
[INFO] Building jar: <https://builds.apache.org/job/OpenJPA-trunk/ws/trunk/openjpa-kernel/target/openjpa-kernel-2.2.0-SNAPSHOT-tests.jar>
[INFO] [ianal:verify-legal-files {execution: default}]
[INFO] Checking legal files in: openjpa-kernel-2.2.0-SNAPSHOT.jar
[INFO] Checking legal files in: openjpa-kernel-2.2.0-SNAPSHOT-tests.jar
[INFO] [apache-rat:check {execution: default}]
[INFO] Exclude: **/.*/**
[INFO] Exclude: **/target/**/*
[INFO] [install:install {execution: default-install}]
[INFO] Installing <https://builds.apache.org/job/OpenJPA-trunk/ws/trunk/openjpa-kernel/target/openjpa-kernel-2.2.0-SNAPSHOT.jar>
to /home/hudson/.m2/repository/org/apache/openjpa/openjpa-kernel/2.2.0-SNAPSHOT/openjpa-kernel-2.2.0-SNAPSHOT.jar
[INFO] Installing <https://builds.apache.org/job/OpenJPA-trunk/ws/trunk/openjpa-kernel/target/openjpa-kernel-2.2.0-SNAPSHOT-tests.jar>
to /home/hudson/.m2/repository/org/apache/openjpa/openjpa-kernel/2.2.0-SNAPSHOT/openjpa-kernel-2.2.0-SNAPSHOT-tests.jar
[JENKINS] Archiving <https://builds.apache.org/job/OpenJPA-trunk/ws/trunk/openjpa-kernel/pom.xml>
to /home/hudson/hudson/jobs/OpenJPA-trunk/modules/org.apache.openjpa$openjpa-kernel/builds/2011-08-02_15-40-25/archive/org.apache.openjpa/openjpa-kernel/2.2.0-SNAPSHOT/openjpa-kernel-2.2.0-SNAPSHOT.pom
[JENKINS] Archiving <https://builds.apache.org/job/OpenJPA-trunk/ws/trunk/openjpa-kernel/target/openjpa-kernel-2.2.0-SNAPSHOT.jar>
to /home/hudson/hudson/jobs/OpenJPA-trunk/modules/org.apache.openjpa$openjpa-kernel/builds/2011-08-02_15-40-25/archive/org.apache.openjpa/openjpa-kernel/2.2.0-SNAPSHOT/openjpa-kernel-2.2.0-SNAPSHOT.jar
[JENKINS] Archiving <https://builds.apache.org/job/OpenJPA-trunk/ws/trunk/openjpa-kernel/target/openjpa-kernel-2.2.0-SNAPSHOT-tests.jar>
to /home/hudson/hudson/jobs/OpenJPA-trunk/modules/org.apache.openjpa$openjpa-kernel/builds/2011-08-02_15-40-25/archive/org.apache.openjpa/openjpa-kernel/2.2.0-SNAPSHOT/openjpa-kernel-2.2.0-SNAPSHOT-tests.jar
[INFO] ------------------------------------------------------------------------
[INFO] Building OpenJPA JDBC
[INFO]    task-segment: [clean, install]
[INFO] ------------------------------------------------------------------------
[INFO] [clean:clean {execution: default-clean}]
[INFO] Deleting file set: <https://builds.apache.org/job/OpenJPA-trunk/ws/trunk/openjpa-jdbc/target>
(included: [**], excluded: [])
[INFO] [buildnumber:create {execution: default}]
[INFO] [enforcer:enforce {execution: default}]
[INFO] [checkstyle:checkstyle {execution: default}]
[INFO] Starting audit...
Audit done.

[WARNING] Unable to locate Source XRef to link to - DISABLED
[INFO] [remote-resources:process {execution: default}]
[INFO] [resources:resources {execution: default-resources}]
[INFO] Using 'UTF-8' encoding to copy filtered resources.
[INFO] Copying 14 resources
[INFO] Copying 3 resources
[INFO] [compiler:compile {execution: default-compile}]
[INFO] Compiling 357 source files to <https://builds.apache.org/job/OpenJPA-trunk/ws/trunk/openjpa-jdbc/target/classes>
[INFO] [resources:testResources {execution: default-testResources}]
[INFO] Using 'UTF-8' encoding to copy filtered resources.
[INFO] skip non existing resourceDirectory <https://builds.apache.org/job/OpenJPA-trunk/ws/trunk/openjpa-jdbc/src/test/resources>
[INFO] Copying 3 resources
[INFO] [compiler:testCompile {execution: default-testCompile}]
[INFO] Compiling 7 source files to <https://builds.apache.org/job/OpenJPA-trunk/ws/trunk/openjpa-jdbc/target/test-classes>
[WARNING] DEPRECATED [systemProperties]: Use systemPropertyVariables instead.
[INFO] [surefire:test {execution: default-test}]
[INFO] Surefire report directory: <https://builds.apache.org/job/OpenJPA-trunk/ws/trunk/openjpa-jdbc/target/surefire-reports>

-------------------------------------------------------
 T E S T S
-------------------------------------------------------
Running org.apache.openjpa.jdbc.sql.identifier.TestDBIdentifiers
Tests run: 5, Failures: 0, Errors: 0, Skipped: 0, Time elapsed: 0.057 sec
Running org.apache.openjpa.jdbc.meta.TestMappingDefaultsImpl
9  INFO   [main] openjpa.jdbc.JDBC - Using dictionary class "org.apache.openjpa.jdbc.sql.OracleDictionary".
Tests run: 1, Failures: 0, Errors: 0, Skipped: 0, Time elapsed: 0.236 sec
Running org.apache.openjpa.jdbc.sql.TestDBDictionaryGeneratedSQL
Tests run: 3, Failures: 0, Errors: 0, Skipped: 0, Time elapsed: 0.182 sec
Running org.apache.openjpa.jdbc.sql.TestDB2Dictionary
Tests run: 5, Failures: 0, Errors: 0, Skipped: 0, Time elapsed: 0.583 sec
Running org.apache.openjpa.jdbc.sql.TestMySQLDictionary
Tests run: 3, Failures: 0, Errors: 0, Skipped: 0, Time elapsed: 0.094 sec
Running org.apache.openjpa.jdbc.kernel.TestUpdateManagerFlushException
Tests run: 1, Failures: 0, Errors: 0, Skipped: 0, Time elapsed: 0.006 sec
Running org.apache.openjpa.jdbc.sql.TestDictionaryFactory
Tests run: 1, Failures: 0, Errors: 0, Skipped: 0, Time elapsed: 0.005 sec

Results :

Tests run: 19, Failures: 0, Errors: 0, Skipped: 0

[JENKINS] Recording test results
[INFO] [jar:jar {execution: default-jar}]
[INFO] Building jar: <https://builds.apache.org/job/OpenJPA-trunk/ws/trunk/openjpa-jdbc/target/openjpa-jdbc-2.2.0-SNAPSHOT.jar>
[INFO] [jar:jar {execution: default-jar}]
[INFO] [jar:test-jar {execution: attach-tests}]
[INFO] Building jar: <https://builds.apache.org/job/OpenJPA-trunk/ws/trunk/openjpa-jdbc/target/openjpa-jdbc-2.2.0-SNAPSHOT-tests.jar>
[INFO] [ianal:verify-legal-files {execution: default}]
[INFO] Checking legal files in: openjpa-jdbc-2.2.0-SNAPSHOT.jar
[INFO] Checking legal files in: openjpa-jdbc-2.2.0-SNAPSHOT-tests.jar
[INFO] [apache-rat:check {execution: default}]
[INFO] Exclude: **/.*/**
[INFO] Exclude: **/target/**/*
[INFO] [install:install {execution: default-install}]
[INFO] Installing <https://builds.apache.org/job/OpenJPA-trunk/ws/trunk/openjpa-jdbc/target/openjpa-jdbc-2.2.0-SNAPSHOT.jar>
to /home/hudson/.m2/repository/org/apache/openjpa/openjpa-jdbc/2.2.0-SNAPSHOT/openjpa-jdbc-2.2.0-SNAPSHOT.jar
[INFO] Installing <https://builds.apache.org/job/OpenJPA-trunk/ws/trunk/openjpa-jdbc/target/openjpa-jdbc-2.2.0-SNAPSHOT-tests.jar>
to /home/hudson/.m2/repository/org/apache/openjpa/openjpa-jdbc/2.2.0-SNAPSHOT/openjpa-jdbc-2.2.0-SNAPSHOT-tests.jar
[JENKINS] Archiving <https://builds.apache.org/job/OpenJPA-trunk/ws/trunk/openjpa-jdbc/pom.xml>
to /home/hudson/hudson/jobs/OpenJPA-trunk/modules/org.apache.openjpa$openjpa-jdbc/builds/2011-08-02_15-40-25/archive/org.apache.openjpa/openjpa-jdbc/2.2.0-SNAPSHOT/openjpa-jdbc-2.2.0-SNAPSHOT.pom
[JENKINS] Archiving <https://builds.apache.org/job/OpenJPA-trunk/ws/trunk/openjpa-jdbc/target/openjpa-jdbc-2.2.0-SNAPSHOT.jar>
to /home/hudson/hudson/jobs/OpenJPA-trunk/modules/org.apache.openjpa$openjpa-jdbc/builds/2011-08-02_15-40-25/archive/org.apache.openjpa/openjpa-jdbc/2.2.0-SNAPSHOT/openjpa-jdbc-2.2.0-SNAPSHOT.jar
[JENKINS] Archiving <https://builds.apache.org/job/OpenJPA-trunk/ws/trunk/openjpa-jdbc/target/openjpa-jdbc-2.2.0-SNAPSHOT-tests.jar>
to /home/hudson/hudson/jobs/OpenJPA-trunk/modules/org.apache.openjpa$openjpa-jdbc/builds/2011-08-02_15-40-25/archive/org.apache.openjpa/openjpa-jdbc/2.2.0-SNAPSHOT/openjpa-jdbc-2.2.0-SNAPSHOT-tests.jar
[INFO] ------------------------------------------------------------------------
[INFO] Building OpenJPA Persistence
[INFO]    task-segment: [clean, install]
[INFO] ------------------------------------------------------------------------
[INFO] [clean:clean {execution: default-clean}]
[INFO] Deleting file set: <https://builds.apache.org/job/OpenJPA-trunk/ws/trunk/openjpa-persistence/target>
(included: [**], excluded: [])
[INFO] [buildnumber:create {execution: default}]
[INFO] [enforcer:enforce {execution: default}]
[INFO] [checkstyle:checkstyle {execution: default}]
[INFO] Starting audit...
Audit done.

[WARNING] Unable to locate Source XRef to link to - DISABLED
[INFO] [remote-resources:process {execution: default}]
[INFO] [resources:resources {execution: default-resources}]
[INFO] Using 'UTF-8' encoding to copy filtered resources.
[INFO] Copying 11 resources
[INFO] Copying 3 resources
[INFO] [compiler:compile {execution: default-compile}]
[INFO] Compiling 232 source files to <https://builds.apache.org/job/OpenJPA-trunk/ws/trunk/openjpa-persistence/target/classes>
[INFO] [resources:testResources {execution: default-testResources}]
[INFO] Using 'UTF-8' encoding to copy filtered resources.
[INFO] Copying 3 resources
[INFO] Copying 3 resources
[INFO] [compiler:testCompile {execution: default-testCompile}]
[INFO] Compiling 2 source files to <https://builds.apache.org/job/OpenJPA-trunk/ws/trunk/openjpa-persistence/target/test-classes>
[WARNING] DEPRECATED [systemProperties]: Use systemPropertyVariables instead.
[INFO] [surefire:test {execution: default-test}]
[INFO] Surefire report directory: <https://builds.apache.org/job/OpenJPA-trunk/ws/trunk/openjpa-persistence/target/surefire-reports>

-------------------------------------------------------
 T E S T S
-------------------------------------------------------
Running org.apache.openjpa.persistence.TestEnumToKernelConstantMappings
Tests run: 7, Failures: 0, Errors: 0, Skipped: 0, Time elapsed: 0.037 sec
Running org.apache.openjpa.persistence.TestPersistenceProductDerivation
Tests run: 5, Failures: 0, Errors: 0, Skipped: 0, Time elapsed: 0.417 sec

Results :

Tests run: 12, Failures: 0, Errors: 0, Skipped: 0

[JENKINS] Recording test results
[INFO] [jar:jar {execution: default-jar}]
[INFO] Building jar: <https://builds.apache.org/job/OpenJPA-trunk/ws/trunk/openjpa-persistence/target/openjpa-persistence-2.2.0-SNAPSHOT.jar>
[INFO] [jar:jar {execution: default-jar}]
[INFO] [jar:test-jar {execution: attach-tests}]
[INFO] Building jar: <https://builds.apache.org/job/OpenJPA-trunk/ws/trunk/openjpa-persistence/target/openjpa-persistence-2.2.0-SNAPSHOT-tests.jar>
[INFO] [ianal:verify-legal-files {execution: default}]
[INFO] Checking legal files in: openjpa-persistence-2.2.0-SNAPSHOT.jar
[INFO] Checking legal files in: openjpa-persistence-2.2.0-SNAPSHOT-tests.jar
[INFO] [apache-rat:check {execution: default}]
[INFO] Exclude: **/.*/**
[INFO] Exclude: **/target/**/*
[INFO] [install:install {execution: default-install}]
[INFO] Installing <https://builds.apache.org/job/OpenJPA-trunk/ws/trunk/openjpa-persistence/target/openjpa-persistence-2.2.0-SNAPSHOT.jar>
to /home/hudson/.m2/repository/org/apache/openjpa/openjpa-persistence/2.2.0-SNAPSHOT/openjpa-persistence-2.2.0-SNAPSHOT.jar
[INFO] Installing <https://builds.apache.org/job/OpenJPA-trunk/ws/trunk/openjpa-persistence/target/openjpa-persistence-2.2.0-SNAPSHOT-tests.jar>
to /home/hudson/.m2/repository/org/apache/openjpa/openjpa-persistence/2.2.0-SNAPSHOT/openjpa-persistence-2.2.0-SNAPSHOT-tests.jar
[JENKINS] Archiving <https://builds.apache.org/job/OpenJPA-trunk/ws/trunk/openjpa-persistence/pom.xml>
to /home/hudson/hudson/jobs/OpenJPA-trunk/modules/org.apache.openjpa$openjpa-persistence/builds/2011-08-02_15-40-25/archive/org.apache.openjpa/openjpa-persistence/2.2.0-SNAPSHOT/openjpa-persistence-2.2.0-SNAPSHOT.pom
[JENKINS] Archiving <https://builds.apache.org/job/OpenJPA-trunk/ws/trunk/openjpa-persistence/target/openjpa-persistence-2.2.0-SNAPSHOT.jar>
to /home/hudson/hudson/jobs/OpenJPA-trunk/modules/org.apache.openjpa$openjpa-persistence/builds/2011-08-02_15-40-25/archive/org.apache.openjpa/openjpa-persistence/2.2.0-SNAPSHOT/openjpa-persistence-2.2.0-SNAPSHOT.jar
[JENKINS] Archiving <https://builds.apache.org/job/OpenJPA-trunk/ws/trunk/openjpa-persistence/target/openjpa-persistence-2.2.0-SNAPSHOT-tests.jar>
to /home/hudson/hudson/jobs/OpenJPA-trunk/modules/org.apache.openjpa$openjpa-persistence/builds/2011-08-02_15-40-25/archive/org.apache.openjpa/openjpa-persistence/2.2.0-SNAPSHOT/openjpa-persistence-2.2.0-SNAPSHOT-tests.jar
[INFO] ------------------------------------------------------------------------
[INFO] Building OpenJPA Persistence JDBC
[INFO]    task-segment: [clean, install]
[INFO] ------------------------------------------------------------------------
[INFO] [clean:clean {execution: default-clean}]
[INFO] Deleting file set: <https://builds.apache.org/job/OpenJPA-trunk/ws/trunk/openjpa-persistence-jdbc/target>
(included: [**], excluded: [])
[INFO] [buildnumber:create {execution: default}]
[INFO] [enforcer:enforce {execution: default}]
[INFO] [checkstyle:checkstyle {execution: default}]
[INFO] Starting audit...
Audit done.

[WARNING] Unable to locate Source XRef to link to - DISABLED
[INFO] [remote-resources:process {execution: default}]
[INFO] [resources:resources {execution: default-resources}]
[INFO] Using 'UTF-8' encoding to copy filtered resources.
[INFO] Copying 2 resources
[INFO] Copying 3 resources
[INFO] [compiler:compile {execution: default-compile}]
[INFO] Compiling 65 source files to <https://builds.apache.org/job/OpenJPA-trunk/ws/trunk/openjpa-persistence-jdbc/target/classes>
[INFO] [resources:testResources {execution: default-testResources}]
[INFO] Using 'UTF-8' encoding to copy filtered resources.
[INFO] Copying 97 resources
[INFO] Copying 3 resources
[INFO] [compiler:testCompile {execution: default-testCompile}]
[INFO] Compiling 2518 source files to <https://builds.apache.org/job/OpenJPA-trunk/ws/trunk/openjpa-persistence-jdbc/target/test-classes>
[INFO] -------------------------------------------------------------
[ERROR] COMPILATION ERROR : 
[INFO] -------------------------------------------------------------
[ERROR] <https://builds.apache.org/job/OpenJPA-trunk/ws/trunk/openjpa-persistence-jdbc/src/test/java/org/apache/openjpa/persistence/query/SimpleEntity.java>:[50,0]
illegal start of expression
[INFO] 1 error
[INFO] -------------------------------------------------------------
[JENKINS] Archiving <https://builds.apache.org/job/OpenJPA-trunk/ws/trunk/openjpa-persistence-jdbc/pom.xml>
to /home/hudson/hudson/jobs/OpenJPA-trunk/modules/org.apache.openjpa$openjpa-persistence-jdbc/builds/2011-08-02_15-40-25/archive/org.apache.openjpa/openjpa-persistence-jdbc/2.2.0-SNAPSHOT/openjpa-persistence-jdbc-2.2.0-SNAPSHOT.pom
[INFO] ------------------------------------------------------------------------
[ERROR] BUILD FAILURE
[INFO] ------------------------------------------------------------------------
[INFO] Compilation failure
<https://builds.apache.org/job/OpenJPA-trunk/ws/trunk/openjpa-persistence-jdbc/src/test/java/org/apache/openjpa/persistence/query/SimpleEntity.java>:[50,0]
illegal start of expression

[INFO] ------------------------------------------------------------------------
[INFO] For more information, run Maven with the -e switch
[INFO] ------------------------------------------------------------------------
[INFO] Total time: 3 minutes 1 second
[INFO] Finished at: Tue Aug 02 15:44:05 UTC 2011
[INFO] Final Memory: 96M/546M
[INFO] ------------------------------------------------------------------------
Sending e-mails to: commits@openjpa.apache.org
channel stopped


Mime
View raw message