openjpa-commits mailing list archives

Site index · List index
Message view « Date » · « Thread »
Top « Date » · « Thread »
From Apache Jenkins Server <jenk...@builds.apache.org>
Subject Build failed in Jenkins: OpenJPA-trunk » OpenJPA Persistence JDBC #513
Date Tue, 02 Aug 2011 15:44:06 GMT
See <https://builds.apache.org/job/OpenJPA-trunk/org.apache.openjpa$openjpa-persistence-jdbc/513/changes>

Changes:

[curtisr7] OPENJPA-2029: Add additional tests for query named to positional parameter conversion.
Patch contributed by Jacob Nowosatka.

------------------------------------------
[INFO] ------------------------------------------------------------------------
[INFO] Building OpenJPA Persistence JDBC
[INFO]    task-segment: [clean, install]
[INFO] ------------------------------------------------------------------------
[INFO] [clean:clean {execution: default-clean}]
[INFO] Deleting file set: <https://builds.apache.org/job/OpenJPA-trunk/org.apache.openjpa$openjpa-persistence-jdbc/ws/target>
(included: [**], excluded: [])
[INFO] [buildnumber:create {execution: default}]
[INFO] [enforcer:enforce {execution: default}]
[INFO] [checkstyle:checkstyle {execution: default}]
[INFO] Starting audit...
Audit done.

[WARNING] Unable to locate Source XRef to link to - DISABLED
[INFO] [remote-resources:process {execution: default}]
[INFO] [resources:resources {execution: default-resources}]
[INFO] Using 'UTF-8' encoding to copy filtered resources.
[INFO] Copying 2 resources
[INFO] Copying 3 resources
[INFO] [compiler:compile {execution: default-compile}]
[INFO] Compiling 65 source files to <https://builds.apache.org/job/OpenJPA-trunk/org.apache.openjpa$openjpa-persistence-jdbc/ws/target/classes>
[INFO] [resources:testResources {execution: default-testResources}]
[INFO] Using 'UTF-8' encoding to copy filtered resources.
[INFO] Copying 97 resources
[INFO] Copying 3 resources
[INFO] [compiler:testCompile {execution: default-testCompile}]
[INFO] Compiling 2518 source files to <https://builds.apache.org/job/OpenJPA-trunk/org.apache.openjpa$openjpa-persistence-jdbc/ws/target/test-classes>
[INFO] -------------------------------------------------------------
[ERROR] COMPILATION ERROR : 
[INFO] -------------------------------------------------------------
[ERROR] <https://builds.apache.org/job/OpenJPA-trunk/org.apache.openjpa$openjpa-persistence-jdbc/ws/src/test/java/org/apache/openjpa/persistence/query/SimpleEntity.java>:[50,0]
illegal start of expression
[INFO] 1 error
[INFO] -------------------------------------------------------------
[JENKINS] Archiving <https://builds.apache.org/job/OpenJPA-trunk/org.apache.openjpa$openjpa-persistence-jdbc/ws/pom.xml>
to /home/hudson/hudson/jobs/OpenJPA-trunk/modules/org.apache.openjpa$openjpa-persistence-jdbc/builds/2011-08-02_15-40-25/archive/org.apache.openjpa/openjpa-persistence-jdbc/2.2.0-SNAPSHOT/openjpa-persistence-jdbc-2.2.0-SNAPSHOT.pom
[INFO] ------------------------------------------------------------------------
[ERROR] BUILD FAILURE
[INFO] ------------------------------------------------------------------------
[INFO] Compilation failure
<https://builds.apache.org/job/OpenJPA-trunk/org.apache.openjpa$openjpa-persistence-jdbc/ws/src/test/java/org/apache/openjpa/persistence/query/SimpleEntity.java>:[50,0]
illegal start of expression

[INFO] ------------------------------------------------------------------------
[INFO] For more information, run Maven with the -e switch
[INFO] ------------------------------------------------------------------------
[INFO] Total time: 3 minutes 1 second
[INFO] Finished at: Tue Aug 02 15:44:05 UTC 2011
[INFO] Final Memory: 96M/546M
[INFO] ------------------------------------------------------------------------


Mime
View raw message