openjpa-commits mailing list archives

Site index · List index
Message view « Date » · « Thread »
Top « Date » · « Thread »
From Apache Hudson Server <hud...@hudson.apache.org>
Subject Build failed in Hudson: OpenJPA-20x-deploy #36
Date Fri, 28 Jan 2011 14:49:44 GMT
See <https://hudson.apache.org/hudson/job/OpenJPA-20x-deploy/36/>

------------------------------------------
[...truncated 4 lines...]
no change for https://svn.apache.org/repos/asf/openjpa/branches/2.0.x since the previous build
Found mavenVersion 3.0.2 from file jar:file:/home/hudson/tools/maven/apache-maven-2.2.1/lib/maven-core-3.0.2.jar!/META-INF/maven/org.apache.maven/maven-core/pom.properties
Parsing POMs
[2.0.x] $ /home/hudson/tools/java/latest1.6/bin/java -Xmx1024m -XX:MaxPermSize=256m -cp /home/hudson/hudson-slave/maven3-agent.jar:/home/hudson/tools/maven/apache-maven-2.2.1/boot/plexus-classworlds-2.4.jar
org.jvnet.hudson.maven3.agent.Maven3Main /home/hudson/tools/maven/apache-maven-2.2.1 /home/hudson/hudson-slave/slave.jar
/home/hudson/hudson-slave/maven3-interceptor.jar 57020
<===[HUDSON REMOTING CAPACITY]===>channel started
   Executing Maven:  -B -f <https://hudson.apache.org/hudson/job/OpenJPA-20x-deploy/ws/2.0.x/pom.xml>
clean deploy
[INFO] Scanning for projects...
[WARNING] 
[WARNING] Some problems were encountered while building the effective model for org.apache.openjpa:openjpa-lib:jar:2.0.2-SNAPSHOT
[WARNING] 'build.pluginManagement.plugins.plugin.(groupId:artifactId)' must be unique but
found duplicate declaration of plugin org.codehaus.mojo:findbugs-maven-plugin @ org.apache.openjpa:openjpa-parent:2.0.2-SNAPSHOT,
<https://hudson.apache.org/hudson/job/OpenJPA-20x-deploy/ws/2.0.x/pom.xml,> line 860,
column 25
[WARNING] 
[WARNING] Some problems were encountered while building the effective model for org.apache.openjpa:apache-openjpa:pom:2.0.2-SNAPSHOT
[WARNING] The expression ${artifactId} is deprecated. Please use ${project.artifactId} instead.
[WARNING] The expression ${version} is deprecated. Please use ${project.version} instead.
[WARNING] The expression ${artifactId} is deprecated. Please use ${project.artifactId} instead.
[WARNING] The expression ${version} is deprecated. Please use ${project.version} instead.
[WARNING] The expression ${artifactId} is deprecated. Please use ${project.artifactId} instead.
[WARNING] The expression ${version} is deprecated. Please use ${project.version} instead.
[WARNING] 
[WARNING] Some problems were encountered while building the effective model for org.apache.openjpa:openjpa-parent:pom:2.0.2-SNAPSHOT
[WARNING] 'build.pluginManagement.plugins.plugin.(groupId:artifactId)' must be unique but
found duplicate declaration of plugin org.codehaus.mojo:findbugs-maven-plugin @ line 860,
column 25
[WARNING] 
[WARNING] It is highly recommended to fix these problems because they threaten the stability
of your build.
[WARNING] 
[WARNING] For this reason, future Maven versions might no longer support building such malformed
projects.
[WARNING] 
[INFO] ------------------------------------------------------------------------
[INFO] Reactor Build Order:
[INFO] 
[INFO] OpenJPA Parent POM
[INFO] OpenJPA Utilities Library
[INFO] OpenJPA Kernel
[INFO] OpenJPA JDBC
[INFO] OpenJPA Persistence
[INFO] OpenJPA Persistence JDBC
[INFO] OpenJPA Persistence Locking Tests
[INFO] OpenJPA XML Store
[INFO] OpenJPA Slice
[INFO] OpenJPA Aggregate Jar
[INFO] OpenJPA Aggregate Jar with Dependencies
[INFO] OpenJPA Project Docs and Assemblies
[INFO] OpenJPA Examples
[INFO] OpenJPA Integration Tests
[INFO] OpenJPA Integration Tests - Daytrader
[INFO] OpenJPA Integration Tests - Examples
[INFO] OpenJPA Integration Tests - JPA TCK
[INFO] OpenJPA Integration Tests - Bean Validation
[INFO]                                                                         
[INFO] ------------------------------------------------------------------------
[INFO] Building OpenJPA Parent POM 2.0.2-SNAPSHOT
[INFO] ------------------------------------------------------------------------
[INFO] 
[INFO] --- maven-clean-plugin:2.3:clean (default-clean) @ openjpa-parent ---
[INFO] Deleting file set: <https://hudson.apache.org/hudson/job/OpenJPA-20x-deploy/ws/2.0.x/target>
(included: [**], excluded: [])
[INFO] 
[INFO] --- buildnumber-maven-plugin:1.0-beta-4:create (default) @ openjpa-parent ---
[INFO] Checking for local modifications: skipped.
[INFO] Updating project files from SCM: skipped.
[INFO] Executing: /bin/sh -c cd <https://hudson.apache.org/hudson/job/OpenJPA-20x-deploy/ws/2.0.x>
&& svn --non-interactive info
[INFO] Working directory: <https://hudson.apache.org/hudson/job/OpenJPA-20x-deploy/ws/2.0.x>
[INFO] Storing buildNumber: 1063439 at timestamp: January 28, 2011 at 6:48 AM
[INFO] Executing: /bin/sh -c cd <https://hudson.apache.org/hudson/job/OpenJPA-20x-deploy/ws/2.0.x>
&& svn --non-interactive info
[INFO] Working directory: <https://hudson.apache.org/hudson/job/OpenJPA-20x-deploy/ws/2.0.x>
[INFO] Storing buildScmBranch: branches/2.0.x
[INFO] 
[INFO] --- maven-enforcer-plugin:1.0-beta-1:enforce (default) @ openjpa-parent ---
[INFO] 
[INFO] --- maven-checkstyle-plugin:2.2:checkstyle (default) @ openjpa-parent ---
[INFO] Setting property: classpath.resource.loader.class => 'org.codehaus.plexus.velocity.ContextClassLoaderResourceLoader'.
[INFO] Setting property: velocimacro.messages.on => 'false'.
[INFO] Setting property: resource.loader => 'classpath'.
[INFO] Setting property: resource.manager.logwhenfound => 'false'.
[INFO] Source directory does not exist - skipping report.
[INFO] 
[INFO] --- maven-remote-resources-plugin:1.1:process (default) @ openjpa-parent ---
[INFO] Setting property: classpath.resource.loader.class => 'org.codehaus.plexus.velocity.ContextClassLoaderResourceLoader'.
[INFO] Setting property: velocimacro.messages.on => 'false'.
[INFO] Setting property: resource.loader => 'classpath'.
[INFO] Setting property: resource.manager.logwhenfound => 'false'.
[INFO] 
[INFO] --- ianal-maven-plugin:1.0-alpha-1:verify-legal-files (default) @ openjpa-parent ---
[INFO] 
[INFO] --- apache-rat-plugin:0.7:check (default) @ openjpa-parent ---
[INFO] Exclude: **/.*/**
[INFO] Exclude: **/target/**/*
[INFO] [INFO] Installing <https://hudson.apache.org/hudson/job/OpenJPA-20x-deploy/ws/2.0.x/pom.xml>
to /home/hudson/.m2/repository/org/apache/openjpa/openjpa-parent/2.0.2-SNAPSHOT/openjpa-parent-2.0.2-SNAPSHOT.pom

[INFO] --- maven-install-plugin:2.3:install (default-install) @ openjpa-parent ---
[INFO] Downloading: https://repository.apache.org/content/repositories/snapshots/org/apache/openjpa/openjpa-parent/2.0.2-SNAPSHOT/maven-metadata.xml

[INFO] --- maven-deploy-plugin:2.5:deploy (default-deploy) @ openjpa-parent ---
Downloaded: https://repository.apache.org/content/repositories/snapshots/org/apache/openjpa/openjpa-parent/2.0.2-SNAPSHOT/maven-metadata.xml
(369 B at 0.1 KB/sec)
Uploading: https://repository.apache.org/content/repositories/snapshots/org/apache/openjpa/openjpa-parent/2.0.2-SNAPSHOT/openjpa-parent-2.0.2-20110128.144917-33.pom
Uploaded: https://repository.apache.org/content/repositories/snapshots/org/apache/openjpa/openjpa-parent/2.0.2-SNAPSHOT/openjpa-parent-2.0.2-20110128.144917-33.pom
(43 KB at 3.1 KB/sec)
Downloading: https://repository.apache.org/content/repositories/snapshots/org/apache/openjpa/openjpa-parent/maven-metadata.xml
Downloaded: https://repository.apache.org/content/repositories/snapshots/org/apache/openjpa/openjpa-parent/maven-metadata.xml
(530 B at 0.9 KB/sec)
Uploading: https://repository.apache.org/content/repositories/snapshots/org/apache/openjpa/openjpa-parent/2.0.2-SNAPSHOT/maven-metadata.xml
Uploaded: https://repository.apache.org/content/repositories/snapshots/org/apache/openjpa/openjpa-parent/2.0.2-SNAPSHOT/maven-metadata.xml
(611 B at 1.6 KB/sec)
Uploading: https://repository.apache.org/content/repositories/snapshots/org/apache/openjpa/openjpa-parent/maven-metadata.xml
Uploaded: https://repository.apache.org/content/repositories/snapshots/org/apache/openjpa/openjpa-parent/maven-metadata.xml
(530 B at 1.8 KB/sec)
projectSucceeded org.apache.openjpa:openjpa-parent:2.0.2-SNAPSHOT
[HUDSON] Archiving <https://hudson.apache.org/hudson/job/OpenJPA-20x-deploy/ws/2.0.x/pom.xml>
to /home/hudson/hudson/jobs/OpenJPA-20x-deploy/modules/org.apache.openjpa$openjpa-parent/builds/2011-01-28_14-48-37/archive/org.apache.openjpa/openjpa-parent/2.0.2-SNAPSHOT/pom.xml
[INFO]                                                                         
[INFO] ------------------------------------------------------------------------
[INFO] Building OpenJPA Utilities Library 2.0.2-SNAPSHOT
[INFO] ------------------------------------------------------------------------
[INFO] [INFO] Deleting file set: <https://hudson.apache.org/hudson/job/OpenJPA-20x-deploy/ws/2.0.x/openjpa-lib/target>
(included: [**], excluded: [])

[INFO] --- maven-clean-plugin:2.3:clean (default-clean) @ openjpa-lib ---
[INFO] 
[INFO] --- buildnumber-maven-plugin:1.0-beta-4:create (default) @ openjpa-lib ---
[INFO] 
[INFO] --- maven-enforcer-plugin:1.0-beta-1:enforce (default) @ openjpa-lib ---
[INFO] 
[INFO] --- maven-checkstyle-plugin:2.2:checkstyle (default) @ openjpa-lib ---
[INFO] Starting audit...
Audit done.

[WARNING] Unable to locate Source XRef to link to - DISABLED
[INFO] 
[INFO] --- maven-remote-resources-plugin:1.1:process (default) @ openjpa-lib ---
[INFO] 
[INFO] --- maven-resources-plugin:2.4:resources (default-resources) @ openjpa-lib ---
[INFO] Using 'UTF-8' encoding to copy filtered resources.
[INFO] Copying 9 resources
[INFO] Copying 3 resources
[INFO] 
[INFO] --- maven-compiler-plugin:2.3.1:compile (default-compile) @ openjpa-lib ---
[INFO] Compiling 152 source files to <https://hudson.apache.org/hudson/job/OpenJPA-20x-deploy/ws/2.0.x/openjpa-lib/target/classes>
[INFO] Downloading: http://repo1.maven.org/maven2/com/jcraft/jsch/0.1.29/jsch-0.1.29.jar

[INFO] --- maven-antrun-plugin:1.3:run (set subversion revision) @ openjpa-lib ---
Downloaded: http://repo1.maven.org/maven2/com/jcraft/jsch/0.1.29/jsch-0.1.29.jar (150 KB at
265.6 KB/sec)
mojoFailed org.apache.maven.plugins:maven-antrun-plugin:1.3(set subversion revision)
projectFailed org.apache.openjpa:openjpa-lib:2.0.2-SNAPSHOT
[HUDSON] Archiving <https://hudson.apache.org/hudson/job/OpenJPA-20x-deploy/ws/2.0.x/openjpa-lib/pom.xml>
to /home/hudson/hudson/jobs/OpenJPA-20x-deploy/modules/org.apache.openjpa$openjpa-lib/builds/2011-01-28_14-48-37/archive/org.apache.openjpa/openjpa-lib/2.0.2-SNAPSHOT/pom.xml
sessionEnded
[INFO] ------------------------------------------------------------------------
[INFO] Reactor Summary:
[INFO] 
[INFO] OpenJPA Parent POM ................................ SUCCESS [44.205s]
[INFO] OpenJPA Utilities Library ......................... FAILURE [7.886s]
[INFO] OpenJPA Kernel .................................... SKIPPED
[INFO] OpenJPA JDBC ...................................... SKIPPED
[INFO] OpenJPA Persistence ............................... SKIPPED
[INFO] OpenJPA Persistence JDBC .......................... SKIPPED
[INFO] OpenJPA Persistence Locking Tests ................. SKIPPED
[INFO] OpenJPA XML Store ................................. SKIPPED
[INFO] OpenJPA Slice ..................................... SKIPPED
[INFO] OpenJPA Aggregate Jar ............................. SKIPPED
[INFO] OpenJPA Aggregate Jar with Dependencies ........... SKIPPED
[INFO] OpenJPA Project Docs and Assemblies ............... SKIPPED
[INFO] OpenJPA Examples .................................. SKIPPED
[INFO] OpenJPA Integration Tests ......................... SKIPPED
[INFO] OpenJPA Integration Tests - Daytrader ............. SKIPPED
[INFO] OpenJPA Integration Tests - Examples .............. SKIPPED
[INFO] OpenJPA Integration Tests - JPA TCK ............... SKIPPED
[INFO] OpenJPA Integration Tests - Bean Validation ....... SKIPPED
[INFO] ------------------------------------------------------------------------
[INFO] BUILD FAILURE
[INFO] ------------------------------------------------------------------------
[INFO] Total time: 55.701s
[INFO] Finished at: Fri Jan 28 06:49:43 PST 2011
[INFO] Final Memory: 24M/95M
[INFO] ------------------------------------------------------------------------
mavenExecutionResult exceptions not empty
org.apache.maven.lifecycle.LifecycleExecutionException: Failed to execute goal org.apache.maven.plugins:maven-antrun-plugin:1.3:run
(set subversion revision) on project openjpa-lib: An API incompatibility was encountered during
configuration of mojo org.apache.maven.plugins:maven-antrun-plugin:1.3:run: java.lang.NoSuchMethodError:
org.apache.tools.ant.util.FileUtils.close(Ljava/io/InputStream;)V
-----------------------------------------------------
realm =    plugin>org.apache.maven.plugins:maven-antrun-plugin:1.3
strategy = org.codehaus.plexus.classworlds.strategy.SelfFirstStrategy
urls[0] = file:/home/hudson/.m2/repository/org/apache/maven/plugins/maven-antrun-plugin/1.3/maven-antrun-plugin-1.3.jar
urls[1] = file:/home/hudson/.m2/repository/org/apache/ant/ant-jsch/1.7.0/ant-jsch-1.7.0.jar
urls[2] = file:/home/hudson/.m2/repository/com/jcraft/jsch/0.1.29/jsch-0.1.29.jar
urls[3] = file:/home/hudson/.m2/repository/ant-contrib/ant-contrib/1.0b3/ant-contrib-1.0b3.jar
urls[4] = file:/home/hudson/.m2/repository/ant/ant/1.5/ant-1.5.jar
urls[5] = file:/home/hudson/.m2/repository/junit/junit/3.8.1/junit-3.8.1.jar
urls[6] = file:/home/hudson/.m2/repository/org/codehaus/plexus/plexus-utils/1.5.6/plexus-utils-1.5.6.jar
urls[7] = file:/home/hudson/.m2/repository/org/apache/ant/ant-launcher/1.7.1/ant-launcher-1.7.1.jar
urls[8] = file:/home/hudson/.m2/repository/org/apache/ant/ant/1.7.1/ant-1.7.1.jar
Number of foreign imports: 1
import: Entry[import  from realm ClassRealm[maven.api, parent: null]]

-----------------------------------------------------

	at org.apache.maven.lifecycle.internal.MojoExecutor.execute(MojoExecutor.java:221)
	at org.apache.maven.lifecycle.internal.MojoExecutor.execute(MojoExecutor.java:153)
	at org.apache.maven.lifecycle.internal.MojoExecutor.execute(MojoExecutor.java:145)
	at org.apache.maven.lifecycle.internal.LifecycleModuleBuilder.buildProject(LifecycleModuleBuilder.java:84)
	at org.apache.maven.lifecycle.internal.LifecycleModuleBuilder.buildProject(LifecycleModuleBuilder.java:59)
	at org.apache.maven.lifecycle.internal.LifecycleStarter.singleThreadedBuild(LifecycleStarter.java:183)
	at org.apache.maven.lifecycle.internal.LifecycleStarter.execute(LifecycleStarter.java:161)
	at org.apache.maven.DefaultMaven.doExecute(DefaultMaven.java:319)
	at org.apache.maven.DefaultMaven.execute(DefaultMaven.java:156)
	at org.jvnet.hudson.maven3.launcher.Maven3Launcher.main(Maven3Launcher.java:79)
	at sun.reflect.NativeMethodAccessorImpl.invoke0(Native Method)
	at sun.reflect.NativeMethodAccessorImpl.invoke(NativeMethodAccessorImpl.java:39)
	at sun.reflect.DelegatingMethodAccessorImpl.invoke(DelegatingMethodAccessorImpl.java:25)
	at java.lang.reflect.Method.invoke(Method.java:597)
	at org.codehaus.plexus.classworlds.launcher.Launcher.launchStandard(Launcher.java:329)
	at org.codehaus.plexus.classworlds.launcher.Launcher.launch(Launcher.java:239)
	at org.jvnet.hudson.maven3.agent.Maven3Main.launch(Maven3Main.java:145)
	at hudson.maven.Maven3Builder.call(Maven3Builder.java:124)
	at hudson.maven.Maven3Builder.call(Maven3Builder.java:71)
	at hudson.remoting.UserRequest.perform(UserRequest.java:114)
	at hudson.remoting.UserRequest.perform(UserRequest.java:48)
	at hudson.remoting.Request$2.run(Request.java:270)
	at java.util.concurrent.Executors$RunnableAdapter.call(Executors.java:441)
	at java.util.concurrent.FutureTask$Sync.innerRun(FutureTask.java:303)
	at java.util.concurrent.FutureTask.run(FutureTask.java:138)
	at java.util.concurrent.ThreadPoolExecutor$Worker.runTask(ThreadPoolExecutor.java:886)
	at java.util.concurrent.ThreadPoolExecutor$Worker.run(ThreadPoolExecutor.java:908)
	at java.lang.Thread.run(Thread.java:619)
Caused by: org.apache.maven.plugin.PluginConfigurationException: An API incompatibility was
encountered during configuration of mojo org.apache.maven.plugins:maven-antrun-plugin:1.3:run:
java.lang.NoSuchMethodError: org.apache.tools.ant.util.FileUtils.close(Ljava/io/InputStream;)V
-----------------------------------------------------
realm =    plugin>org.apache.maven.plugins:maven-antrun-plugin:1.3
strategy = org.codehaus.plexus.classworlds.strategy.SelfFirstStrategy
urls[0] = file:/home/hudson/.m2/repository/org/apache/maven/plugins/maven-antrun-plugin/1.3/maven-antrun-plugin-1.3.jar
urls[1] = file:/home/hudson/.m2/repository/org/apache/ant/ant-jsch/1.7.0/ant-jsch-1.7.0.jar
urls[2] = file:/home/hudson/.m2/repository/com/jcraft/jsch/0.1.29/jsch-0.1.29.jar
urls[3] = file:/home/hudson/.m2/repository/ant-contrib/ant-contrib/1.0b3/ant-contrib-1.0b3.jar
urls[4] = file:/home/hudson/.m2/repository/ant/ant/1.5/ant-1.5.jar
urls[5] = file:/home/hudson/.m2/repository/junit/junit/3.8.1/junit-3.8.1.jar
urls[6] = file:/home/hudson/.m2/repository/org/codehaus/plexus/plexus-utils/1.5.6/plexus-utils-1.5.6.jar
urls[7] = file:/home/hudson/.m2/repository/org/apache/ant/ant-launcher/1.7.1/ant-launcher-1.7.1.jar
urls[8] = file:/home/hudson/.m2/repository/org/apache/ant/ant/1.7.1/ant-1.7.1.jar
Number of foreign imports: 1
import: Entry[import  from realm ClassRealm[maven.api, parent: null]]

-----------------------------------------------------

	at org.apache.maven.plugin.internal.DefaultMavenPluginManager.populatePluginFields(DefaultMavenPluginManager.java:619)
	at org.apache.maven.plugin.internal.DefaultMavenPluginManager.getConfiguredMojo(DefaultMavenPluginManager.java:525)
	at org.apache.maven.plugin.DefaultBuildPluginManager.executeMojo(DefaultBuildPluginManager.java:98)
	at org.apache.maven.lifecycle.internal.MojoExecutor.execute(MojoExecutor.java:209)
	... 27 more
Caused by: java.lang.NoSuchMethodError: org.apache.tools.ant.util.FileUtils.close(Ljava/io/InputStream;)V
	at org.apache.tools.ant.ComponentHelper.getDefaultDefinitions(ComponentHelper.java:737)
	at org.apache.tools.ant.ComponentHelper.initTasks(ComponentHelper.java:681)
	at org.apache.tools.ant.ComponentHelper.initDefaultDefinitions(ComponentHelper.java:270)
	at org.apache.maven.plugin.antrun.components.AntTargetConverter.initDefinitions(AntTargetConverter.java:189)
	at org.apache.maven.plugin.antrun.components.AntTargetConverter.processConfiguration(AntTargetConverter.java:109)
	at org.apache.maven.plugin.antrun.components.AntTargetConverter.fromConfiguration(AntTargetConverter.java:83)
	at org.codehaus.plexus.component.configurator.converters.ComponentValueSetter.configure(ComponentValueSetter.java:260)
	at org.codehaus.plexus.component.configurator.converters.composite.ObjectWithFieldsConverter.processConfiguration(ObjectWithFieldsConverter.java:137)
	at org.codehaus.plexus.component.configurator.BasicComponentConfigurator.configureComponent(BasicComponentConfigurator.java:56)
	at org.apache.maven.plugin.internal.DefaultMavenPluginManager.populatePluginFields(DefaultMavenPluginManager.java:563)
	... 30 more
Sending e-mails to: commits@openjpa.apache.org
channel stopped


Mime
View raw message