openjpa-commits mailing list archives

Site index · List index
Message view « Date » · « Thread »
Top « Date » · « Thread »
From Apache Hudson Server <hud...@hudson.apache.org>
Subject Build failed in Hudson: OpenJPA-trunk » OpenJPA Persistence JDBC #385
Date Mon, 24 Jan 2011 21:14:01 GMT
See <https://hudson.apache.org/hudson/job/OpenJPA-trunk/org.apache.openjpa$openjpa-persistence-jdbc/385/changes>

Changes:

[mtylenda] OPENJPA-1876: Tests speed-up - do not shut Derby down at the end of each test.

------------------------------------------
[INFO] ------------------------------------------------------------------------
[INFO] Building OpenJPA Persistence JDBC
[INFO]    task-segment: [clean, install]
[INFO] ------------------------------------------------------------------------
[INFO] [clean:clean {execution: default-clean}]
[INFO] Deleting file set: <https://hudson.apache.org/hudson/job/OpenJPA-trunk/org.apache.openjpa$openjpa-persistence-jdbc/ws/target>
(included: [**], excluded: [])
[INFO] [buildnumber:create {execution: default}]
[INFO] [enforcer:enforce {execution: default}]
[INFO] [checkstyle:checkstyle {execution: default}]
[INFO] Starting audit...
Audit done.

[WARNING] Unable to locate Source XRef to link to - DISABLED
[INFO] [remote-resources:process {execution: default}]
[INFO] [resources:resources {execution: default-resources}]
[INFO] Using 'UTF-8' encoding to copy filtered resources.
[INFO] Copying 2 resources
[INFO] Copying 3 resources
[INFO] [compiler:compile {execution: default-compile}]
[INFO] Compiling 65 source files to <https://hudson.apache.org/hudson/job/OpenJPA-trunk/org.apache.openjpa$openjpa-persistence-jdbc/ws/target/classes>
[INFO] [resources:testResources {execution: default-testResources}]
[INFO] Using 'UTF-8' encoding to copy filtered resources.
[INFO] Copying 94 resources
[INFO] Copying 3 resources
[INFO] [compiler:testCompile {execution: default-testCompile}]
[INFO] Compiling 2478 source files to <https://hudson.apache.org/hudson/job/OpenJPA-trunk/org.apache.openjpa$openjpa-persistence-jdbc/ws/target/test-classes>
[INFO] [antrun:run {execution: default}]
[INFO] Executing tasks

enhance:

enhance.all.entities:
     [echo]  running enhancer
org.apache.commons.lang.exception.NestableRuntimeException: Error extracting class information
from "<https://hudson.apache.org/hudson/job/OpenJPA-trunk/org.apache.openjpa$openjpa-persistence-jdbc/ws/target/test-classes/org/apache/openjpa/persistence/embed/EmployeePK2_.class".>
	at org.apache.openjpa.lib.meta.ClassArgParser.parseTypeNames(ClassArgParser.java:226)
	at org.apache.openjpa.lib.meta.ClassArgParser.parseTypes(ClassArgParser.java:161)
	at org.apache.openjpa.enhance.PCEnhancer.run(PCEnhancer.java:4659)
	at org.apache.openjpa.ant.PCEnhancerTask.executeOn(PCEnhancerTask.java:89)
	at org.apache.openjpa.lib.ant.AbstractTask.execute(AbstractTask.java:171)
	at org.apache.tools.ant.UnknownElement.execute(UnknownElement.java:288)
	at sun.reflect.GeneratedMethodAccessor23.invoke(Unknown Source)
	at sun.reflect.DelegatingMethodAccessorImpl.invoke(DelegatingMethodAccessorImpl.java:25)
	at java.lang.reflect.Method.invoke(Method.java:597)
	at org.apache.tools.ant.dispatch.DispatchUtils.execute(DispatchUtils.java:106)
	at org.apache.tools.ant.Task.perform(Task.java:348)
	at org.apache.tools.ant.Target.execute(Target.java:357)
	at org.apache.tools.ant.Target.performTasks(Target.java:385)
	at org.apache.tools.ant.Project.executeSortedTargets(Project.java:1337)
	at org.apache.tools.ant.helper.SingleCheckExecutor.executeTargets(SingleCheckExecutor.java:38)
	at org.apache.tools.ant.Project.executeTargets(Project.java:1189)
	at org.apache.tools.ant.taskdefs.Ant.execute(Ant.java:416)
	at org.apache.tools.ant.taskdefs.CallTarget.execute(CallTarget.java:105)
	at org.apache.tools.ant.UnknownElement.execute(UnknownElement.java:288)
	at sun.reflect.GeneratedMethodAccessor23.invoke(Unknown Source)
	at sun.reflect.DelegatingMethodAccessorImpl.invoke(DelegatingMethodAccessorImpl.java:25)
	at java.lang.reflect.Method.invoke(Method.java:597)
	at org.apache.tools.ant.dispatch.DispatchUtils.execute(DispatchUtils.java:106)
	at org.apache.tools.ant.Task.perform(Task.java:348)
	at org.apache.tools.ant.Target.execute(Target.java:357)
	at org.apache.tools.ant.Target.performTasks(Target.java:385)
	at org.apache.tools.ant.Project.executeSortedTargets(Project.java:1337)
	at org.apache.tools.ant.helper.SingleCheckExecutor.executeTargets(SingleCheckExecutor.java:38)
	at org.apache.tools.ant.Project.executeTargets(Project.java:1189)
	at org.apache.tools.ant.taskdefs.Ant.execute(Ant.java:416)
	at org.apache.tools.ant.UnknownElement.execute(UnknownElement.java:288)
	at sun.reflect.GeneratedMethodAccessor23.invoke(Unknown Source)
	at sun.reflect.DelegatingMethodAccessorImpl.invoke(DelegatingMethodAccessorImpl.java:25)
	at java.lang.reflect.Method.invoke(Method.java:597)
	at org.apache.tools.ant.dispatch.DispatchUtils.execute(DispatchUtils.java:106)
	at org.apache.tools.ant.Task.perform(Task.java:348)
	at org.apache.tools.ant.Target.execute(Target.java:357)
	at org.apache.maven.plugin.antrun.AbstractAntMojo.executeTasks(AbstractAntMojo.java:118)
	at org.apache.maven.plugin.antrun.AntRunMojo.execute(AntRunMojo.java:98)
	at org.apache.maven.plugin.DefaultPluginManager.executeMojo(DefaultPluginManager.java:490)
	at hudson.maven.agent.PluginManagerInterceptor.executeMojo(PluginManagerInterceptor.java:182)
	at org.apache.maven.lifecycle.DefaultLifecycleExecutor.executeGoals(DefaultLifecycleExecutor.java:694)
	at org.apache.maven.lifecycle.DefaultLifecycleExecutor.executeGoalWithLifecycle(DefaultLifecycleExecutor.java:556)
	at org.apache.maven.lifecycle.DefaultLifecycleExecutor.executeGoal(DefaultLifecycleExecutor.java:535)
	at org.apache.maven.lifecycle.DefaultLifecycleExecutor.executeGoalAndHandleFailures(DefaultLifecycleExecutor.java:387)
	at org.apache.maven.lifecycle.DefaultLifecycleExecutor.executeTaskSegments(DefaultLifecycleExecutor.java:348)
	at org.apache.maven.lifecycle.DefaultLifecycleExecutor.execute(DefaultLifecycleExecutor.java:180)
	at org.apache.maven.lifecycle.LifecycleExecutorInterceptor.execute(LifecycleExecutorInterceptor.java:65)
	at org.apache.maven.DefaultMaven.doExecute(DefaultMaven.java:328)
	at org.apache.maven.DefaultMaven.execute(DefaultMaven.java:138)
	at org.apache.maven.cli.MavenCli.main(MavenCli.java:362)
	at sun.reflect.NativeMethodAccessorImpl.invoke0(Native Method)
	at sun.reflect.NativeMethodAccessorImpl.invoke(NativeMethodAccessorImpl.java:39)
	at sun.reflect.DelegatingMethodAccessorImpl.invoke(DelegatingMethodAccessorImpl.java:25)
	at java.lang.reflect.Method.invoke(Method.java:597)
	at org.codehaus.classworlds.Launcher.launchEnhanced(Launcher.java:315)
	at org.codehaus.classworlds.Launcher.launch(Launcher.java:255)
	at hudson.maven.agent.Main.launch(Main.java:173)
	at hudson.maven.MavenBuilder.call(MavenBuilder.java:164)
	at hudson.maven.MavenModuleSetBuild$Builder.call(MavenModuleSetBuild.java:868)
	at hudson.maven.MavenModuleSetBuild$Builder.call(MavenModuleSetBuild.java:799)
	at hudson.remoting.UserRequest.perform(UserRequest.java:114)
	at hudson.remoting.UserRequest.perform(UserRequest.java:48)
	at hudson.remoting.Request$2.run(Request.java:270)
	at java.util.concurrent.Executors$RunnableAdapter.call(Executors.java:441)
	at java.util.concurrent.FutureTask$Sync.innerRun(FutureTask.java:303)
	at java.util.concurrent.FutureTask.run(FutureTask.java:138)
	at java.util.concurrent.ThreadPoolExecutor$Worker.runTask(ThreadPoolExecutor.java:886)
	at java.util.concurrent.ThreadPoolExecutor$Worker.run(ThreadPoolExecutor.java:908)
	at java.lang.Thread.run(Thread.java:619)
Caused by: java.io.FileNotFoundException: <https://hudson.apache.org/hudson/job/OpenJPA-trunk/org.apache.openjpa$openjpa-persistence-jdbc/ws/target/test-classes/org/apache/openjpa/persistence/embed/EmployeePK2_.class>
(Too many open files)
	at java.io.FileInputStream.open(Native Method)
	at java.io.FileInputStream.<init>(FileInputStream.java:106)
	at org.apache.openjpa.lib.util.J2DoPrivHelper$29.run(J2DoPrivHelper.java:688)
	at org.apache.openjpa.lib.util.J2DoPrivHelper$29.run(J2DoPrivHelper.java:686)
	at java.security.AccessController.doPrivileged(Native Method)
	at org.apache.openjpa.lib.meta.ClassArgParser.getFromClassFile(ClassArgParser.java:306)
	at org.apache.openjpa.lib.meta.ClassArgParser.parseTypeNames(ClassArgParser.java:217)
	... 69 more
[HUDSON] Archiving <https://hudson.apache.org/hudson/job/OpenJPA-trunk/org.apache.openjpa$openjpa-persistence-jdbc/ws/pom.xml>
to /home/hudson/hudson/jobs/OpenJPA-trunk/modules/org.apache.openjpa$openjpa-persistence-jdbc/builds/2011-01-24_21-11-09/archive/org.apache.openjpa/openjpa-persistence-jdbc/2.2.0-SNAPSHOT/pom.xml
[INFO] ------------------------------------------------------------------------
[ERROR] BUILD ERROR
[INFO] ------------------------------------------------------------------------
[INFO] An Ant BuildException has occured: The following error occurred while executing this
line:
<https://hudson.apache.org/hudson/job/OpenJPA-trunk/org.apache.openjpa$openjpa-persistence-jdbc/ws/src/main/ant/enhancer.xml>:51:
The following error occurred while executing this line:
<https://hudson.apache.org/hudson/job/OpenJPA-trunk/org.apache.openjpa$openjpa-persistence-jdbc/ws/src/main/ant/enhancer.xml>:86:
org.apache.commons.lang.exception.NestableRuntimeException: Error extracting class information
from "<https://hudson.apache.org/hudson/job/OpenJPA-trunk/org.apache.openjpa$openjpa-persistence-jdbc/ws/target/test-classes/org/apache/openjpa/persistence/embed/EmployeePK2_.class".>

<https://hudson.apache.org/hudson/job/OpenJPA-trunk/org.apache.openjpa$openjpa-persistence-jdbc/ws/target/test-classes/org/apache/openjpa/persistence/embed/EmployeePK2_.class>
(Too many open files)
[INFO] ------------------------------------------------------------------------
[INFO] For more information, run Maven with the -e switch
[INFO] ------------------------------------------------------------------------
[INFO] Total time: 2 minutes 27 seconds
[INFO] Finished at: Mon Jan 24 13:14:00 PST 2011
[INFO] Final Memory: 101M/584M
[INFO] ------------------------------------------------------------------------


Mime
View raw message