openjpa-commits mailing list archives

Site index · List index
Message view « Date » · « Thread »
Top « Date » · « Thread »
From Apache Hudson Server <hud...@hudson.apache.org>
Subject Build failed in Hudson: OpenJPA-trunk-deploy #28
Date Tue, 12 Oct 2010 08:28:39 GMT
See <https://hudson.apache.org/hudson/job/OpenJPA-trunk-deploy/28/changes>

Changes:

[dwoods] OPENJPA-1764 test can only be run against Derby, due to openjpa.ConnectionUserName
being used as a schema name

[dwoods] OPENJPA-1764 test can only be run against Derby, due to openjpa.ConnectionUserName
being used as a schema name

[mikedd] Testcase updates for Sybase

[mikedd] Add Sybase SQLState for EntityExistsException

[mikedd] Refactor testcase and ensure expected exception occurs.

[dwoods] OPENJPA-1764 Minor cleanup for static variables and exception messages

[dwoods] OPENJPA-1830 Deserialization of EMF causes openjpa.connectionPassword to be overwritten
with Value.INVISIBLE

[dwoods] create heap dumps for debugging when we hit OOMs

[curtisr7] OPENJPA-1644: Don't clear values from a deleted instnace.

[mikedd] Use filtering jdbc listener for criteria testcases

------------------------------------------
[...truncated 18640 lines...]
[WARNING] We have a duplicate org/apache/bval/jsr303/ApacheValidationProvider.class in /home/hudson/.m2/repository/org/apache/bval/bval-jsr303/0.2-incubating/bval-jsr303-0.2-incubating.jar
[WARNING] We have a duplicate org/apache/bval/jsr303/GraphBeanIdentity.class in /home/hudson/.m2/repository/org/apache/bval/bval-jsr303/0.2-incubating/bval-jsr303-0.2-incubating.jar
[WARNING] We have a duplicate org/apache/bval/constraints/SizeValidator.class in /home/hudson/.m2/repository/org/apache/bval/bval-jsr303/0.2-incubating/bval-jsr303-0.2-incubating.jar
[WARNING] We have a duplicate org/apache/bval/constraints/SizeValidatorForArrayOfBoolean.class
in /home/hudson/.m2/repository/org/apache/bval/bval-jsr303/0.2-incubating/bval-jsr303-0.2-incubating.jar
[WARNING] We have a duplicate org/apache/bval/constraints/SizeValidatorForArrayOfShort.class
in /home/hudson/.m2/repository/org/apache/bval/bval-jsr303/0.2-incubating/bval-jsr303-0.2-incubating.jar
[WARNING] We have a duplicate org/apache/bval/constraints/MaxValidatorForNumber.class in /home/hudson/.m2/repository/org/apache/bval/bval-jsr303/0.2-incubating/bval-jsr303-0.2-incubating.jar
[WARNING] We have a duplicate org/apache/bval/constraints/DecimalMaxValidatorForNumber.class
in /home/hudson/.m2/repository/org/apache/bval/bval-jsr303/0.2-incubating/bval-jsr303-0.2-incubating.jar
[WARNING] We have a duplicate org/apache/bval/constraints/DecimalMinValidatorForString.class
in /home/hudson/.m2/repository/org/apache/bval/bval-jsr303/0.2-incubating/bval-jsr303-0.2-incubating.jar
[WARNING] We have a duplicate org/apache/bval/constraints/SizeValidatorForArrayOfObject.class
in /home/hudson/.m2/repository/org/apache/bval/bval-jsr303/0.2-incubating/bval-jsr303-0.2-incubating.jar
[WARNING] We have a duplicate org/apache/bval/constraints/MaxValidatorForString.class in /home/hudson/.m2/repository/org/apache/bval/bval-jsr303/0.2-incubating/bval-jsr303-0.2-incubating.jar
[WARNING] We have a duplicate org/apache/bval/constraints/SizeValidatorForArrayOfByte.class
in /home/hudson/.m2/repository/org/apache/bval/bval-jsr303/0.2-incubating/bval-jsr303-0.2-incubating.jar
[WARNING] We have a duplicate org/apache/bval/constraints/NotNullValidator.class in /home/hudson/.m2/repository/org/apache/bval/bval-jsr303/0.2-incubating/bval-jsr303-0.2-incubating.jar
[WARNING] We have a duplicate org/apache/bval/constraints/SizeValidatorForMap.class in /home/hudson/.m2/repository/org/apache/bval/bval-jsr303/0.2-incubating/bval-jsr303-0.2-incubating.jar
[WARNING] We have a duplicate org/apache/bval/constraints/DigitsValidatorForString.class in
/home/hudson/.m2/repository/org/apache/bval/bval-jsr303/0.2-incubating/bval-jsr303-0.2-incubating.jar
[WARNING] We have a duplicate org/apache/bval/constraints/MinValidatorForString.class in /home/hudson/.m2/repository/org/apache/bval/bval-jsr303/0.2-incubating/bval-jsr303-0.2-incubating.jar
[WARNING] We have a duplicate org/apache/bval/constraints/NotEmptyValidatorForCollection.class
in /home/hudson/.m2/repository/org/apache/bval/bval-jsr303/0.2-incubating/bval-jsr303-0.2-incubating.jar
[WARNING] We have a duplicate org/apache/bval/constraints/NotEmpty.class in /home/hudson/.m2/repository/org/apache/bval/bval-jsr303/0.2-incubating/bval-jsr303-0.2-incubating.jar
[WARNING] We have a duplicate org/apache/bval/constraints/DecimalMinValidatorForNumber.class
in /home/hudson/.m2/repository/org/apache/bval/bval-jsr303/0.2-incubating/bval-jsr303-0.2-incubating.jar
[WARNING] We have a duplicate org/apache/bval/constraints/FutureValidatorForDate.class in
/home/hudson/.m2/repository/org/apache/bval/bval-jsr303/0.2-incubating/bval-jsr303-0.2-incubating.jar
[WARNING] We have a duplicate org/apache/bval/constraints/SizeValidatorForArrayOfFloat.class
in /home/hudson/.m2/repository/org/apache/bval/bval-jsr303/0.2-incubating/bval-jsr303-0.2-incubating.jar
[WARNING] We have a duplicate org/apache/bval/constraints/EmailValidator.class in /home/hudson/.m2/repository/org/apache/bval/bval-jsr303/0.2-incubating/bval-jsr303-0.2-incubating.jar
[WARNING] We have a duplicate org/apache/bval/constraints/Email.class in /home/hudson/.m2/repository/org/apache/bval/bval-jsr303/0.2-incubating/bval-jsr303-0.2-incubating.jar
[WARNING] We have a duplicate org/apache/bval/constraints/NotEmptyValidatorForString.class
in /home/hudson/.m2/repository/org/apache/bval/bval-jsr303/0.2-incubating/bval-jsr303-0.2-incubating.jar
[WARNING] We have a duplicate org/apache/bval/constraints/AssertFalseValidator.class in /home/hudson/.m2/repository/org/apache/bval/bval-jsr303/0.2-incubating/bval-jsr303-0.2-incubating.jar
[WARNING] We have a duplicate org/apache/bval/constraints/PastValidatorForDate.class in /home/hudson/.m2/repository/org/apache/bval/bval-jsr303/0.2-incubating/bval-jsr303-0.2-incubating.jar
[WARNING] We have a duplicate org/apache/bval/constraints/DecimalMaxValidatorForString.class
in /home/hudson/.m2/repository/org/apache/bval/bval-jsr303/0.2-incubating/bval-jsr303-0.2-incubating.jar
[WARNING] We have a duplicate org/apache/bval/constraints/NotEmptyValidatorForMap.class in
/home/hudson/.m2/repository/org/apache/bval/bval-jsr303/0.2-incubating/bval-jsr303-0.2-incubating.jar
[WARNING] We have a duplicate org/apache/bval/constraints/FutureValidatorForCalendar.class
in /home/hudson/.m2/repository/org/apache/bval/bval-jsr303/0.2-incubating/bval-jsr303-0.2-incubating.jar
[WARNING] We have a duplicate org/apache/bval/constraints/NullValidator.class in /home/hudson/.m2/repository/org/apache/bval/bval-jsr303/0.2-incubating/bval-jsr303-0.2-incubating.jar
[WARNING] We have a duplicate org/apache/bval/constraints/SizeValidatorForCollection.class
in /home/hudson/.m2/repository/org/apache/bval/bval-jsr303/0.2-incubating/bval-jsr303-0.2-incubating.jar
[WARNING] We have a duplicate org/apache/bval/constraints/SizeValidatorForArrayOfLong.class
in /home/hudson/.m2/repository/org/apache/bval/bval-jsr303/0.2-incubating/bval-jsr303-0.2-incubating.jar
[WARNING] We have a duplicate org/apache/bval/constraints/MinValidatorForNumber.class in /home/hudson/.m2/repository/org/apache/bval/bval-jsr303/0.2-incubating/bval-jsr303-0.2-incubating.jar
[WARNING] We have a duplicate org/apache/bval/constraints/AssertTrueValidator.class in /home/hudson/.m2/repository/org/apache/bval/bval-jsr303/0.2-incubating/bval-jsr303-0.2-incubating.jar
[WARNING] We have a duplicate org/apache/bval/constraints/PatternValidator.class in /home/hudson/.m2/repository/org/apache/bval/bval-jsr303/0.2-incubating/bval-jsr303-0.2-incubating.jar
[WARNING] We have a duplicate org/apache/bval/constraints/DigitsValidatorForNumber.class in
/home/hudson/.m2/repository/org/apache/bval/bval-jsr303/0.2-incubating/bval-jsr303-0.2-incubating.jar
[WARNING] We have a duplicate org/apache/bval/constraints/SizeValidatorForArrayOfDouble.class
in /home/hudson/.m2/repository/org/apache/bval/bval-jsr303/0.2-incubating/bval-jsr303-0.2-incubating.jar
[WARNING] We have a duplicate org/apache/bval/constraints/SizeValidatorForString.class in
/home/hudson/.m2/repository/org/apache/bval/bval-jsr303/0.2-incubating/bval-jsr303-0.2-incubating.jar
[WARNING] We have a duplicate org/apache/bval/constraints/SizeValidatorForArrayOfChar.class
in /home/hudson/.m2/repository/org/apache/bval/bval-jsr303/0.2-incubating/bval-jsr303-0.2-incubating.jar
[WARNING] We have a duplicate org/apache/bval/constraints/NotEmptyValidator.class in /home/hudson/.m2/repository/org/apache/bval/bval-jsr303/0.2-incubating/bval-jsr303-0.2-incubating.jar
[WARNING] We have a duplicate org/apache/bval/constraints/PastValidatorForCalendar.class in
/home/hudson/.m2/repository/org/apache/bval/bval-jsr303/0.2-incubating/bval-jsr303-0.2-incubating.jar
[WARNING] We have a duplicate org/apache/bval/constraints/SizeValidatorForArrayOfInt.class
in /home/hudson/.m2/repository/org/apache/bval/bval-jsr303/0.2-incubating/bval-jsr303-0.2-incubating.jar
[INFO] Replacing original artifact with shaded artifact.
[INFO] Replacing <https://hudson.apache.org/hudson/job/OpenJPA-trunk-deploy/ws/trunk/openjpa-all/target/openjpa-all-2.1.0-SNAPSHOT.jar>
with <https://hudson.apache.org/hudson/job/OpenJPA-trunk-deploy/ws/trunk/openjpa-all/target/openjpa-all-2.1.0-SNAPSHOT-shaded.jar>
[INFO] [ianal:verify-legal-files {execution: default}]
[INFO] Checking legal files in: openjpa-all-2.1.0-SNAPSHOT.jar
[INFO] Checking legal files in: openjpa-all-2.1.0-SNAPSHOT-tests.jar
[INFO] [apache-rat:check {execution: default}]
[INFO] Exclude: **/.*/**
[INFO] Exclude: **/target/**/*
[INFO] [install:install {execution: default-install}]
[INFO] Installing <https://hudson.apache.org/hudson/job/OpenJPA-trunk-deploy/ws/trunk/openjpa-all/target/openjpa-all-2.1.0-SNAPSHOT.jar>
to /home/hudson/.m2/repository/org/apache/openjpa/openjpa-all/2.1.0-SNAPSHOT/openjpa-all-2.1.0-SNAPSHOT.jar
[INFO] Installing <https://hudson.apache.org/hudson/job/OpenJPA-trunk-deploy/ws/trunk/openjpa-all/target/openjpa-all-2.1.0-SNAPSHOT-tests.jar>
to /home/hudson/.m2/repository/org/apache/openjpa/openjpa-all/2.1.0-SNAPSHOT/openjpa-all-2.1.0-SNAPSHOT-tests.jar
[INFO] [deploy:deploy {execution: default-deploy}]
[INFO] Retrieving previous build number from apache.snapshots.https
Uploading: https://repository.apache.org/content/repositories/snapshots/org/apache/openjpa/openjpa-all/2.1.0-SNAPSHOT/openjpa-all-2.1.0-20101012.064851-77.jar
6032K uploaded  (openjpa-all-2.1.0-20101012.064851-77.jar)
[INFO] Retrieving previous metadata from apache.snapshots.https
[INFO] Uploading repository metadata for: 'snapshot org.apache.openjpa:openjpa-all:2.1.0-SNAPSHOT'
[INFO] Retrieving previous metadata from apache.snapshots.https
[INFO] Uploading repository metadata for: 'artifact org.apache.openjpa:openjpa-all'
[INFO] Uploading project information for openjpa-all 2.1.0-20101012.064851-77
[INFO] Retrieving previous build number from apache.snapshots.https
Uploading: https://repository.apache.org/content/repositories/snapshots/org/apache/openjpa/openjpa-all/2.1.0-SNAPSHOT/openjpa-all-2.1.0-20101012.064851-77-tests.jar
20K uploaded  (openjpa-all-2.1.0-20101012.064851-77-tests.jar)
[INFO] Preparing javadoc:javadoc
[WARNING] Removing: javadoc from forked lifecycle, to prevent recursive invocation.
[HUDSON] Archiving <https://hudson.apache.org/hudson/job/OpenJPA-trunk-deploy/ws/trunk/openjpa-all/dependency-reduced-pom.xml>
to /home/hudson/hudson/jobs/OpenJPA-trunk-deploy/modules/org.apache.openjpa$openjpa-all/builds/2010-10-12_06-47-46/archive/org.apache.openjpa/openjpa-all/2.1.0-SNAPSHOT/dependency-reduced-pom.xml
[HUDSON] Archiving <https://hudson.apache.org/hudson/job/OpenJPA-trunk-deploy/ws/trunk/openjpa-all/target/openjpa-all-2.1.0-SNAPSHOT.jar>
to /home/hudson/hudson/jobs/OpenJPA-trunk-deploy/modules/org.apache.openjpa$openjpa-all/builds/2010-10-12_06-47-46/archive/org.apache.openjpa/openjpa-all/2.1.0-20101012.064851-77/openjpa-all-2.1.0-SNAPSHOT.jar
[HUDSON] Archiving <https://hudson.apache.org/hudson/job/OpenJPA-trunk-deploy/ws/trunk/openjpa-all/target/openjpa-all-2.1.0-SNAPSHOT-tests.jar>
to /home/hudson/hudson/jobs/OpenJPA-trunk-deploy/modules/org.apache.openjpa$openjpa-all/builds/2010-10-12_06-47-46/archive/org.apache.openjpa/openjpa-all/2.1.0-20101012.064851-77/openjpa-all-2.1.0-SNAPSHOT-tests.jar
[INFO] [buildnumber:create {execution: default}]
[INFO] [enforcer:enforce {execution: default}]
[INFO] [site:site {execution: default-site}]
[INFO] Parent project loaded from repository.
[INFO] Generating "Issue Tracking" report.
[INFO] Generating "Project Team" report.
[INFO] Generating "Dependency Management" report.
[INFO] Generating "Continuous Integration" report.
[INFO] Generating "Project Plugins" report.
[INFO] Generating "Dependencies" report.
Downloading: http://repo1.maven.org/maven2/commons-collections/commons-collections/3.2.1/commons-collections-3.2.1.jar
Downloading: http://repo1.maven.org/maven2/commons-lang/commons-lang/2.4/commons-lang-2.4.jar
Downloading: http://repo1.maven.org/maven2/commons-pool/commons-pool/1.5.4/commons-pool-1.5.4.jar
Downloading: http://repo1.maven.org/maven2/net/sourceforge/serp/serp/1.13.1/serp-1.13.1.jar
Downloading: http://repo1.maven.org/maven2/org/apache/bval/bval-core/0.2-incubating/bval-core-0.2-incubating.jar
Downloading: http://repo1.maven.org/maven2/org/apache/bval/bval-jsr303/0.2-incubating/bval-jsr303-0.2-incubating.jar
[ERROR] Artifact: org.apache.geronimo.specs:geronimo-jms_1.1_spec:jar:1.1.1 has no file.
[ERROR] Artifact: org.apache.geronimo.specs:geronimo-jpa_2.0_spec:jar:1.1 has no file.
[ERROR] Artifact: org.apache.geronimo.specs:geronimo-jta_1.1_spec:jar:1.1.1 has no file.
[INFO] Generating "Source Repository" report.
[INFO] Generating "Plugin Management" report.
[INFO] Generating "Mailing Lists" report.
[INFO] Generating "Project Summary" report.
[INFO] Generating "About" report.
[INFO] Generating "Project License" report.
[INFO] Generating "Dependency Convergence" report.
[HUDSON] Archiving site from <https://hudson.apache.org/hudson/job/OpenJPA-trunk-deploy/ws/trunk/openjpa-all/target/site>
to /home/hudson/hudson/jobs/OpenJPA-trunk-deploy/site/openjpa-all
[INFO] ------------------------------------------------------------------------
[INFO] Building OpenJPA Project Docs and Assemblies
[INFO]    task-segment: [clean, deploy, site]
[INFO] ------------------------------------------------------------------------
[INFO] [clean:clean {execution: default-clean}]
[INFO] Deleting file set: <https://hudson.apache.org/hudson/job/OpenJPA-trunk-deploy/ws/trunk/openjpa-project/target>
(included: [**], excluded: [])
[INFO] [buildnumber:create {execution: default}]
[INFO] [enforcer:enforce {execution: default}]
[INFO] [checkstyle:checkstyle {execution: default}]
[INFO] Source directory does not exist - skipping report.
[INFO] [remote-resources:process {execution: default}]
[INFO] [site:attach-descriptor {execution: default-attach-descriptor}]
[INFO] [assembly:attached {execution: bin}]
[INFO] Reading assembly descriptor: assembly.xml
[WARNING] Cannot include project artifact: org.apache.openjpa:apache-openjpa:pom:2.1.0-SNAPSHOT;
it doesn't have an associated file or directory.
[WARNING] Cannot include project artifact: org.apache.openjpa:apache-openjpa:pom:2.1.0-SNAPSHOT;
it doesn't have an associated file or directory.
[INFO] Building zip: <https://hudson.apache.org/hudson/job/OpenJPA-trunk-deploy/ws/trunk/openjpa-project/target/site/downloads/apache-openjpa-2.1.0-SNAPSHOT-binary.zip>
[WARNING] DEPRECATED [descriptor]: Please use descriptors instead
[INFO] [assembly:attached {execution: sources}]
[INFO] apache-openjpa-2.1.0-SNAPSHOT-source/README.txt already added, skipping
[INFO] apache-openjpa-2.1.0-SNAPSHOT-source/LICENSE already added, skipping
[INFO] apache-openjpa-2.1.0-SNAPSHOT-source/NOTICE already added, skipping
[INFO] Building zip: <https://hudson.apache.org/hudson/job/OpenJPA-trunk-deploy/ws/trunk/openjpa-project/target/site/downloads/apache-openjpa-2.1.0-SNAPSHOT-source.zip>
[INFO] apache-openjpa-2.1.0-SNAPSHOT-source/README.txt already added, skipping
[INFO] apache-openjpa-2.1.0-SNAPSHOT-source/LICENSE already added, skipping
[INFO] apache-openjpa-2.1.0-SNAPSHOT-source/NOTICE already added, skipping
[INFO] [ianal:verify-legal-files {execution: default}]
[INFO] Checking legal files in: apache-openjpa-2.1.0-SNAPSHOT-binary.zip
[INFO] Checking legal files in: apache-openjpa-2.1.0-SNAPSHOT-source.zip
[WARNING] Artifact does not contain any legal files: apache-openjpa-2.1.0-SNAPSHOT-source.zip
[INFO] [apache-rat:check {execution: default}]
[INFO] Exclude: **/.*/**
[INFO] Exclude: **/target/**/*
[INFO] [install:install {execution: default-install}]
[INFO] Installing <https://hudson.apache.org/hudson/job/OpenJPA-trunk-deploy/ws/trunk/openjpa-project/pom.xml>
to /home/hudson/.m2/repository/org/apache/openjpa/apache-openjpa/2.1.0-SNAPSHOT/apache-openjpa-2.1.0-SNAPSHOT.pom
[INFO] Installing <https://hudson.apache.org/hudson/job/OpenJPA-trunk-deploy/ws/trunk/openjpa-project/target/site/downloads/apache-openjpa-2.1.0-SNAPSHOT-binary.zip>
to /home/hudson/.m2/repository/org/apache/openjpa/apache-openjpa/2.1.0-SNAPSHOT/apache-openjpa-2.1.0-SNAPSHOT-binary.zip
[INFO] Installing <https://hudson.apache.org/hudson/job/OpenJPA-trunk-deploy/ws/trunk/openjpa-project/target/site/downloads/apache-openjpa-2.1.0-SNAPSHOT-source.zip>
to /home/hudson/.m2/repository/org/apache/openjpa/apache-openjpa/2.1.0-SNAPSHOT/apache-openjpa-2.1.0-SNAPSHOT-source.zip
[INFO] [deploy:deploy {execution: default-deploy}]
[INFO] Retrieving previous build number from apache.snapshots.https
Uploading: https://repository.apache.org/content/repositories/snapshots/org/apache/openjpa/apache-openjpa/2.1.0-SNAPSHOT/apache-openjpa-2.1.0-20101012.064851-77.pom
20K uploaded  (apache-openjpa-2.1.0-20101012.064851-77.pom)
[INFO] Retrieving previous metadata from apache.snapshots.https
[INFO] Uploading repository metadata for: 'snapshot org.apache.openjpa:apache-openjpa:2.1.0-SNAPSHOT'
[INFO] Retrieving previous metadata from apache.snapshots.https
[INFO] Uploading repository metadata for: 'artifact org.apache.openjpa:apache-openjpa'
[INFO] Retrieving previous build number from apache.snapshots.https
Uploading: https://repository.apache.org/content/repositories/snapshots/org/apache/openjpa/apache-openjpa/2.1.0-SNAPSHOT/apache-openjpa-2.1.0-20101012.064851-77-binary.zip
14591K uploaded  (apache-openjpa-2.1.0-20101012.064851-77-binary.zip)
[INFO] Retrieving previous build number from apache.snapshots.https
Uploading: https://repository.apache.org/content/repositories/snapshots/org/apache/openjpa/apache-openjpa/2.1.0-SNAPSHOT/apache-openjpa-2.1.0-20101012.064851-77-source.zip
102196K uploaded  (apache-openjpa-2.1.0-20101012.064851-77-source.zip)
[INFO] Preparing javadoc:javadoc
[WARNING] Removing: javadoc from forked lifecycle, to prevent recursive invocation.
[HUDSON] Archiving <https://hudson.apache.org/hudson/job/OpenJPA-trunk-deploy/ws/trunk/openjpa-project/pom.xml>
to /home/hudson/hudson/jobs/OpenJPA-trunk-deploy/modules/org.apache.openjpa$apache-openjpa/builds/2010-10-12_06-47-46/archive/org.apache.openjpa/apache-openjpa/2.1.0-SNAPSHOT/pom.xml
[HUDSON] Archiving /home/hudson/.m2/repository/org/apache/openjpa/apache-openjpa/2.1.0-SNAPSHOT/apache-openjpa-2.1.0-SNAPSHOT.pom
to /home/hudson/hudson/jobs/OpenJPA-trunk-deploy/modules/org.apache.openjpa$apache-openjpa/builds/2010-10-12_06-47-46/archive/org.apache.openjpa/apache-openjpa/2.1.0-20101012.064851-77/apache-openjpa-2.1.0-SNAPSHOT.pom
[HUDSON] Archiving <https://hudson.apache.org/hudson/job/OpenJPA-trunk-deploy/ws/trunk/openjpa-project/target/site/downloads/apache-openjpa-2.1.0-SNAPSHOT-binary.zip>
to /home/hudson/hudson/jobs/OpenJPA-trunk-deploy/modules/org.apache.openjpa$apache-openjpa/builds/2010-10-12_06-47-46/archive/org.apache.openjpa/apache-openjpa/2.1.0-20101012.064851-77/apache-openjpa-2.1.0-SNAPSHOT-binary.zip
[HUDSON] Archiving <https://hudson.apache.org/hudson/job/OpenJPA-trunk-deploy/ws/trunk/openjpa-project/target/site/downloads/apache-openjpa-2.1.0-SNAPSHOT-source.zip>
to /home/hudson/hudson/jobs/OpenJPA-trunk-deploy/modules/org.apache.openjpa$apache-openjpa/builds/2010-10-12_06-47-46/archive/org.apache.openjpa/apache-openjpa/2.1.0-20101012.064851-77/apache-openjpa-2.1.0-SNAPSHOT-source.zip
[INFO] [buildnumber:create {execution: default}]
[INFO] [enforcer:enforce {execution: default}]
[INFO] [site:site {execution: default-site}]
[INFO] Parent project loaded from repository.
[INFO] Generating "Issue Tracking" report.
[INFO] Generating "Project Team" report.
[INFO] Generating "Dependency Management" report.
[INFO] Generating "Continuous Integration" report.
[INFO] Generating "Project Plugins" report.
[INFO] Generating "Dependencies" report.
Downloading: http://repo1.maven.org/maven2/commons-collections/commons-collections/3.2.1/commons-collections-3.2.1.jar
Downloading: http://repo1.maven.org/maven2/commons-lang/commons-lang/2.4/commons-lang-2.4.jar
Downloading: http://repo1.maven.org/maven2/commons-pool/commons-pool/1.5.4/commons-pool-1.5.4.jar
Downloading: http://repo1.maven.org/maven2/net/sourceforge/serp/serp/1.13.1/serp-1.13.1.jar
Downloading: http://repo1.maven.org/maven2/org/apache/bval/bval-core/0.2-incubating/bval-core-0.2-incubating.jar
Downloading: http://repo1.maven.org/maven2/org/apache/bval/bval-jsr303/0.2-incubating/bval-jsr303-0.2-incubating.jar
[ERROR] Artifact: org.apache.geronimo.specs:geronimo-jms_1.1_spec:jar:1.1.1 has no file.
[ERROR] Artifact: org.apache.geronimo.specs:geronimo-jpa_2.0_spec:jar:1.1 has no file.
[ERROR] Artifact: org.apache.geronimo.specs:geronimo-jta_1.1_spec:jar:1.1.1 has no file.
[INFO] Generating "Source Repository" report.
[INFO] Generating "Plugin Management" report.
[INFO] Generating "Mailing Lists" report.
[INFO] Generating "Project Summary" report.
[INFO] Generating "About" report.
[INFO] Generating "Project License" report.
[INFO] Generating "Dependency Convergence" report.
[HUDSON] Archiving site from <https://hudson.apache.org/hudson/job/OpenJPA-trunk-deploy/ws/trunk/openjpa-project/target/site>
to /home/hudson/hudson/jobs/OpenJPA-trunk-deploy/site/apache-openjpa
[INFO] ------------------------------------------------------------------------
[ERROR] FATAL ERROR
[INFO] ------------------------------------------------------------------------
[INFO] null
[INFO] ------------------------------------------------------------------------
[INFO] Trace
java.lang.NullPointerException
	at hudson.remoting.ProxyOutputStream._write(ProxyOutputStream.java:118)
	at hudson.remoting.ProxyOutputStream.write(ProxyOutputStream.java:103)
	at java.io.BufferedOutputStream.flushBuffer(BufferedOutputStream.java:65)
	at java.io.BufferedOutputStream.write(BufferedOutputStream.java:109)
	at java.util.zip.DeflaterOutputStream.deflate(DeflaterOutputStream.java:161)
	at java.util.zip.DeflaterOutputStream.write(DeflaterOutputStream.java:118)
	at java.util.zip.GZIPOutputStream.write(GZIPOutputStream.java:72)
	at java.io.BufferedOutputStream.write(BufferedOutputStream.java:105)
	at org.apache.tools.tar.TarBuffer.writeBlock(TarBuffer.java:410)
	at org.apache.tools.tar.TarBuffer.writeRecord(TarBuffer.java:388)
	at hudson.org.apache.tools.tar.TarOutputStream.write(TarOutputStream.java:337)
	at hudson.util.io.TarArchiver.visit(TarArchiver.java:103)
	at hudson.util.DirScanner$Glob.scan(DirScanner.java:104)
	at hudson.FilePath.writeToTar(FilePath.java:1543)
	at hudson.FilePath.copyRecursiveTo(FilePath.java:1470)
	at hudson.FilePath.copyRecursiveTo(FilePath.java:1399)
	at hudson.maven.reporters.MavenSiteArchiver.postExecute(MavenSiteArchiver.java:81)
	at hudson.maven.MavenModuleSetBuild$Builder.postExecute(MavenModuleSetBuild.java:772)
	at hudson.maven.MavenBuilder$Adapter.postExecute(MavenBuilder.java:300)
	at hudson.maven.agent.PluginManagerInterceptor$1MojoIntercepterImpl.callPost(PluginManagerInterceptor.java:170)
	at hudson.maven.agent.PluginManagerInterceptor.executeMojo(PluginManagerInterceptor.java:183)
	at org.apache.maven.lifecycle.DefaultLifecycleExecutor.executeGoals(DefaultLifecycleExecutor.java:694)
	at org.apache.maven.lifecycle.DefaultLifecycleExecutor.executeGoalWithLifecycle(DefaultLifecycleExecutor.java:556)
	at org.apache.maven.lifecycle.DefaultLifecycleExecutor.executeGoal(DefaultLifecycleExecutor.java:535)
	at org.apache.maven.lifecycle.DefaultLifecycleExecutor.executeGoalAndHandleFailures(DefaultLifecycleExecutor.java:387)
	at org.apache.maven.lifecycle.DefaultLifecycleExecutor.executeTaskSegments(DefaultLifecycleExecutor.java:348)
	at org.apache.maven.lifecycle.DefaultLifecycleExecutor.execute(DefaultLifecycleExecutor.java:180)
	at org.apache.maven.lifecycle.LifecycleExecutorInterceptor.execute(LifecycleExecutorInterceptor.java:65)
	at org.apache.maven.DefaultMaven.doExecute(DefaultMaven.java:328)
	at org.apache.maven.DefaultMaven.execute(DefaultMaven.java:138)
	at org.apache.maven.cli.MavenCli.main(MavenCli.java:362)
	at sun.reflect.NativeMethodAccessorImpl.invoke0(Native Method)
	at sun.reflect.NativeMethodAccessorImpl.invoke(NativeMethodAccessorImpl.java:39)
	at sun.reflect.DelegatingMethodAccessorImpl.invoke(DelegatingMethodAccessorImpl.java:25)
	at java.lang.reflect.Method.invoke(Method.java:597)
	at org.codehaus.classworlds.Launcher.launchEnhanced(Launcher.java:315)
	at org.codehaus.classworlds.Launcher.launch(Launcher.java:255)
	at hudson.maven.agent.Main.launch(Main.java:165)
	at hudson.maven.MavenBuilder.call(MavenBuilder.java:165)
	at hudson.maven.MavenModuleSetBuild$Builder.call(MavenModuleSetBuild.java:694)
	at hudson.maven.MavenModuleSetBuild$Builder.call(MavenModuleSetBuild.java:638)
	at hudson.remoting.UserRequest.perform(UserRequest.java:114)
	at hudson.remoting.UserRequest.perform(UserRequest.java:48)
	at hudson.remoting.Request$2.run(Request.java:270)
	at java.util.concurrent.Executors$RunnableAdapter.call(Executors.java:441)
	at java.util.concurrent.FutureTask$Sync.innerRun(FutureTask.java:303)
	at java.util.concurrent.FutureTask.run(FutureTask.java:138)
	at java.util.concurrent.ThreadPoolExecutor$Worker.runTask(ThreadPoolExecutor.java:886)
	at java.util.concurrent.ThreadPoolExecutor$Worker.run(ThreadPoolExecutor.java:908)
	at java.lang.Thread.run(Thread.java:619)
[INFO] ------------------------------------------------------------------------
[INFO] Total time: 100 minutes 42 seconds
[INFO] Finished at: Tue Oct 12 08:28:37 UTC 2010
[INFO] Final Memory: 118M/584M
[INFO] ------------------------------------------------------------------------
Sending e-mails to: commits@openjpa.apache.org
Sending e-mails to: commits@openjpa.apache.org
Sending e-mails to: commits@openjpa.apache.org
Sending e-mails to: commits@openjpa.apache.org
Sending e-mails to: commits@openjpa.apache.org
Sending e-mails to: commits@openjpa.apache.org
channel stopped


Mime
View raw message