openjpa-commits mailing list archives

Site index · List index
Message view « Date » · « Thread »
Top « Date » · « Thread »
From Apache Hudson Server <hud...@hudson.apache.org>
Subject Build failed in Hudson: OpenJPA-trunk #205
Date Tue, 05 Oct 2010 21:41:06 GMT
See <https://hudson.apache.org/hudson/job/OpenJPA-trunk/205/changes>

Changes:

[curtisr7] OPENJPA-1801: Refactor cache statistics.

------------------------------------------
[...truncated 572 lines...]
symbol  : class CachedEntityStatistics
location: class org.apache.openjpa.persistence.datacache.TestStatistics

[ERROR] \hudson\hudson-slave\workspace\OpenJPA-trunk\trunk\openjpa-persistence-jdbc\src\test\java\org\apache\openjpa\persistence\datacache\TestStatistics.java:[148,20]
cannot find symbol
symbol  : class CachedEntityStatistics
location: class org.apache.openjpa.persistence.datacache.TestStatistics

[ERROR] \hudson\hudson-slave\workspace\OpenJPA-trunk\trunk\openjpa-persistence-jdbc\src\test\java\org\apache\openjpa\persistence\datacache\TestStatistics.java:[165,16]
cannot find symbol
symbol  : class CachedEntityStatistics
location: class org.apache.openjpa.persistence.datacache.TestStatistics

[ERROR] \hudson\hudson-slave\workspace\OpenJPA-trunk\trunk\openjpa-persistence-jdbc\src\test\java\org\apache\openjpa\persistence\datacache\TestStatistics.java:[165,74]
cannot find symbol
symbol  : class CachedEntityStatistics
location: class org.apache.openjpa.persistence.datacache.TestStatistics

[ERROR] \hudson\hudson-slave\workspace\OpenJPA-trunk\trunk\openjpa-persistence-jdbc\src\test\java\org\apache\openjpa\persistence\datacache\TestStatistics.java:[190,23]
cannot find symbol
symbol  : class CachedEntityStatistics
location: class org.apache.openjpa.persistence.datacache.TestStatistics

[ERROR] \hudson\hudson-slave\workspace\OpenJPA-trunk\trunk\openjpa-persistence-jdbc\src\test\java\org\apache\openjpa\persistence\datacache\TestStatistics.java:[197,8]
cannot find symbol
symbol  : class CachedEntityStatistics
location: class org.apache.openjpa.persistence.datacache.TestStatistics

[ERROR] \hudson\hudson-slave\workspace\OpenJPA-trunk\trunk\openjpa-persistence-jdbc\src\test\java\org\apache\openjpa\persistence\datacache\TestStatistics.java:[197,42]
cannot find symbol
symbol  : class CachedEntityStatistics
location: class org.apache.openjpa.persistence.datacache.TestStatistics

[ERROR] \hudson\hudson-slave\workspace\OpenJPA-trunk\trunk\openjpa-persistence-jdbc\src\test\java\org\apache\openjpa\persistence\datacache\TestStatistics.java:[198,26]
cannot find symbol
symbol  : class CachedEntityStatistics
location: class org.apache.openjpa.persistence.datacache.TestStatistics

[ERROR] \hudson\hudson-slave\workspace\OpenJPA-trunk\trunk\openjpa-persistence-jdbc\src\test\java\org\apache\openjpa\persistence\datacache\TestStatistics.java:[199,26]
cannot find symbol
symbol  : class CachedEntityStatistics
location: class org.apache.openjpa.persistence.datacache.TestStatistics

[ERROR] \hudson\hudson-slave\workspace\OpenJPA-trunk\trunk\openjpa-persistence-jdbc\src\test\java\org\apache\openjpa\persistence\datacache\TestStatistics.java:[200,25]
cannot find symbol
symbol  : class CachedEntityStatistics
location: class org.apache.openjpa.persistence.datacache.TestStatistics

[ERROR] \hudson\hudson-slave\workspace\OpenJPA-trunk\trunk\openjpa-persistence-jdbc\src\test\java\org\apache\openjpa\persistence\datacache\TestStatistics.java:[201,25]
cannot find symbol
symbol  : class CachedEntityStatistics
location: class org.apache.openjpa.persistence.datacache.TestStatistics

[ERROR] \hudson\hudson-slave\workspace\OpenJPA-trunk\trunk\openjpa-persistence-jdbc\src\test\java\org\apache\openjpa\persistence\datacache\TestStatistics.java:[212,8]
cannot find symbol
symbol  : class CachedEntityStatistics
location: class org.apache.openjpa.persistence.datacache.TestStatistics

[ERROR] \hudson\hudson-slave\workspace\OpenJPA-trunk\trunk\openjpa-persistence-jdbc\src\test\java\org\apache\openjpa\persistence\datacache\TestStatistics.java:[212,39]
cannot find symbol
symbol  : class CachedEntityStatistics
location: class org.apache.openjpa.persistence.datacache.TestStatistics

[ERROR] \hudson\hudson-slave\workspace\OpenJPA-trunk\trunk\openjpa-persistence-jdbc\src\test\java\org\apache\openjpa\persistence\datacache\TestStatistics.java:[230,8]
cannot find symbol
symbol  : class CachedEntityStatistics
location: class org.apache.openjpa.persistence.datacache.TestStatistics

[ERROR] \hudson\hudson-slave\workspace\OpenJPA-trunk\trunk\openjpa-persistence-jdbc\src\test\java\org\apache\openjpa\persistence\datacache\TestStatistics.java:[230,39]
cannot find symbol
symbol  : class CachedEntityStatistics
location: class org.apache.openjpa.persistence.datacache.TestStatistics

[ERROR] \hudson\hudson-slave\workspace\OpenJPA-trunk\trunk\openjpa-persistence-jdbc\src\test\java\org\apache\openjpa\persistence\datacache\TestStatistics.java:[253,13]
cannot find symbol
symbol  : class CachedEntityStatistics
location: class org.apache.openjpa.persistence.datacache.TestStatistics

[ERROR] \hudson\hudson-slave\workspace\OpenJPA-trunk\trunk\openjpa-persistence-jdbc\src\test\java\org\apache\openjpa\persistence\datacache\TestStatistics.java:[254,13]
cannot find symbol
symbol  : class CachedEntityStatistics
location: class org.apache.openjpa.persistence.datacache.TestStatistics

[ERROR] \hudson\hudson-slave\workspace\OpenJPA-trunk\trunk\openjpa-persistence-jdbc\src\test\java\org\apache\openjpa\persistence\datacache\TestStatistics.java:[257,8]
cannot find symbol
symbol  : class CachedEntityStatistics
location: class org.apache.openjpa.persistence.datacache.TestStatistics

[ERROR] \hudson\hudson-slave\workspace\OpenJPA-trunk\trunk\openjpa-persistence-jdbc\src\test\java\org\apache\openjpa\persistence\datacache\TestStatistics.java:[257,39]
cannot find symbol
symbol  : class CachedEntityStatistics
location: class org.apache.openjpa.persistence.datacache.TestStatistics

[ERROR] \hudson\hudson-slave\workspace\OpenJPA-trunk\trunk\openjpa-persistence-jdbc\src\test\java\org\apache\openjpa\persistence\datacache\TestStatistics.java:[259,26]
cannot find symbol
symbol  : class CachedEntityStatistics
location: class org.apache.openjpa.persistence.datacache.TestStatistics

[ERROR] \hudson\hudson-slave\workspace\OpenJPA-trunk\trunk\openjpa-persistence-jdbc\src\test\java\org\apache\openjpa\persistence\datacache\TestStatistics.java:[262,27]
cannot find symbol
symbol  : class CachedEntityStatistics
location: class org.apache.openjpa.persistence.datacache.TestStatistics

[ERROR] \hudson\hudson-slave\workspace\OpenJPA-trunk\trunk\openjpa-persistence-jdbc\src\test\java\org\apache\openjpa\persistence\datacache\TestStatistics.java:[263,27]
cannot find symbol
symbol  : class CachedEntityStatistics
location: class org.apache.openjpa.persistence.datacache.TestStatistics

[INFO] 36 errors 
[INFO] -------------------------------------------------------------
[HUDSON] Archiving C:\hudson\hudson-slave\workspace\OpenJPA-trunk\trunk\openjpa-persistence-jdbc\pom.xml
to /home/hudson/hudson/jobs/OpenJPA-trunk/modules/org.apache.openjpa$openjpa-persistence-jdbc/builds/2010-10-05_21-33-09/archive/org.apache.openjpa/openjpa-persistence-jdbc/2.1.0-SNAPSHOT/pom.xml
[INFO] ------------------------------------------------------------------------
[ERROR] BUILD FAILURE
[INFO] ------------------------------------------------------------------------
[INFO] Compilation failure

\hudson\hudson-slave\workspace\OpenJPA-trunk\trunk\openjpa-persistence-jdbc\src\test\java\org\apache\openjpa\persistence\datacache\TestStatistics.java:[252,4]
cannot find symbol
symbol  : class CachedEntityStatistics
location: class org.apache.openjpa.persistence.datacache.TestStatistics

\hudson\hudson-slave\workspace\OpenJPA-trunk\trunk\openjpa-persistence-jdbc\src\test\java\org\apache\openjpa\persistence\datacache\TestStatistics.java:[41,40]
cannot find symbol
symbol  : class CachedEntityStatistics
location: class org.apache.openjpa.persistence.datacache.TestStatistics

\hudson\hudson-slave\workspace\OpenJPA-trunk\trunk\openjpa-persistence-jdbc\src\test\java\org\apache\openjpa\persistence\datacache\TestStatistics.java:[44,37]
cannot find symbol
symbol  : class CachedEntityStatistics
location: class org.apache.openjpa.persistence.datacache.TestStatistics

\hudson\hudson-slave\workspace\OpenJPA-trunk\trunk\openjpa-persistence-jdbc\src\test\java\org\apache\openjpa\persistence\datacache\TestStatistics.java:[84,8]
cannot find symbol
symbol  : class CachedEntityStatistics
location: class org.apache.openjpa.persistence.datacache.TestStatistics

\hudson\hudson-slave\workspace\OpenJPA-trunk\trunk\openjpa-persistence-jdbc\src\test\java\org\apache\openjpa\persistence\datacache\TestStatistics.java:[92,8]
cannot find symbol
symbol  : class CachedEntityStatistics
location: class org.apache.openjpa.persistence.datacache.TestStatistics

\hudson\hudson-slave\workspace\OpenJPA-trunk\trunk\openjpa-persistence-jdbc\src\test\java\org\apache\openjpa\persistence\datacache\TestStatistics.java:[92,43]
cannot find symbol
symbol  : class CachedEntityStatistics
location: class org.apache.openjpa.persistence.datacache.TestStatistics

\hudson\hudson-slave\workspace\OpenJPA-trunk\trunk\openjpa-persistence-jdbc\src\test\java\org\apache\openjpa\persistence\datacache\TestStatistics.java:[98,16]
cannot find symbol
symbol  : class CachedEntityStatistics
location: class org.apache.openjpa.persistence.datacache.TestStatistics

\hudson\hudson-slave\workspace\OpenJPA-trunk\trunk\openjpa-persistence-jdbc\src\test\java\org\apache\openjpa\persistence\datacache\TestStatistics.java:[106,8]
cannot find symbol
symbol  : class CachedEntityStatistics
location: class org.apache.openjpa.persistence.datacache.TestStatistics

\hudson\hudson-slave\workspace\OpenJPA-trunk\trunk\openjpa-persistence-jdbc\src\test\java\org\apache\openjpa\persistence\datacache\TestStatistics.java:[118,8]
cannot find symbol
symbol  : class CachedEntityStatistics
location: class org.apache.openjpa.persistence.datacache.TestStatistics

\hudson\hudson-slave\workspace\OpenJPA-trunk\trunk\openjpa-persistence-jdbc\src\test\java\org\apache\openjpa\persistence\datacache\TestStatistics.java:[118,43]
cannot find symbol
symbol  : class CachedEntityStatistics
location: class org.apache.openjpa.persistence.datacache.TestStatistics

\hudson\hudson-slave\workspace\OpenJPA-trunk\trunk\openjpa-persistence-jdbc\src\test\java\org\apache\openjpa\persistence\datacache\TestStatistics.java:[128,16]
cannot find symbol
symbol  : class CachedEntityStatistics
location: class org.apache.openjpa.persistence.datacache.TestStatistics

\hudson\hudson-slave\workspace\OpenJPA-trunk\trunk\openjpa-persistence-jdbc\src\test\java\org\apache\openjpa\persistence\datacache\TestStatistics.java:[128,80]
cannot find symbol
symbol  : class CachedEntityStatistics
location: class org.apache.openjpa.persistence.datacache.TestStatistics

\hudson\hudson-slave\workspace\OpenJPA-trunk\trunk\openjpa-persistence-jdbc\src\test\java\org\apache\openjpa\persistence\datacache\TestStatistics.java:[134,25]
cannot find symbol
symbol  : class CachedEntityStatistics
location: class org.apache.openjpa.persistence.datacache.TestStatistics

\hudson\hudson-slave\workspace\OpenJPA-trunk\trunk\openjpa-persistence-jdbc\src\test\java\org\apache\openjpa\persistence\datacache\TestStatistics.java:[145,20]
cannot find symbol
symbol  : class CachedEntityStatistics
location: class org.apache.openjpa.persistence.datacache.TestStatistics

\hudson\hudson-slave\workspace\OpenJPA-trunk\trunk\openjpa-persistence-jdbc\src\test\java\org\apache\openjpa\persistence\datacache\TestStatistics.java:[145,84]
cannot find symbol
symbol  : class CachedEntityStatistics
location: class org.apache.openjpa.persistence.datacache.TestStatistics

\hudson\hudson-slave\workspace\OpenJPA-trunk\trunk\openjpa-persistence-jdbc\src\test\java\org\apache\openjpa\persistence\datacache\TestStatistics.java:[148,20]
cannot find symbol
symbol  : class CachedEntityStatistics
location: class org.apache.openjpa.persistence.datacache.TestStatistics

\hudson\hudson-slave\workspace\OpenJPA-trunk\trunk\openjpa-persistence-jdbc\src\test\java\org\apache\openjpa\persistence\datacache\TestStatistics.java:[165,16]
cannot find symbol
symbol  : class CachedEntityStatistics
location: class org.apache.openjpa.persistence.datacache.TestStatistics

\hudson\hudson-slave\workspace\OpenJPA-trunk\trunk\openjpa-persistence-jdbc\src\test\java\org\apache\openjpa\persistence\datacache\TestStatistics.java:[165,74]
cannot find symbol
symbol  : class CachedEntityStatistics
location: class org.apache.openjpa.persistence.datacache.TestStatistics

\hudson\hudson-slave\workspace\OpenJPA-trunk\trunk\openjpa-persistence-jdbc\src\test\java\org\apache\openjpa\persistence\datacache\TestStatistics.java:[190,23]
cannot find symbol
symbol  : class CachedEntityStatistics
location: class org.apache.openjpa.persistence.datacache.TestStatistics

\hudson\hudson-slave\workspace\OpenJPA-trunk\trunk\openjpa-persistence-jdbc\src\test\java\org\apache\openjpa\persistence\datacache\TestStatistics.java:[197,8]
cannot find symbol
symbol  : class CachedEntityStatistics
location: class org.apache.openjpa.persistence.datacache.TestStatistics

\hudson\hudson-slave\workspace\OpenJPA-trunk\trunk\openjpa-persistence-jdbc\src\test\java\org\apache\openjpa\persistence\datacache\TestStatistics.java:[197,42]
cannot find symbol
symbol  : class CachedEntityStatistics
location: class org.apache.openjpa.persistence.datacache.TestStatistics

\hudson\hudson-slave\workspace\OpenJPA-trunk\trunk\openjpa-persistence-jdbc\src\test\java\org\apache\openjpa\persistence\datacache\TestStatistics.java:[198,26]
cannot find symbol
symbol  : class CachedEntityStatistics
location: class org.apache.openjpa.persistence.datacache.TestStatistics

\hudson\hudson-slave\workspace\OpenJPA-trunk\trunk\openjpa-persistence-jdbc\src\test\java\org\apache\openjpa\persistence\datacache\TestStatistics.java:[199,26]
cannot find symbol
symbol  : class CachedEntityStatistics
location: class org.apache.openjpa.persistence.datacache.TestStatistics

\hudson\hudson-slave\workspace\OpenJPA-trunk\trunk\openjpa-persistence-jdbc\src\test\java\org\apache\openjpa\persistence\datacache\TestStatistics.java:[200,25]
cannot find symbol
symbol  : class CachedEntityStatistics
location: class org.apache.openjpa.persistence.datacache.TestStatistics

\hudson\hudson-slave\workspace\OpenJPA-trunk\trunk\openjpa-persistence-jdbc\src\test\java\org\apache\openjpa\persistence\datacache\TestStatistics.java:[201,25]
cannot find symbol
symbol  : class CachedEntityStatistics
location: class org.apache.openjpa.persistence.datacache.TestStatistics

\hudson\hudson-slave\workspace\OpenJPA-trunk\trunk\openjpa-persistence-jdbc\src\test\java\org\apache\openjpa\persistence\datacache\TestStatistics.java:[212,8]
cannot find symbol
symbol  : class CachedEntityStatistics
location: class org.apache.openjpa.persistence.datacache.TestStatistics

\hudson\hudson-slave\workspace\OpenJPA-trunk\trunk\openjpa-persistence-jdbc\src\test\java\org\apache\openjpa\persistence\datacache\TestStatistics.java:[212,39]
cannot find symbol
symbol  : class CachedEntityStatistics
location: class org.apache.openjpa.persistence.datacache.TestStatistics

\hudson\hudson-slave\workspace\OpenJPA-trunk\trunk\openjpa-persistence-jdbc\src\test\java\org\apache\openjpa\persistence\datacache\TestStatistics.java:[230,8]
cannot find symbol
symbol  : class CachedEntityStatistics
location: class org.apache.openjpa.persistence.datacache.TestStatistics

\hudson\hudson-slave\workspace\OpenJPA-trunk\trunk\openjpa-persistence-jdbc\src\test\java\org\apache\openjpa\persistence\datacache\TestStatistics.java:[230,39]
cannot find symbol
symbol  : class CachedEntityStatistics
location: class org.apache.openjpa.persistence.datacache.TestStatistics

\hudson\hudson-slave\workspace\OpenJPA-trunk\trunk\openjpa-persistence-jdbc\src\test\java\org\apache\openjpa\persistence\datacache\TestStatistics.java:[253,13]
cannot find symbol
symbol  : class CachedEntityStatistics
location: class org.apache.openjpa.persistence.datacache.TestStatistics

\hudson\hudson-slave\workspace\OpenJPA-trunk\trunk\openjpa-persistence-jdbc\src\test\java\org\apache\openjpa\persistence\datacache\TestStatistics.java:[254,13]
cannot find symbol
symbol  : class CachedEntityStatistics
location: class org.apache.openjpa.persistence.datacache.TestStatistics

\hudson\hudson-slave\workspace\OpenJPA-trunk\trunk\openjpa-persistence-jdbc\src\test\java\org\apache\openjpa\persistence\datacache\TestStatistics.java:[257,8]
cannot find symbol
symbol  : class CachedEntityStatistics
location: class org.apache.openjpa.persistence.datacache.TestStatistics

\hudson\hudson-slave\workspace\OpenJPA-trunk\trunk\openjpa-persistence-jdbc\src\test\java\org\apache\openjpa\persistence\datacache\TestStatistics.java:[257,39]
cannot find symbol
symbol  : class CachedEntityStatistics
location: class org.apache.openjpa.persistence.datacache.TestStatistics

\hudson\hudson-slave\workspace\OpenJPA-trunk\trunk\openjpa-persistence-jdbc\src\test\java\org\apache\openjpa\persistence\datacache\TestStatistics.java:[259,26]
cannot find symbol
symbol  : class CachedEntityStatistics
location: class org.apache.openjpa.persistence.datacache.TestStatistics

\hudson\hudson-slave\workspace\OpenJPA-trunk\trunk\openjpa-persistence-jdbc\src\test\java\org\apache\openjpa\persistence\datacache\TestStatistics.java:[262,27]
cannot find symbol
symbol  : class CachedEntityStatistics
location: class org.apache.openjpa.persistence.datacache.TestStatistics

\hudson\hudson-slave\workspace\OpenJPA-trunk\trunk\openjpa-persistence-jdbc\src\test\java\org\apache\openjpa\persistence\datacache\TestStatistics.java:[263,27]
cannot find symbol
symbol  : class CachedEntityStatistics
location: class org.apache.openjpa.persistence.datacache.TestStatistics


[INFO] ------------------------------------------------------------------------
[INFO] For more information, run Maven with the -e switch
[INFO] ------------------------------------------------------------------------
[INFO] Total time: 7 minutes 45 seconds
[INFO] Finished at: Tue Oct 05 22:10:54 BST 2010
[INFO] Final Memory: 146M/630M
[INFO] ------------------------------------------------------------------------
Sending e-mails to: commits@openjpa.apache.org
channel stopped


Mime
View raw message