openjpa-commits mailing list archives

Site index · List index
Message view « Date » · « Thread »
Top « Date » · « Thread »
From Apache Hudson Server <hud...@hudson.apache.org>
Subject Build failed in Hudson: OpenJPA-trunk-deploy » OpenJPA Persistence JDBC #29
Date Wed, 13 Oct 2010 08:26:41 GMT
See <https://hudson.apache.org/hudson/job/OpenJPA-trunk-deploy/org.apache.openjpa$openjpa-persistence-jdbc/29/changes>

Changes:

[dwoods] make sure tests cleanup EMs and EMFs

[dwoods] make sure tests cleanup EMs and EMFs

[dwoods] make sure tests cleanup EMs and EMFs

[dwoods] missed a testcase update in r1021956

[dwoods] make sure tests cleanup EMs and EMFs

[dwoods] make sure tests cleanup EMs and EMFs

[dwoods] make sure tests cleanup EMs and EMFs.  add @AllowFailure to excluded tests

[dwoods] testcase helper improvement to handle null props

[dwoods] make sure tests cleanup EMs and EMFs

------------------------------------------
[...truncated 12410 lines...]
0  TestConv  INFO   [main] openjpa.Runtime - Starting OpenJPA 2.1.0-SNAPSHOT
1  TestConv  INFO   [main] openjpa.jdbc.JDBC - Using dictionary class "org.apache.openjpa.jdbc.sql.DerbyDictionary".
1  TestConv  INFO   [main] openjpa.Runtime - Starting OpenJPA 2.1.0-SNAPSHOT
1  TestConv  INFO   [main] openjpa.jdbc.JDBC - Using dictionary class "org.apache.openjpa.jdbc.sql.DerbyDictionary".
Tests run: 5, Failures: 0, Errors: 0, Skipped: 0, Time elapsed: 4.178 sec
Running org.apache.openjpa.persistence.generationtype.TestMultipleSchemaNames
0  test  INFO   [main] openjpa.jdbc.JDBC - Using dictionary class "org.apache.openjpa.jdbc.sql.DerbyDictionary".
0  test  INFO   [main] openjpa.jdbc.JDBC - Using dictionary class "org.apache.openjpa.jdbc.sql.DerbyDictionary".
0  test  INFO   [main] openjpa.Runtime - Starting OpenJPA 2.1.0-SNAPSHOT
0  test  INFO   [main] openjpa.jdbc.JDBC - Using dictionary class "org.apache.openjpa.jdbc.sql.DerbyDictionary".
0  test  INFO   [main] openjpa.jdbc.JDBC - Using dictionary class "org.apache.openjpa.jdbc.sql.DerbyDictionary".
0  test  INFO   [main] openjpa.Runtime - Starting OpenJPA 2.1.0-SNAPSHOT
0  test  INFO   [main] openjpa.jdbc.JDBC - Using dictionary class "org.apache.openjpa.jdbc.sql.DerbyDictionary".
0  test  INFO   [main] openjpa.jdbc.JDBC - Using dictionary class "org.apache.openjpa.jdbc.sql.DerbyDictionary".
1  test  INFO   [main] openjpa.Runtime - Starting OpenJPA 2.1.0-SNAPSHOT
1  test  INFO   [main] openjpa.jdbc.JDBC - Using dictionary class "org.apache.openjpa.jdbc.sql.DerbyDictionary".
Tests run: 3, Failures: 0, Errors: 0, Skipped: 0, Time elapsed: 4.909 sec
Running org.apache.openjpa.persistence.kernel.TestEJBEntityManager
0  test  INFO   [main] openjpa.Runtime - Starting OpenJPA 2.1.0-SNAPSHOT
1  test  INFO   [main] openjpa.jdbc.JDBC - Using dictionary class "org.apache.openjpa.jdbc.sql.DerbyDictionary".
0  test  INFO   [main] openjpa.Runtime - Starting OpenJPA 2.1.0-SNAPSHOT
0  test  INFO   [main] openjpa.jdbc.JDBC - Using dictionary class "org.apache.openjpa.jdbc.sql.DerbyDictionary".
Tests run: 2, Failures: 0, Errors: 0, Skipped: 0, Time elapsed: 0.816 sec
Running org.apache.openjpa.persistence.query.TestQueryResultClassAPI
0  test  INFO   [main] openjpa.Runtime - Starting OpenJPA 2.1.0-SNAPSHOT
1  test  INFO   [main] openjpa.jdbc.JDBC - Using dictionary class "org.apache.openjpa.jdbc.sql.DerbyDictionary".
Tests run: 1, Failures: 0, Errors: 0, Skipped: 0, Time elapsed: 0.446 sec
Running org.apache.openjpa.persistence.query.TestProjectionQueryWithIdenticalResult
0  test  INFO   [main] openjpa.Runtime - Starting OpenJPA 2.1.0-SNAPSHOT
0  test  INFO   [main] openjpa.jdbc.JDBC - Using dictionary class "org.apache.openjpa.jdbc.sql.DerbyDictionary".
0  test  INFO   [main] openjpa.Runtime - Starting OpenJPA 2.1.0-SNAPSHOT
1  test  INFO   [main] openjpa.jdbc.JDBC - Using dictionary class "org.apache.openjpa.jdbc.sql.DerbyDictionary".
0  test  INFO   [main] openjpa.Runtime - Starting OpenJPA 2.1.0-SNAPSHOT
0  test  INFO   [main] openjpa.jdbc.JDBC - Using dictionary class "org.apache.openjpa.jdbc.sql.DerbyDictionary".
0  test  INFO   [main] openjpa.Runtime - Starting OpenJPA 2.1.0-SNAPSHOT
0  test  INFO   [main] openjpa.jdbc.JDBC - Using dictionary class "org.apache.openjpa.jdbc.sql.DerbyDictionary".
Tests run: 4, Failures: 0, Errors: 0, Skipped: 0, Time elapsed: 3.274 sec
Running org.apache.openjpa.persistence.identity.TestBooleanId
1  test  INFO   [main] openjpa.Runtime - Starting OpenJPA 2.1.0-SNAPSHOT
1  test  INFO   [main] openjpa.jdbc.JDBC - Using dictionary class "org.apache.openjpa.jdbc.sql.DerbyDictionary".
0  test  INFO   [main] openjpa.Runtime - Starting OpenJPA 2.1.0-SNAPSHOT
1  test  INFO   [main] openjpa.jdbc.JDBC - Using dictionary class "org.apache.openjpa.jdbc.sql.DerbyDictionary".
Tests run: 2, Failures: 0, Errors: 0, Skipped: 0, Time elapsed: 1.895 sec
Running org.apache.openjpa.persistence.dynamicschema.TestResWordEntity
0  test  INFO   [main] openjpa.Runtime - Starting OpenJPA 2.1.0-SNAPSHOT
1  test  INFO   [main] openjpa.jdbc.JDBC - Using dictionary class "org.apache.openjpa.jdbc.sql.DerbyDictionary".
1  test  INFO   [main] openjpa.Runtime - Starting OpenJPA 2.1.0-SNAPSHOT
1  test  INFO   [main] openjpa.jdbc.JDBC - Using dictionary class "org.apache.openjpa.jdbc.sql.DerbyDictionary".
197  test  INFO   [main] openjpa.Runtime - Starting OpenJPA 2.1.0-SNAPSHOT
197  test  INFO   [main] openjpa.jdbc.JDBC - Using dictionary class "org.apache.openjpa.jdbc.sql.DerbyDictionary".
Tests run: 4, Failures: 0, Errors: 0, Skipped: 0, Time elapsed: 0.657 sec
Running org.apache.openjpa.persistence.kernel.TestEJBNullValues
45  test  INFO   [main] openjpa.Runtime - Starting OpenJPA 2.1.0-SNAPSHOT
46  test  INFO   [main] openjpa.jdbc.JDBC - Using dictionary class "org.apache.openjpa.jdbc.sql.DerbyDictionary".
Tests run: 1, Failures: 0, Errors: 0, Skipped: 0, Time elapsed: 0.53 sec
Running org.apache.openjpa.persistence.models.company.joined.TestJoinedCompanyModel
1  test  INFO   [main] openjpa.Runtime - Starting OpenJPA 2.1.0-SNAPSHOT
2  test  INFO   [main] openjpa.jdbc.JDBC - Using dictionary class "org.apache.openjpa.jdbc.sql.DerbyDictionary".
Tests run: 1, Failures: 0, Errors: 0, Skipped: 0, Time elapsed: 21.202 sec

Results :

Tests run: 2546, Failures: 0, Errors: 0, Skipped: 0

[HUDSON] Recording test results
[INFO] [jar:jar {execution: default-jar}]
[INFO] Building jar: <https://hudson.apache.org/hudson/job/OpenJPA-trunk-deploy/org.apache.openjpa$openjpa-persistence-jdbc/ws/target/openjpa-persistence-jdbc-2.1.0-SNAPSHOT.jar>
[INFO] [jar:jar {execution: default-jar}]
[INFO] [jar:test-jar {execution: attach-tests}]
[INFO] Building jar: <https://hudson.apache.org/hudson/job/OpenJPA-trunk-deploy/org.apache.openjpa$openjpa-persistence-jdbc/ws/target/openjpa-persistence-jdbc-2.1.0-SNAPSHOT-tests.jar>
[INFO] [ianal:verify-legal-files {execution: default}]
[INFO] Checking legal files in: openjpa-persistence-jdbc-2.1.0-SNAPSHOT.jar
[INFO] Checking legal files in: openjpa-persistence-jdbc-2.1.0-SNAPSHOT-tests.jar
[INFO] [apache-rat:check {execution: default}]
[INFO] Exclude: **/.*/**
[INFO] Exclude: **/target/**/*
[INFO] [install:install {execution: default-install}]
[INFO] Installing <https://hudson.apache.org/hudson/job/OpenJPA-trunk-deploy/org.apache.openjpa$openjpa-persistence-jdbc/ws/target/openjpa-persistence-jdbc-2.1.0-SNAPSHOT.jar>
to /home/hudson/.m2/repository/org/apache/openjpa/openjpa-persistence-jdbc/2.1.0-SNAPSHOT/openjpa-persistence-jdbc-2.1.0-SNAPSHOT.jar
[INFO] Installing <https://hudson.apache.org/hudson/job/OpenJPA-trunk-deploy/org.apache.openjpa$openjpa-persistence-jdbc/ws/target/openjpa-persistence-jdbc-2.1.0-SNAPSHOT-tests.jar>
to /home/hudson/.m2/repository/org/apache/openjpa/openjpa-persistence-jdbc/2.1.0-SNAPSHOT/openjpa-persistence-jdbc-2.1.0-SNAPSHOT-tests.jar
[INFO] [deploy:deploy {execution: default-deploy}]
[INFO] Retrieving previous build number from apache.snapshots.https
Uploading: https://repository.apache.org/content/repositories/snapshots/org/apache/openjpa/openjpa-persistence-jdbc/2.1.0-SNAPSHOT/openjpa-persistence-jdbc-2.1.0-20101013.064955-82.jar
138K uploaded  (openjpa-persistence-jdbc-2.1.0-20101013.064955-82.jar)
[INFO] Retrieving previous metadata from apache.snapshots.https
[INFO] Uploading repository metadata for: 'snapshot org.apache.openjpa:openjpa-persistence-jdbc:2.1.0-SNAPSHOT'
[INFO] Uploading project information for openjpa-persistence-jdbc 2.1.0-20101013.064955-82
[INFO] Retrieving previous metadata from apache.snapshots.https
[INFO] Uploading repository metadata for: 'artifact org.apache.openjpa:openjpa-persistence-jdbc'
[INFO] Retrieving previous build number from apache.snapshots.https
Uploading: https://repository.apache.org/content/repositories/snapshots/org/apache/openjpa/openjpa-persistence-jdbc/2.1.0-SNAPSHOT/openjpa-persistence-jdbc-2.1.0-20101013.064955-82-tests.jar
7156K uploaded  (openjpa-persistence-jdbc-2.1.0-20101013.064955-82-tests.jar)
[INFO] Preparing javadoc:javadoc
[WARNING] Removing: javadoc from forked lifecycle, to prevent recursive invocation.
[HUDSON] Archiving <https://hudson.apache.org/hudson/job/OpenJPA-trunk-deploy/org.apache.openjpa$openjpa-persistence-jdbc/ws/pom.xml>
to /home/hudson/hudson/jobs/OpenJPA-trunk-deploy/modules/org.apache.openjpa$openjpa-persistence-jdbc/builds/2010-10-13_06-49-04/archive/org.apache.openjpa/openjpa-persistence-jdbc/2.1.0-SNAPSHOT/pom.xml
[HUDSON] Archiving <https://hudson.apache.org/hudson/job/OpenJPA-trunk-deploy/org.apache.openjpa$openjpa-persistence-jdbc/ws/target/openjpa-persistence-jdbc-2.1.0-SNAPSHOT.jar>
to /home/hudson/hudson/jobs/OpenJPA-trunk-deploy/modules/org.apache.openjpa$openjpa-persistence-jdbc/builds/2010-10-13_06-49-04/archive/org.apache.openjpa/openjpa-persistence-jdbc/2.1.0-20101013.064955-82/openjpa-persistence-jdbc-2.1.0-SNAPSHOT.jar
[HUDSON] Archiving <https://hudson.apache.org/hudson/job/OpenJPA-trunk-deploy/org.apache.openjpa$openjpa-persistence-jdbc/ws/target/openjpa-persistence-jdbc-2.1.0-SNAPSHOT-tests.jar>
to /home/hudson/hudson/jobs/OpenJPA-trunk-deploy/modules/org.apache.openjpa$openjpa-persistence-jdbc/builds/2010-10-13_06-49-04/archive/org.apache.openjpa/openjpa-persistence-jdbc/2.1.0-20101013.064955-82/openjpa-persistence-jdbc-2.1.0-SNAPSHOT-tests.jar
[INFO] [buildnumber:create {execution: default}]
[INFO] [enforcer:enforce {execution: default}]
[INFO] [site:site {execution: default-site}]
[INFO] Parent project loaded from repository.
[INFO] Generating "Issue Tracking" report.
[INFO] Generating "Project Team" report.
[INFO] Generating "Dependency Management" report.
[INFO] Generating "Continuous Integration" report.
[INFO] Generating "Project Plugins" report.
[INFO] Generating "Dependencies" report.
Downloading: http://repo1.maven.org/maven2/commons-lang/commons-lang/2.4/commons-lang-2.4.jar
Downloading: http://repo1.maven.org/maven2/commons-pool/commons-pool/1.5.4/commons-pool-1.5.4.jar
Downloading: http://repo1.maven.org/maven2/javax/activation/activation/1.1/activation-1.1.jar
Downloading: http://repo1.maven.org/maven2/javax/xml/bind/jsr173_api/1.0/jsr173_api-1.0.jar
Downloading: http://repo1.maven.org/maven2/net/sourceforge/serp/serp/1.13.1/serp-1.13.1.jar
[ERROR] Artifact: org.apache.geronimo.specs:geronimo-jms_1.1_spec:jar:1.1.1 has no file.
[ERROR] Artifact: org.apache.geronimo.specs:geronimo-jpa_2.0_spec:jar:1.1 has no file.
[ERROR] Artifact: org.apache.geronimo.specs:geronimo-jta_1.1_spec:jar:1.1.1 has no file.
[ERROR] Artifact: org.apache.openjpa:openjpa-kernel:jar:2.1.0-SNAPSHOT has no file.
[ERROR] Artifact: org.apache.openjpa:openjpa-lib:jar:2.1.0-SNAPSHOT has no file.
Downloading: http://repository.apache.org/snapshots/org/apache/openjpa/openjpa-kernel/2.1.0-SNAPSHOT/openjpa-kernel-2.1.0-SNAPSHOT.jar
[INFO] Unable to find resource 'org.apache.openjpa:openjpa-kernel:jar:2.1.0-SNAPSHOT' in repository
apache.snapshots (http://repository.apache.org/snapshots)
Downloading: http://repository.apache.org/snapshots/org/apache/openjpa/openjpa-lib/2.1.0-SNAPSHOT/openjpa-lib-2.1.0-SNAPSHOT.jar
[INFO] Unable to find resource 'org.apache.openjpa:openjpa-lib:jar:2.1.0-SNAPSHOT' in repository
apache.snapshots (http://repository.apache.org/snapshots)
[INFO] Generating "Source Repository" report.
[INFO] Generating "Plugin Management" report.
[INFO] Generating "Mailing Lists" report.
[INFO] Generating "Project Summary" report.
[INFO] Generating "About" report.
[INFO] Generating "JavaDocs" report.
[ERROR] Error fetching link: /home/hudson/hudson-slave/workspace/OpenJPA-trunk-deploy/trunk/openjpa-persistence-locking/target/site/apidocs/package-list.
Ignored it.
[ERROR] Error fetching link: /home/hudson/hudson-slave/workspace/OpenJPA-trunk-deploy/trunk/openjpa/target/site/apidocs/package-list.
Ignored it.
[ERROR] Error fetching link: /home/hudson/hudson-slave/workspace/OpenJPA-trunk-deploy/trunk/openjpa-all/target/site/apidocs/package-list.
Ignored it.
[ERROR] Error fetching link: /home/hudson/hudson-slave/workspace/OpenJPA-trunk-deploy/trunk/openjpa-integration/daytrader/target/site/apidocs/package-list.
Ignored it.
[ERROR] Error fetching link: /home/hudson/hudson-slave/workspace/OpenJPA-trunk-deploy/trunk/openjpa-integration/slf4j/target/site/apidocs/package-list.
Ignored it.
[ERROR] Error fetching link: /home/hudson/hudson-slave/workspace/OpenJPA-trunk-deploy/trunk/openjpa-integration/validation/target/site/apidocs/package-list.
Ignored it.
[ERROR] Error fetching link: /home/hudson/hudson-slave/workspace/OpenJPA-trunk-deploy/trunk/openjpa-integration/jmx/target/site/apidocs/package-list.
Ignored it.
[INFO] 
50 warnings
[WARNING] Javadoc Warnings
[WARNING] <https://hudson.apache.org/hudson/job/OpenJPA-trunk-deploy/org.apache.openjpa$openjpa-persistence-jdbc/ws/src/main/java/org/apache/openjpa/persistence/jdbc/AnnotationPersistenceMappingParser.java>:110:
warning - @nojavadoc is an unknown tag.
[WARNING] <https://hudson.apache.org/hudson/job/OpenJPA-trunk-deploy/org.apache.openjpa$openjpa-persistence-jdbc/ws/src/main/java/org/apache/openjpa/persistence/jdbc/AnnotationPersistenceMappingSerializer.java>:93:
warning - @nojavadoc is an unknown tag.
[WARNING] <https://hudson.apache.org/hudson/job/OpenJPA-trunk-deploy/org.apache.openjpa$openjpa-persistence-jdbc/ws/src/main/java/org/apache/openjpa/persistence/jdbc/ClassCriteria.java>:37:
warning - @published is an unknown tag.
[WARNING] <https://hudson.apache.org/hudson/job/OpenJPA-trunk-deploy/org.apache.openjpa$openjpa-persistence-jdbc/ws/src/main/java/org/apache/openjpa/persistence/jdbc/Columns.java>:37:
warning - @published is an unknown tag.
[WARNING] <https://hudson.apache.org/hudson/job/OpenJPA-trunk-deploy/org.apache.openjpa$openjpa-persistence-jdbc/ws/src/main/java/org/apache/openjpa/persistence/jdbc/ContainerTable.java>:36:
warning - @published is an unknown tag.
[WARNING] <https://hudson.apache.org/hudson/job/OpenJPA-trunk-deploy/org.apache.openjpa$openjpa-persistence-jdbc/ws/src/main/java/org/apache/openjpa/persistence/jdbc/DataStoreIdColumn.java>:35:
warning - @published is an unknown tag.
[WARNING] <https://hudson.apache.org/hudson/job/OpenJPA-trunk-deploy/org.apache.openjpa$openjpa-persistence-jdbc/ws/src/main/java/org/apache/openjpa/persistence/jdbc/DiscriminatorStrategy.java>:35:
warning - @published is an unknown tag.
[WARNING] <https://hudson.apache.org/hudson/job/OpenJPA-trunk-deploy/org.apache.openjpa$openjpa-persistence-jdbc/ws/src/main/java/org/apache/openjpa/persistence/jdbc/EagerFetchMode.java>:36:
warning - @published is an unknown tag.
[WARNING] <https://hudson.apache.org/hudson/job/OpenJPA-trunk-deploy/org.apache.openjpa$openjpa-persistence-jdbc/ws/src/main/java/org/apache/openjpa/persistence/jdbc/ElementClassCriteria.java>:37:
warning - @published is an unknown tag.
[WARNING] <https://hudson.apache.org/hudson/job/OpenJPA-trunk-deploy/org.apache.openjpa$openjpa-persistence-jdbc/ws/src/main/java/org/apache/openjpa/persistence/jdbc/ElementForeignKey.java>:36:
warning - @published is an unknown tag.
[WARNING] <https://hudson.apache.org/hudson/job/OpenJPA-trunk-deploy/org.apache.openjpa$openjpa-persistence-jdbc/ws/src/main/java/org/apache/openjpa/persistence/jdbc/ElementIndex.java>:36:
warning - @published is an unknown tag.
[WARNING] <https://hudson.apache.org/hudson/job/OpenJPA-trunk-deploy/org.apache.openjpa$openjpa-persistence-jdbc/ws/src/main/java/org/apache/openjpa/persistence/jdbc/ElementJoinColumn.java>:36:
warning - @published is an unknown tag.
[WARNING] <https://hudson.apache.org/hudson/job/OpenJPA-trunk-deploy/org.apache.openjpa$openjpa-persistence-jdbc/ws/src/main/java/org/apache/openjpa/persistence/jdbc/ElementJoinColumns.java>:37:
warning - @published is an unknown tag.
[WARNING] <https://hudson.apache.org/hudson/job/OpenJPA-trunk-deploy/org.apache.openjpa$openjpa-persistence-jdbc/ws/src/main/java/org/apache/openjpa/persistence/jdbc/ElementNonpolymorphic.java>:37:
warning - @published is an unknown tag.
[WARNING] <https://hudson.apache.org/hudson/job/OpenJPA-trunk-deploy/org.apache.openjpa$openjpa-persistence-jdbc/ws/src/main/java/org/apache/openjpa/persistence/jdbc/EmbeddedMapping.java>:36:
warning - @published is an unknown tag.
[WARNING] <https://hudson.apache.org/hudson/job/OpenJPA-trunk-deploy/org.apache.openjpa$openjpa-persistence-jdbc/ws/src/main/java/org/apache/openjpa/persistence/jdbc/FetchDirection.java>:29:
warning - @published is an unknown tag.
[WARNING] <https://hudson.apache.org/hudson/job/OpenJPA-trunk-deploy/org.apache.openjpa$openjpa-persistence-jdbc/ws/src/main/java/org/apache/openjpa/persistence/jdbc/FetchMode.java>:32:
warning - @published is an unknown tag.
[WARNING] <https://hudson.apache.org/hudson/job/OpenJPA-trunk-deploy/org.apache.openjpa$openjpa-persistence-jdbc/ws/src/main/java/org/apache/openjpa/persistence/jdbc/ForeignKey.java>:35:
warning - @published is an unknown tag.
[WARNING] <https://hudson.apache.org/hudson/job/OpenJPA-trunk-deploy/org.apache.openjpa$openjpa-persistence-jdbc/ws/src/main/java/org/apache/openjpa/persistence/jdbc/ForeignKeyAction.java>:28:
warning - @published is an unknown tag.
[WARNING] <https://hudson.apache.org/hudson/job/OpenJPA-trunk-deploy/org.apache.openjpa$openjpa-persistence-jdbc/ws/src/main/java/org/apache/openjpa/persistence/jdbc/Index.java>:36:
warning - @published is an unknown tag.
[WARNING] <https://hudson.apache.org/hudson/job/OpenJPA-trunk-deploy/org.apache.openjpa$openjpa-persistence-jdbc/ws/src/main/java/org/apache/openjpa/persistence/jdbc/IsolationLevel.java>:32:
warning - @published is an unknown tag.
[WARNING] <https://hudson.apache.org/hudson/job/OpenJPA-trunk-deploy/org.apache.openjpa$openjpa-persistence-jdbc/ws/src/main/java/org/apache/openjpa/persistence/jdbc/JDBCFetchPlan.java>:37:
warning - @published is an unknown tag.
[WARNING] <https://hudson.apache.org/hudson/job/OpenJPA-trunk-deploy/org.apache.openjpa$openjpa-persistence-jdbc/ws/src/main/java/org/apache/openjpa/persistence/jdbc/JDBCFetchPlanImpl.java>:45:
warning - @nojavadoc is an unknown tag.
[WARNING] <https://hudson.apache.org/hudson/job/OpenJPA-trunk-deploy/org.apache.openjpa$openjpa-persistence-jdbc/ws/src/main/java/org/apache/openjpa/persistence/jdbc/JDBCPersistenceProductDerivation.java>:46:
warning - @nojavadoc is an unknown tag.
[WARNING] <https://hudson.apache.org/hudson/job/OpenJPA-trunk-deploy/org.apache.openjpa$openjpa-persistence-jdbc/ws/src/main/java/org/apache/openjpa/persistence/jdbc/JoinSyntax.java>:29:
warning - @published is an unknown tag.
[WARNING] <https://hudson.apache.org/hudson/job/OpenJPA-trunk-deploy/org.apache.openjpa$openjpa-persistence-jdbc/ws/src/main/java/org/apache/openjpa/persistence/jdbc/LRSSizeAlgorithm.java>:31:
warning - @published is an unknown tag.
[WARNING] <https://hudson.apache.org/hudson/job/OpenJPA-trunk-deploy/org.apache.openjpa$openjpa-persistence-jdbc/ws/src/main/java/org/apache/openjpa/persistence/jdbc/MappingOverride.java>:36:
warning - @published is an unknown tag.
[WARNING] <https://hudson.apache.org/hudson/job/OpenJPA-trunk-deploy/org.apache.openjpa$openjpa-persistence-jdbc/ws/src/main/java/org/apache/openjpa/persistence/jdbc/MappingOverrides.java>:35:
warning - @published is an unknown tag.
[WARNING] <https://hudson.apache.org/hudson/job/OpenJPA-trunk-deploy/org.apache.openjpa$openjpa-persistence-jdbc/ws/src/main/java/org/apache/openjpa/persistence/jdbc/MappingTag.java>:32:
warning - @nojavadoc is an unknown tag.
[WARNING] <https://hudson.apache.org/hudson/job/OpenJPA-trunk-deploy/org.apache.openjpa$openjpa-persistence-jdbc/ws/src/main/java/org/apache/openjpa/persistence/jdbc/Nonpolymorphic.java>:36:
warning - @published is an unknown tag.
[WARNING] <https://hudson.apache.org/hudson/job/OpenJPA-trunk-deploy/org.apache.openjpa$openjpa-persistence-jdbc/ws/src/main/java/org/apache/openjpa/persistence/jdbc/NonpolymorphicType.java>:28:
warning - @published is an unknown tag.
[WARNING] <https://hudson.apache.org/hudson/job/OpenJPA-trunk-deploy/org.apache.openjpa$openjpa-persistence-jdbc/ws/src/main/java/org/apache/openjpa/persistence/jdbc/OrderColumn.java>:36:
warning - @published is an unknown tag.
[WARNING] <https://hudson.apache.org/hudson/job/OpenJPA-trunk-deploy/org.apache.openjpa$openjpa-persistence-jdbc/ws/src/main/java/org/apache/openjpa/persistence/jdbc/PersistenceMappingDefaults.java>:53:
warning - @nojavadoc is an unknown tag.
[WARNING] <https://hudson.apache.org/hudson/job/OpenJPA-trunk-deploy/org.apache.openjpa$openjpa-persistence-jdbc/ws/src/main/java/org/apache/openjpa/persistence/jdbc/PersistenceMappingFactory.java>:37:
warning - @nojavadoc is an unknown tag.
[WARNING] <https://hudson.apache.org/hudson/job/OpenJPA-trunk-deploy/org.apache.openjpa$openjpa-persistence-jdbc/ws/src/main/java/org/apache/openjpa/persistence/jdbc/ResultSetType.java>:32:
warning - @published is an unknown tag.
[WARNING] <https://hudson.apache.org/hudson/job/OpenJPA-trunk-deploy/org.apache.openjpa$openjpa-persistence-jdbc/ws/src/main/java/org/apache/openjpa/persistence/jdbc/Strategy.java>:35:
warning - @published is an unknown tag.
[WARNING] <https://hudson.apache.org/hudson/job/OpenJPA-trunk-deploy/org.apache.openjpa$openjpa-persistence-jdbc/ws/src/main/java/org/apache/openjpa/persistence/jdbc/SubclassFetchMode.java>:35:
warning - @published is an unknown tag.
[WARNING] <https://hudson.apache.org/hudson/job/OpenJPA-trunk-deploy/org.apache.openjpa$openjpa-persistence-jdbc/ws/src/main/java/org/apache/openjpa/persistence/jdbc/Unique.java>:36:
warning - @published is an unknown tag.
[WARNING] <https://hudson.apache.org/hudson/job/OpenJPA-trunk-deploy/org.apache.openjpa$openjpa-persistence-jdbc/ws/src/main/java/org/apache/openjpa/persistence/jdbc/VersionColumn.java>:35:
warning - @published is an unknown tag.
[WARNING] <https://hudson.apache.org/hudson/job/OpenJPA-trunk-deploy/org.apache.openjpa$openjpa-persistence-jdbc/ws/src/main/java/org/apache/openjpa/persistence/jdbc/VersionColumns.java>:35:
warning - @published is an unknown tag.
[WARNING] <https://hudson.apache.org/hudson/job/OpenJPA-trunk-deploy/org.apache.openjpa$openjpa-persistence-jdbc/ws/src/main/java/org/apache/openjpa/persistence/jdbc/VersionStrategy.java>:35:
warning - @published is an unknown tag.
[WARNING] <https://hudson.apache.org/hudson/job/OpenJPA-trunk-deploy/org.apache.openjpa$openjpa-persistence-jdbc/ws/src/main/java/org/apache/openjpa/persistence/jdbc/XJoinColumn.java>:36:
warning - @published is an unknown tag.
[WARNING] <https://hudson.apache.org/hudson/job/OpenJPA-trunk-deploy/org.apache.openjpa$openjpa-persistence-jdbc/ws/src/main/java/org/apache/openjpa/persistence/jdbc/XJoinColumns.java>:36:
warning - @published is an unknown tag.
[WARNING] <https://hudson.apache.org/hudson/job/OpenJPA-trunk-deploy/org.apache.openjpa$openjpa-persistence-jdbc/ws/src/main/java/org/apache/openjpa/persistence/jdbc/XMLPersistenceMappingParser.java>:80:
warning - @nojavadoc is an unknown tag.
[WARNING] <https://hudson.apache.org/hudson/job/OpenJPA-trunk-deploy/org.apache.openjpa$openjpa-persistence-jdbc/ws/src/main/java/org/apache/openjpa/persistence/jdbc/XMLPersistenceMappingParser.java>:1300:
warning - @param argument "embedType" is not a parameter name.
[WARNING] <https://hudson.apache.org/hudson/job/OpenJPA-trunk-deploy/org.apache.openjpa$openjpa-persistence-jdbc/ws/src/main/java/org/apache/openjpa/persistence/jdbc/XMLPersistenceMappingParser.java>:1300:
warning - @param argument "access" is not a parameter name.
[WARNING] <https://hudson.apache.org/hudson/job/OpenJPA-trunk-deploy/org.apache.openjpa$openjpa-persistence-jdbc/ws/src/main/java/org/apache/openjpa/persistence/jdbc/XMLPersistenceMappingSerializer.java>:68:
warning - @nojavadoc is an unknown tag.
[WARNING] <https://hudson.apache.org/hudson/job/OpenJPA-trunk-deploy/org.apache.openjpa$openjpa-persistence-jdbc/ws/src/main/java/org/apache/openjpa/persistence/jdbc/XSecondaryTable.java>:36:
warning - @published is an unknown tag.
[WARNING] <https://hudson.apache.org/hudson/job/OpenJPA-trunk-deploy/org.apache.openjpa$openjpa-persistence-jdbc/ws/src/main/java/org/apache/openjpa/persistence/jdbc/XSecondaryTables.java>:35:
warning - @published is an unknown tag.
[WARNING] <https://hudson.apache.org/hudson/job/OpenJPA-trunk-deploy/org.apache.openjpa$openjpa-persistence-jdbc/ws/src/main/java/org/apache/openjpa/persistence/jdbc/XTable.java>:35:
warning - @published is an unknown tag.
[HUDSON] Archiving javadoc
[INFO] Generating "Project License" report.
[INFO] Generating "Dependency Convergence" report.
[HUDSON] Archiving site from <https://hudson.apache.org/hudson/job/OpenJPA-trunk-deploy/org.apache.openjpa$openjpa-persistence-jdbc/ws/target/site>
to /home/hudson/hudson/jobs/OpenJPA-trunk-deploy/site/openjpa-persistence-jdbc
FATAL: Unable to copy site from <https://hudson.apache.org/hudson/job/OpenJPA-trunk-deploy/org.apache.openjpa$openjpa-persistence-jdbc/ws/target/site>
to /home/hudson/hudson/jobs/OpenJPA-trunk-deploy/site/openjpa-persistence-jdbc
hudson.util.IOException2: hudson.util.IOException2: Failed to extract <https://hudson.apache.org/hudson/job/OpenJPA-trunk-deploy/org.apache.openjpa$openjpa-persistence-jdbc/ws/target/site/**/*>
	at hudson.FilePath.copyRecursiveTo(FilePath.java:1474)
	at hudson.FilePath.copyRecursiveTo(FilePath.java:1399)
	at hudson.maven.reporters.MavenSiteArchiver.postExecute(MavenSiteArchiver.java:81)
	at hudson.maven.MavenModuleSetBuild$Builder.postExecute(MavenModuleSetBuild.java:772)
	at hudson.maven.MavenBuilder$Adapter.postExecute(MavenBuilder.java:300)
	at hudson.maven.agent.PluginManagerInterceptor$1MojoIntercepterImpl.callPost(PluginManagerInterceptor.java:170)
	at hudson.maven.agent.PluginManagerInterceptor.executeMojo(PluginManagerInterceptor.java:183)
	at org.apache.maven.lifecycle.DefaultLifecycleExecutor.executeGoals(DefaultLifecycleExecutor.java:694)
	at org.apache.maven.lifecycle.DefaultLifecycleExecutor.executeGoalWithLifecycle(DefaultLifecycleExecutor.java:556)
	at org.apache.maven.lifecycle.DefaultLifecycleExecutor.executeGoal(DefaultLifecycleExecutor.java:535)
	at org.apache.maven.lifecycle.DefaultLifecycleExecutor.executeGoalAndHandleFailures(DefaultLifecycleExecutor.java:387)
	at org.apache.maven.lifecycle.DefaultLifecycleExecutor.executeTaskSegments(DefaultLifecycleExecutor.java:348)
	at org.apache.maven.lifecycle.DefaultLifecycleExecutor.execute(DefaultLifecycleExecutor.java:180)
	at org.apache.maven.lifecycle.LifecycleExecutorInterceptor.execute(LifecycleExecutorInterceptor.java:65)
	at org.apache.maven.DefaultMaven.doExecute(DefaultMaven.java:328)
	at org.apache.maven.DefaultMaven.execute(DefaultMaven.java:138)
	at org.apache.maven.cli.MavenCli.main(MavenCli.java:362)
	at sun.reflect.NativeMethodAccessorImpl.invoke0(Native Method)
	at sun.reflect.NativeMethodAccessorImpl.invoke(NativeMethodAccessorImpl.java:39)
	at sun.reflect.DelegatingMethodAccessorImpl.invoke(DelegatingMethodAccessorImpl.java:25)
	at java.lang.reflect.Method.invoke(Method.java:597)
	at org.codehaus.classworlds.Launcher.launchEnhanced(Launcher.java:315)
	at org.codehaus.classworlds.Launcher.launch(Launcher.java:255)
	at hudson.maven.agent.Main.launch(Main.java:165)
	at hudson.maven.MavenBuilder.call(MavenBuilder.java:165)
	at hudson.maven.MavenModuleSetBuild$Builder.call(MavenModuleSetBuild.java:694)
	at hudson.maven.MavenModuleSetBuild$Builder.call(MavenModuleSetBuild.java:638)
	at hudson.remoting.UserRequest.perform(UserRequest.java:114)
	at hudson.remoting.UserRequest.perform(UserRequest.java:48)
	at hudson.remoting.Request$2.run(Request.java:270)
	at java.util.concurrent.Executors$RunnableAdapter.call(Executors.java:441)
	at java.util.concurrent.FutureTask$Sync.innerRun(FutureTask.java:303)
	at java.util.concurrent.FutureTask.run(FutureTask.java:138)
	at java.util.concurrent.ThreadPoolExecutor$Worker.runTask(ThreadPoolExecutor.java:886)
	at java.util.concurrent.ThreadPoolExecutor$Worker.run(ThreadPoolExecutor.java:908)
	at java.lang.Thread.run(Thread.java:619)
Caused by: java.util.concurrent.ExecutionException: hudson.util.IOException2: Failed to extract
<https://hudson.apache.org/hudson/job/OpenJPA-trunk-deploy/org.apache.openjpa$openjpa-persistence-jdbc/ws/target/site/**/*>
	at hudson.remoting.Channel$2.adapt(Channel.java:663)
	at hudson.remoting.Channel$2.adapt(Channel.java:658)
	at hudson.remoting.FutureAdapter.get(FutureAdapter.java:55)
	at hudson.FilePath.copyRecursiveTo(FilePath.java:1472)
	... 35 more
Caused by: hudson.util.IOException2: Failed to extract <https://hudson.apache.org/hudson/job/OpenJPA-trunk-deploy/org.apache.openjpa$openjpa-persistence-jdbc/ws/target/site/**/*>
	at hudson.FilePath.readFromTar(FilePath.java:1577)
	at hudson.FilePath.access$100(FilePath.java:159)
	at hudson.FilePath$32.invoke(FilePath.java:1463)
	at hudson.FilePath$32.invoke(FilePath.java:1460)
	at hudson.FilePath$FileCallableWrapper.call(FilePath.java:1899)
	... 9 more
Caused by: java.util.zip.ZipException: invalid stored block lengths
	at java.util.zip.InflaterInputStream.read(InflaterInputStream.java:147)
	at java.util.zip.GZIPInputStream.read(GZIPInputStream.java:92)
	at org.apache.tools.tar.TarBuffer.readBlock(TarBuffer.java:257)
	at org.apache.tools.tar.TarBuffer.readRecord(TarBuffer.java:223)
	at hudson.org.apache.tools.tar.TarInputStream.getNextEntry(TarInputStream.java:228)
	at hudson.FilePath.readFromTar(FilePath.java:1557)
	... 13 more


Mime
View raw message