openjpa-commits mailing list archives

Site index · List index
Message view « Date » · « Thread »
Top « Date » · « Thread »
From Apache Hudson Server <hud...@hudson.apache.org>
Subject Build failed in Hudson: OpenJPA-trunk #280
Date Wed, 27 Oct 2010 17:45:05 GMT
See <https://hudson.apache.org/hudson/job/OpenJPA-trunk/280/changes>

Changes:

[dwoods] OPENJPA-1314 Incorrect hashcode()/equals() implementation(s) in QueryResultCacheImpl.
 Patch contributed by Heath Thomann.

[curtisr7] OPENJPA-1856: Executing bulk updates should evict from DataCache.

[dwoods] OPENJPA-1313 Incorrect hashcode()/equals() implementation(s) in RowManagerImpl. 
Patch contributed by Heath Thomann.

[dwoods] OPENJPA-1312 Incorrect hashcode()/equals() implementation(s) in SelectImpl.  Patch
contributed by Heath Thomann.

------------------------------------------
[...truncated 2727 lines...]
	at org.apache.openjpa.persistence.test.AbstractPersistenceTestCase.runBare(AbstractPersistenceTestCase.java:538)
	at junit.framework.TestResult$1.protect(TestResult.java:106)
	at junit.framework.TestResult.runProtected(TestResult.java:124)
	at junit.framework.TestResult.run(TestResult.java:109)
	at junit.framework.TestCase.run(TestCase.java:118)
	at org.apache.openjpa.persistence.test.AbstractPersistenceTestCase.run(AbstractPersistenceTestCase.java:206)
	at junit.framework.TestSuite.runTest(TestSuite.java:208)
	at junit.framework.TestSuite.run(TestSuite.java:203)
	at sun.reflect.NativeMethodAccessorImpl.invoke0(Native Method)
	at sun.reflect.NativeMethodAccessorImpl.invoke(NativeMethodAccessorImpl.java:39)
	at sun.reflect.DelegatingMethodAccessorImpl.invoke(DelegatingMethodAccessorImpl.java:25)
	at java.lang.reflect.Method.invoke(Method.java:597)
	at org.apache.maven.surefire.junit.JUnitTestSet.execute(JUnitTestSet.java:213)
	at org.apache.maven.surefire.suite.AbstractDirectoryTestSuite.executeTestSet(AbstractDirectoryTestSuite.java:120)
	at org.apache.maven.surefire.suite.AbstractDirectoryTestSuite.execute(AbstractDirectoryTestSuite.java:103)
	at org.apache.maven.surefire.Surefire.run(Surefire.java:169)
	at sun.reflect.NativeMethodAccessorImpl.invoke0(Native Method)
	at sun.reflect.NativeMethodAccessorImpl.invoke(NativeMethodAccessorImpl.java:39)
	at sun.reflect.DelegatingMethodAccessorImpl.invoke(DelegatingMethodAccessorImpl.java:25)
	at java.lang.reflect.Method.invoke(Method.java:597)
	at org.apache.maven.surefire.booter.SurefireBooter.runSuitesInProcess(SurefireBooter.java:350)
	at org.apache.maven.surefire.booter.SurefireBooter.main(SurefireBooter.java:1021)
Caused by: java.sql.SQLException: Address: address ({address|Address=6, address|Address=5,
address|Address=4, address|Address=3, address|Address=2, address|Address=1, CompUser=0})
	at org.apache.openjpa.jdbc.sql.SelectImpl$SelectResult.findObject(SelectImpl.java:2450)
	at org.apache.openjpa.jdbc.sql.ResultSetResult.translate(ResultSetResult.java:497)
	at org.apache.openjpa.jdbc.sql.ResultSetResult.getObjectInternal(ResultSetResult.java:362)
	at org.apache.openjpa.jdbc.sql.AbstractResult.getObject(AbstractResult.java:696)
	at org.apache.openjpa.jdbc.meta.strats.PrimitiveFieldStrategy.getPrimaryKeyValue(PrimitiveFieldStrategy.java:305)
	at org.apache.openjpa.jdbc.meta.ClassMapping.getObjectId(ClassMapping.java:188)
	at org.apache.openjpa.jdbc.meta.ClassMapping.getObjectId(ClassMapping.java:147)
	at org.apache.openjpa.jdbc.kernel.JDBCStoreManager.load(JDBCStoreManager.java:1027)
	at org.apache.openjpa.jdbc.sql.AbstractResult.load(AbstractResult.java:280)
	at org.apache.openjpa.jdbc.sql.SelectImpl$SelectResult.load(SelectImpl.java:2376)
	at org.apache.openjpa.jdbc.meta.strats.RelationFieldStrategy.loadEagerJoin(RelationFieldStrategy.java:706)
	at org.apache.openjpa.jdbc.meta.FieldMapping.loadEagerJoin(FieldMapping.java:922)
	at org.apache.openjpa.jdbc.kernel.JDBCStoreManager.load(JDBCStoreManager.java:1107)
	at org.apache.openjpa.jdbc.kernel.JDBCStoreManager.load(JDBCStoreManager.java:1088)
	at org.apache.openjpa.jdbc.kernel.JDBCStoreManager.load(JDBCStoreManager.java:1063)
	at org.apache.openjpa.jdbc.kernel.JDBCStoreManager.initializeState(JDBCStoreManager.java:434)
	at org.apache.openjpa.jdbc.kernel.JDBCStoreManager.initialize(JDBCStoreManager.java:329)
	... 39 more

testSetPositionalParameterInNonIntutiveOrder(org.apache.openjpa.persistence.jpql.functions.TestSetParameter)
 Time elapsed: 3.974 sec  <<< ERROR!
<openjpa-2.1.0-SNAPSHOT-rsvn: Can't check path 'C:hudsonhudson-slaveworkspaceOpenJPA-trunk
runkopenjpa-lib..openjpa-persistence-jdbcsrc	estjavaorgapacheopenjpapersistenceinheritanceentitiesidmscjointablechardiscriminator.svn
ext-basePIdJTCDMSCMappedSuperclass.java.svn-base': The filename, directory name, or volume
label syntax is incorrect.   fatal general error> org.apache.openjpa.persistence.PersistenceException:
Address: address ({address|Address=6, address|Address=5, address|Address=4, address|Address=3,
address|Address=2, address|Address=1, CompUser=0})
FailedObject: org.apache.openjpa.persistence.common.apps.FemaleUser-1 [java.lang.String]
	at org.apache.openjpa.jdbc.sql.DBDictionary.narrow(DBDictionary.java:4869)
	at org.apache.openjpa.jdbc.sql.DBDictionary.newStoreException(DBDictionary.java:4829)
	at org.apache.openjpa.jdbc.sql.SQLExceptions.getStore(SQLExceptions.java:136)
	at org.apache.openjpa.jdbc.sql.SQLExceptions.getStore(SQLExceptions.java:86)
	at org.apache.openjpa.jdbc.kernel.JDBCStoreManager.initialize(JDBCStoreManager.java:334)
	at org.apache.openjpa.kernel.DelegatingStoreManager.initialize(DelegatingStoreManager.java:112)
	at org.apache.openjpa.kernel.ROPStoreManager.initialize(ROPStoreManager.java:57)
	at org.apache.openjpa.kernel.BrokerImpl.initialize(BrokerImpl.java:1014)
	at org.apache.openjpa.kernel.BrokerImpl.find(BrokerImpl.java:972)
	at org.apache.openjpa.kernel.BrokerImpl.find(BrokerImpl.java:889)
	at org.apache.openjpa.kernel.DelegatingBroker.find(DelegatingBroker.java:223)
	at org.apache.openjpa.persistence.EntityManagerImpl.find(EntityManagerImpl.java:477)
	at org.apache.openjpa.persistence.jpql.functions.TestSetParameter.verifyUpdate(TestSetParameter.java:156)
	at org.apache.openjpa.persistence.jpql.functions.TestSetParameter.testSetPositionalParameterInNonIntutiveOrder(TestSetParameter.java:94)
	at sun.reflect.NativeMethodAccessorImpl.invoke0(Native Method)
	at sun.reflect.NativeMethodAccessorImpl.invoke(NativeMethodAccessorImpl.java:39)
	at sun.reflect.DelegatingMethodAccessorImpl.invoke(DelegatingMethodAccessorImpl.java:25)
	at java.lang.reflect.Method.invoke(Method.java:597)
	at junit.framework.TestCase.runTest(TestCase.java:154)
	at org.apache.openjpa.persistence.test.AbstractPersistenceTestCase.runTest(AbstractPersistenceTestCase.java:575)
	at junit.framework.TestCase.runBare(TestCase.java:127)
	at org.apache.openjpa.persistence.test.AbstractPersistenceTestCase.runBare(AbstractPersistenceTestCase.java:562)
	at org.apache.openjpa.persistence.test.AbstractPersistenceTestCase.runBare(AbstractPersistenceTestCase.java:538)
	at junit.framework.TestResult$1.protect(TestResult.java:106)
	at junit.framework.TestResult.runProtected(TestResult.java:124)
	at junit.framework.TestResult.run(TestResult.java:109)
	at junit.framework.TestCase.run(TestCase.java:118)
	at org.apache.openjpa.persistence.test.AbstractPersistenceTestCase.run(AbstractPersistenceTestCase.java:206)
	at junit.framework.TestSuite.runTest(TestSuite.java:208)
	at junit.framework.TestSuite.run(TestSuite.java:203)
	at sun.reflect.NativeMethodAccessorImpl.invoke0(Native Method)
	at sun.reflect.NativeMethodAccessorImpl.invoke(NativeMethodAccessorImpl.java:39)
	at sun.reflect.DelegatingMethodAccessorImpl.invoke(DelegatingMethodAccessorImpl.java:25)
	at java.lang.reflect.Method.invoke(Method.java:597)
	at org.apache.maven.surefire.junit.JUnitTestSet.execute(JUnitTestSet.java:213)
	at org.apache.maven.surefire.suite.AbstractDirectoryTestSuite.executeTestSet(AbstractDirectoryTestSuite.java:120)
	at org.apache.maven.surefire.suite.AbstractDirectoryTestSuite.execute(AbstractDirectoryTestSuite.java:103)
	at org.apache.maven.surefire.Surefire.run(Surefire.java:169)
	at sun.reflect.NativeMethodAccessorImpl.invoke0(Native Method)
	at sun.reflect.NativeMethodAccessorImpl.invoke(NativeMethodAccessorImpl.java:39)
	at sun.reflect.DelegatingMethodAccessorImpl.invoke(DelegatingMethodAccessorImpl.java:25)
	at java.lang.reflect.Method.invoke(Method.java:597)
	at org.apache.maven.surefire.booter.SurefireBooter.runSuitesInProcess(SurefireBooter.java:350)
	at org.apache.maven.surefire.booter.SurefireBooter.main(SurefireBooter.java:1021)
Caused by: java.sql.SQLException: Address: address ({address|Address=6, address|Address=5,
address|Address=4, address|Address=3, address|Address=2, address|Address=1, CompUser=0})
	at org.apache.openjpa.jdbc.sql.SelectImpl$SelectResult.findObject(SelectImpl.java:2450)
	at org.apache.openjpa.jdbc.sql.ResultSetResult.translate(ResultSetResult.java:497)
	at org.apache.openjpa.jdbc.sql.ResultSetResult.getObjectInternal(ResultSetResult.java:362)
	at org.apache.openjpa.jdbc.sql.AbstractResult.getObject(AbstractResult.java:696)
	at org.apache.openjpa.jdbc.meta.strats.PrimitiveFieldStrategy.getPrimaryKeyValue(PrimitiveFieldStrategy.java:305)
	at org.apache.openjpa.jdbc.meta.ClassMapping.getObjectId(ClassMapping.java:188)
	at org.apache.openjpa.jdbc.meta.ClassMapping.getObjectId(ClassMapping.java:147)
	at org.apache.openjpa.jdbc.kernel.JDBCStoreManager.load(JDBCStoreManager.java:1027)
	at org.apache.openjpa.jdbc.sql.AbstractResult.load(AbstractResult.java:280)
	at org.apache.openjpa.jdbc.sql.SelectImpl$SelectResult.load(SelectImpl.java:2376)
	at org.apache.openjpa.jdbc.meta.strats.RelationFieldStrategy.loadEagerJoin(RelationFieldStrategy.java:706)
	at org.apache.openjpa.jdbc.meta.FieldMapping.loadEagerJoin(FieldMapping.java:922)
	at org.apache.openjpa.jdbc.kernel.JDBCStoreManager.load(JDBCStoreManager.java:1107)
	at org.apache.openjpa.jdbc.kernel.JDBCStoreManager.load(JDBCStoreManager.java:1088)
	at org.apache.openjpa.jdbc.kernel.JDBCStoreManager.load(JDBCStoreManager.java:1063)
	at org.apache.openjpa.jdbc.kernel.JDBCStoreManager.initializeState(JDBCStoreManager.java:434)
	at org.apache.openjpa.jdbc.kernel.JDBCStoreManager.initialize(JDBCStoreManager.java:329)
	... 39 more

testSetNamedParameter(org.apache.openjpa.persistence.jpql.functions.TestSetParameter)  Time
elapsed: 3.717 sec  <<< ERROR!
<openjpa-2.1.0-SNAPSHOT-rsvn: Can't check path 'C:hudsonhudson-slaveworkspaceOpenJPA-trunk
runkopenjpa-lib..openjpa-persistence-jdbcsrc	estjavaorgapacheopenjpapersistenceinheritanceentitiesidmscjointablechardiscriminator.svn
ext-basePIdJTCDMSCMappedSuperclass.java.svn-base': The filename, directory name, or volume
label syntax is incorrect.   fatal general error> org.apache.openjpa.persistence.PersistenceException:
Address: address ({address|Address=6, address|Address=5, address|Address=4, address|Address=3,
address|Address=2, address|Address=1, CompUser=0})
FailedObject: org.apache.openjpa.persistence.common.apps.FemaleUser-1 [java.lang.String]
	at org.apache.openjpa.jdbc.sql.DBDictionary.narrow(DBDictionary.java:4869)
	at org.apache.openjpa.jdbc.sql.DBDictionary.newStoreException(DBDictionary.java:4829)
	at org.apache.openjpa.jdbc.sql.SQLExceptions.getStore(SQLExceptions.java:136)
	at org.apache.openjpa.jdbc.sql.SQLExceptions.getStore(SQLExceptions.java:86)
	at org.apache.openjpa.jdbc.kernel.JDBCStoreManager.initialize(JDBCStoreManager.java:334)
	at org.apache.openjpa.kernel.DelegatingStoreManager.initialize(DelegatingStoreManager.java:112)
	at org.apache.openjpa.kernel.ROPStoreManager.initialize(ROPStoreManager.java:57)
	at org.apache.openjpa.kernel.BrokerImpl.initialize(BrokerImpl.java:1014)
	at org.apache.openjpa.kernel.BrokerImpl.find(BrokerImpl.java:972)
	at org.apache.openjpa.kernel.BrokerImpl.find(BrokerImpl.java:889)
	at org.apache.openjpa.kernel.DelegatingBroker.find(DelegatingBroker.java:223)
	at org.apache.openjpa.persistence.EntityManagerImpl.find(EntityManagerImpl.java:477)
	at org.apache.openjpa.persistence.jpql.functions.TestSetParameter.verifyUpdate(TestSetParameter.java:156)
	at org.apache.openjpa.persistence.jpql.functions.TestSetParameter.testSetNamedParameter(TestSetParameter.java:114)
	at sun.reflect.NativeMethodAccessorImpl.invoke0(Native Method)
	at sun.reflect.NativeMethodAccessorImpl.invoke(NativeMethodAccessorImpl.java:39)
	at sun.reflect.DelegatingMethodAccessorImpl.invoke(DelegatingMethodAccessorImpl.java:25)
	at java.lang.reflect.Method.invoke(Method.java:597)
	at junit.framework.TestCase.runTest(TestCase.java:154)
	at org.apache.openjpa.persistence.test.AbstractPersistenceTestCase.runTest(AbstractPersistenceTestCase.java:575)
	at junit.framework.TestCase.runBare(TestCase.java:127)
	at org.apache.openjpa.persistence.test.AbstractPersistenceTestCase.runBare(AbstractPersistenceTestCase.java:562)
	at org.apache.openjpa.persistence.test.AbstractPersistenceTestCase.runBare(AbstractPersistenceTestCase.java:538)
	at junit.framework.TestResult$1.protect(TestResult.java:106)
	at junit.framework.TestResult.runProtected(TestResult.java:124)
	at junit.framework.TestResult.run(TestResult.java:109)
	at junit.framework.TestCase.run(TestCase.java:118)
	at org.apache.openjpa.persistence.test.AbstractPersistenceTestCase.run(AbstractPersistenceTestCase.java:206)
	at junit.framework.TestSuite.runTest(TestSuite.java:208)
	at junit.framework.TestSuite.run(TestSuite.java:203)
	at sun.reflect.NativeMethodAccessorImpl.invoke0(Native Method)
	at sun.reflect.NativeMethodAccessorImpl.invoke(NativeMethodAccessorImpl.java:39)
	at sun.reflect.DelegatingMethodAccessorImpl.invoke(DelegatingMethodAccessorImpl.java:25)
	at java.lang.reflect.Method.invoke(Method.java:597)
	at org.apache.maven.surefire.junit.JUnitTestSet.execute(JUnitTestSet.java:213)
	at org.apache.maven.surefire.suite.AbstractDirectoryTestSuite.executeTestSet(AbstractDirectoryTestSuite.java:120)
	at org.apache.maven.surefire.suite.AbstractDirectoryTestSuite.execute(AbstractDirectoryTestSuite.java:103)
	at org.apache.maven.surefire.Surefire.run(Surefire.java:169)
	at sun.reflect.NativeMethodAccessorImpl.invoke0(Native Method)
	at sun.reflect.NativeMethodAccessorImpl.invoke(NativeMethodAccessorImpl.java:39)
	at sun.reflect.DelegatingMethodAccessorImpl.invoke(DelegatingMethodAccessorImpl.java:25)
	at java.lang.reflect.Method.invoke(Method.java:597)
	at org.apache.maven.surefire.booter.SurefireBooter.runSuitesInProcess(SurefireBooter.java:350)
	at org.apache.maven.surefire.booter.SurefireBooter.main(SurefireBooter.java:1021)
Caused by: java.sql.SQLException: Address: address ({address|Address=6, address|Address=5,
address|Address=4, address|Address=3, address|Address=2, address|Address=1, CompUser=0})
	at org.apache.openjpa.jdbc.sql.SelectImpl$SelectResult.findObject(SelectImpl.java:2450)
	at org.apache.openjpa.jdbc.sql.ResultSetResult.translate(ResultSetResult.java:497)
	at org.apache.openjpa.jdbc.sql.ResultSetResult.getObjectInternal(ResultSetResult.java:362)
	at org.apache.openjpa.jdbc.sql.AbstractResult.getObject(AbstractResult.java:696)
	at org.apache.openjpa.jdbc.meta.strats.PrimitiveFieldStrategy.getPrimaryKeyValue(PrimitiveFieldStrategy.java:305)
	at org.apache.openjpa.jdbc.meta.ClassMapping.getObjectId(ClassMapping.java:188)
	at org.apache.openjpa.jdbc.meta.ClassMapping.getObjectId(ClassMapping.java:147)
	at org.apache.openjpa.jdbc.kernel.JDBCStoreManager.load(JDBCStoreManager.java:1027)
	at org.apache.openjpa.jdbc.sql.AbstractResult.load(AbstractResult.java:280)
	at org.apache.openjpa.jdbc.sql.SelectImpl$SelectResult.load(SelectImpl.java:2376)
	at org.apache.openjpa.jdbc.meta.strats.RelationFieldStrategy.loadEagerJoin(RelationFieldStrategy.java:706)
	at org.apache.openjpa.jdbc.meta.FieldMapping.loadEagerJoin(FieldMapping.java:922)
	at org.apache.openjpa.jdbc.kernel.JDBCStoreManager.load(JDBCStoreManager.java:1107)
	at org.apache.openjpa.jdbc.kernel.JDBCStoreManager.load(JDBCStoreManager.java:1088)
	at org.apache.openjpa.jdbc.kernel.JDBCStoreManager.load(JDBCStoreManager.java:1063)
	at org.apache.openjpa.jdbc.kernel.JDBCStoreManager.initializeState(JDBCStoreManager.java:434)
	at org.apache.openjpa.jdbc.kernel.JDBCStoreManager.initialize(JDBCStoreManager.java:329)
	... 39 more

Running org.apache.openjpa.persistence.models.company.idclass.TestIdClassCompanyModel
0  test  INFO   [main] openjpa.Runtime - Starting OpenJPA 2.1.0-SNAPSHOT
1  test  INFO   [main] openjpa.jdbc.JDBC - Using dictionary class "org.apache.openjpa.jdbc.sql.DerbyDictionary".
Tests run: 1, Failures: 1, Errors: 0, Skipped: 0, Time elapsed: 15.859 sec <<< FAILURE!
testBasicQueries(org.apache.openjpa.persistence.models.company.idclass.TestIdClassCompanyModel)
 Time elapsed: 15.851 sec  <<< FAILURE!
junit.framework.AssertionFailedError: expected:<2> but was:<3543122>
	at junit.framework.Assert.fail(Assert.java:47)
	at junit.framework.Assert.failNotEquals(Assert.java:282)
	at junit.framework.Assert.assertEquals(Assert.java:64)
	at junit.framework.Assert.assertEquals(Assert.java:201)
	at junit.framework.Assert.assertEquals(Assert.java:207)
	at org.apache.openjpa.persistence.models.company.CompanyModelTest.verifyModel(CompanyModelTest.java:226)
	at org.apache.openjpa.persistence.models.company.CompanyModelTest.checkModel(CompanyModelTest.java:210)
	at org.apache.openjpa.persistence.models.company.CompanyModelTest.setUp(CompanyModelTest.java:57)
	at junit.framework.TestCase.runBare(TestCase.java:125)
	at org.apache.openjpa.persistence.test.AbstractPersistenceTestCase.runBare(AbstractPersistenceTestCase.java:562)
	at org.apache.openjpa.persistence.test.AbstractPersistenceTestCase.runBare(AbstractPersistenceTestCase.java:538)
	at junit.framework.TestResult$1.protect(TestResult.java:106)
	at junit.framework.TestResult.runProtected(TestResult.java:124)
	at junit.framework.TestResult.run(TestResult.java:109)
	at junit.framework.TestCase.run(TestCase.java:118)
	at org.apache.openjpa.persistence.test.AbstractPersistenceTestCase.run(AbstractPersistenceTestCase.java:206)
	at junit.framework.TestSuite.runTest(TestSuite.java:208)
	at junit.framework.TestSuite.run(TestSuite.java:203)
	at sun.reflect.NativeMethodAccessorImpl.invoke0(Native Method)
	at sun.reflect.NativeMethodAccessorImpl.invoke(NativeMethodAccessorImpl.java:39)
	at sun.reflect.DelegatingMethodAccessorImpl.invoke(DelegatingMethodAccessorImpl.java:25)
	at java.lang.reflect.Method.invoke(Method.java:597)
	at org.apache.maven.surefire.junit.JUnitTestSet.execute(JUnitTestSet.java:213)
	at org.apache.maven.surefire.suite.AbstractDirectoryTestSuite.executeTestSet(AbstractDirectoryTestSuite.java:120)
	at org.apache.maven.surefire.suite.AbstractDirectoryTestSuite.execute(AbstractDirectoryTestSuite.java:103)
	at org.apache.maven.surefire.Surefire.run(Surefire.java:169)
	at sun.reflect.NativeMethodAccessorImpl.invoke0(Native Method)
	at sun.reflect.NativeMethodAccessorImpl.invoke(NativeMethodAccessorImpl.java:39)
	at sun.reflect.DelegatingMethodAccessorImpl.invoke(DelegatingMethodAccessorImpl.java:25)
	at java.lang.reflect.Method.invoke(Method.java:597)
	at org.apache.maven.surefire.booter.SurefireBooter.runSuitesInProcess(SurefireBooter.java:350)
	at org.apache.maven.surefire.booter.SurefireBooter.main(SurefireBooter.java:1021)

Running org.apache.openjpa.persistence.criteria.TestFetchJoin
1  test  INFO   [main] openjpa.jdbc.JDBC - Using dictionary class "org.apache.openjpa.jdbc.sql.DerbyDictionary".
11  test  INFO   [main] openjpa.Runtime - Starting OpenJPA 2.1.0-SNAPSHOT
JPQL:[SELECT e FROM Employee e INNER JOIN FETCH e.department]
CQL :[SELECT e FROM Employee e INNER JOIN FETCH e.department
Build timed out. Aborting
Process 1288132049380 is killed.
[HUDSON] Recording test results
[INFO] ------------------------------------------------------------------------
[ERROR] FATAL ERROR
[INFO] ------------------------------------------------------------------------
[INFO] Unable to call isArchivingDisabled. Invalid object ID 15
[INFO] ------------------------------------------------------------------------
[INFO] Trace
java.lang.IllegalStateException: Unable to call isArchivingDisabled. Invalid object ID 15
	at hudson.remoting.RemoteInvocationHandler$RPCRequest.perform(RemoteInvocationHandler.java:268)
	at hudson.remoting.RemoteInvocationHandler$RPCRequest.call(RemoteInvocationHandler.java:255)
	at hudson.remoting.RemoteInvocationHandler$RPCRequest.call(RemoteInvocationHandler.java:215)
	at hudson.remoting.UserRequest.perform(UserRequest.java:114)
	at hudson.remoting.UserRequest.perform(UserRequest.java:48)
	at hudson.remoting.Request$2.run(Request.java:270)
	at java.util.concurrent.Executors$RunnableAdapter.call(Executors.java:441)
	at java.util.concurrent.FutureTask$Sync.innerRun(FutureTask.java:303)
	at java.util.concurrent.FutureTask.run(FutureTask.java:138)
	at java.util.concurrent.ThreadPoolExecutor$Worker.runTask(ThreadPoolExecutor.java:886)
	at java.util.concurrent.ThreadPoolExecutor$Worker.run(ThreadPoolExecutor.java:908)
	at java.lang.Thread.run(Thread.java:619)
[INFO] ------------------------------------------------------------------------
[INFO] Total time: 147 minutes 2 seconds
[INFO] Finished at: Wed Oct 27 01:44:55 BST 2010
[INFO] Final Memory: 153M/651M
[INFO] ------------------------------------------------------------------------
channel stopped
Process leaked file descriptors. See http://hudson.gotdns.com/wiki/display/HUDSON/Spawning+processes+from+build
for more information


Mime
View raw message