openjpa-commits mailing list archives

Site index · List index
Message view « Date » · « Thread »
Top « Date » · « Thread »
From Apache Hudson Server <hud...@hudson.apache.org>
Subject Build failed in Hudson: OpenJPA-trunk-deploy » OpenJPA Slice #28
Date Tue, 12 Oct 2010 08:28:38 GMT
See <https://hudson.apache.org/hudson/job/OpenJPA-trunk-deploy/org.apache.openjpa$openjpa-slice/28/>

------------------------------------------
[...truncated 200 lines...]
Tests run: 2, Failures: 0, Errors: 0, Skipped: 0, Time elapsed: 3.244 sec
Running org.apache.openjpa.slice.TestBasic
0  slice  INFO   [main] openjpa.Runtime - Detected slices "[One, Two]" in configuration.
1  slice  INFO   [main] openjpa.jdbc.JDBC - Using dictionary class "org.apache.openjpa.jdbc.sql.DerbyDictionary".
4  slice  INFO   [main] openjpa.Runtime - Starting OpenJPA Slice 2.1.0-SNAPSHOT
4  slice.One  INFO   [main] openjpa.jdbc.JDBC - Using dictionary class "org.apache.openjpa.jdbc.sql.DerbyDictionary".
4  slice.Two  INFO   [main] openjpa.jdbc.JDBC - Using dictionary class "org.apache.openjpa.jdbc.sql.DerbyDictionary".
0  slice  INFO   [main] openjpa.Runtime - Detected slices "[One, Two]" in configuration.
2  slice  INFO   [main] openjpa.jdbc.JDBC - Using dictionary class "org.apache.openjpa.jdbc.sql.DerbyDictionary".
5  slice  INFO   [main] openjpa.Runtime - Starting OpenJPA Slice 2.1.0-SNAPSHOT
3  slice.One  INFO   [main] openjpa.jdbc.JDBC - Using dictionary class "org.apache.openjpa.jdbc.sql.DerbyDictionary".
4  slice.Two  INFO   [main] openjpa.jdbc.JDBC - Using dictionary class "org.apache.openjpa.jdbc.sql.DerbyDictionary".
1  slice  INFO   [main] openjpa.Runtime - Detected slices "[One, Two]" in configuration.
2  slice  INFO   [main] openjpa.jdbc.JDBC - Using dictionary class "org.apache.openjpa.jdbc.sql.DerbyDictionary".
5  slice  INFO   [main] openjpa.Runtime - Starting OpenJPA Slice 2.1.0-SNAPSHOT
3  slice.One  INFO   [main] openjpa.jdbc.JDBC - Using dictionary class "org.apache.openjpa.jdbc.sql.DerbyDictionary".
3  slice.Two  INFO   [main] openjpa.jdbc.JDBC - Using dictionary class "org.apache.openjpa.jdbc.sql.DerbyDictionary".
0  slice  INFO   [main] openjpa.Runtime - Detected slices "[One, Two]" in configuration.
1  slice  INFO   [main] openjpa.jdbc.JDBC - Using dictionary class "org.apache.openjpa.jdbc.sql.DerbyDictionary".
5  slice  INFO   [main] openjpa.Runtime - Starting OpenJPA Slice 2.1.0-SNAPSHOT
4  slice.One  INFO   [main] openjpa.jdbc.JDBC - Using dictionary class "org.apache.openjpa.jdbc.sql.DerbyDictionary".
4  slice.Two  INFO   [main] openjpa.jdbc.JDBC - Using dictionary class "org.apache.openjpa.jdbc.sql.DerbyDictionary".
0  slice  INFO   [main] openjpa.Runtime - Detected slices "[One, Two]" in configuration.
2  slice  INFO   [main] openjpa.jdbc.JDBC - Using dictionary class "org.apache.openjpa.jdbc.sql.DerbyDictionary".
5  slice  INFO   [main] openjpa.Runtime - Starting OpenJPA Slice 2.1.0-SNAPSHOT
3  slice.One  INFO   [main] openjpa.jdbc.JDBC - Using dictionary class "org.apache.openjpa.jdbc.sql.DerbyDictionary".
4  slice.Two  INFO   [main] openjpa.jdbc.JDBC - Using dictionary class "org.apache.openjpa.jdbc.sql.DerbyDictionary".
0  slice  INFO   [main] openjpa.Runtime - Detected slices "[One, Two]" in configuration.
1  slice  INFO   [main] openjpa.jdbc.JDBC - Using dictionary class "org.apache.openjpa.jdbc.sql.DerbyDictionary".
4  slice  INFO   [main] openjpa.Runtime - Starting OpenJPA Slice 2.1.0-SNAPSHOT
3  slice.One  INFO   [main] openjpa.jdbc.JDBC - Using dictionary class "org.apache.openjpa.jdbc.sql.DerbyDictionary".
3  slice.Two  INFO   [main] openjpa.jdbc.JDBC - Using dictionary class "org.apache.openjpa.jdbc.sql.DerbyDictionary".
0  slice  INFO   [main] openjpa.Runtime - Detected slices "[One, Two]" in configuration.
1  slice  INFO   [main] openjpa.jdbc.JDBC - Using dictionary class "org.apache.openjpa.jdbc.sql.DerbyDictionary".
4  slice  INFO   [main] openjpa.Runtime - Starting OpenJPA Slice 2.1.0-SNAPSHOT
4  slice.One  INFO   [main] openjpa.jdbc.JDBC - Using dictionary class "org.apache.openjpa.jdbc.sql.DerbyDictionary".
4  slice.Two  INFO   [main] openjpa.jdbc.JDBC - Using dictionary class "org.apache.openjpa.jdbc.sql.DerbyDictionary".
0  slice  INFO   [main] openjpa.Runtime - Detected slices "[One, Two]" in configuration.
2  slice  INFO   [main] openjpa.jdbc.JDBC - Using dictionary class "org.apache.openjpa.jdbc.sql.DerbyDictionary".
5  slice  INFO   [main] openjpa.Runtime - Starting OpenJPA Slice 2.1.0-SNAPSHOT
4  slice.One  INFO   [main] openjpa.jdbc.JDBC - Using dictionary class "org.apache.openjpa.jdbc.sql.DerbyDictionary".
3  slice.Two  INFO   [main] openjpa.jdbc.JDBC - Using dictionary class "org.apache.openjpa.jdbc.sql.DerbyDictionary".
1  slice  INFO   [main] openjpa.Runtime - Detected slices "[One, Two]" in configuration.
2  slice  INFO   [main] openjpa.jdbc.JDBC - Using dictionary class "org.apache.openjpa.jdbc.sql.DerbyDictionary".
5  slice  INFO   [main] openjpa.Runtime - Starting OpenJPA Slice 2.1.0-SNAPSHOT
4  slice.One  INFO   [main] openjpa.jdbc.JDBC - Using dictionary class "org.apache.openjpa.jdbc.sql.DerbyDictionary".
4  slice.Two  INFO   [main] openjpa.jdbc.JDBC - Using dictionary class "org.apache.openjpa.jdbc.sql.DerbyDictionary".
0  slice  INFO   [main] openjpa.Runtime - Detected slices "[One, Two]" in configuration.
1  slice  INFO   [main] openjpa.jdbc.JDBC - Using dictionary class "org.apache.openjpa.jdbc.sql.DerbyDictionary".
4  slice  INFO   [main] openjpa.Runtime - Starting OpenJPA Slice 2.1.0-SNAPSHOT
4  slice.One  INFO   [main] openjpa.jdbc.JDBC - Using dictionary class "org.apache.openjpa.jdbc.sql.DerbyDictionary".
4  slice.Two  INFO   [main] openjpa.jdbc.JDBC - Using dictionary class "org.apache.openjpa.jdbc.sql.DerbyDictionary".
0  slice  INFO   [main] openjpa.Runtime - Detected slices "[One, Two]" in configuration.
1  slice  INFO   [main] openjpa.jdbc.JDBC - Using dictionary class "org.apache.openjpa.jdbc.sql.DerbyDictionary".
5  slice  INFO   [main] openjpa.Runtime - Starting OpenJPA Slice 2.1.0-SNAPSHOT
4  slice.One  INFO   [main] openjpa.jdbc.JDBC - Using dictionary class "org.apache.openjpa.jdbc.sql.DerbyDictionary".
4  slice.Two  INFO   [main] openjpa.jdbc.JDBC - Using dictionary class "org.apache.openjpa.jdbc.sql.DerbyDictionary".
0  slice  INFO   [main] openjpa.Runtime - Detected slices "[One, Two]" in configuration.
2  slice  INFO   [main] openjpa.jdbc.JDBC - Using dictionary class "org.apache.openjpa.jdbc.sql.DerbyDictionary".
5  slice  INFO   [main] openjpa.Runtime - Starting OpenJPA Slice 2.1.0-SNAPSHOT
4  slice.One  INFO   [main] openjpa.jdbc.JDBC - Using dictionary class "org.apache.openjpa.jdbc.sql.DerbyDictionary".
4  slice.Two  INFO   [main] openjpa.jdbc.JDBC - Using dictionary class "org.apache.openjpa.jdbc.sql.DerbyDictionary".
1  slice.newslice  INFO   [main] openjpa.jdbc.JDBC - Using dictionary class "org.apache.openjpa.jdbc.sql.DerbyDictionary".
Tests run: 12, Failures: 0, Errors: 0, Skipped: 0, Time elapsed: 6.132 sec
Running org.apache.openjpa.slice.TestXA
0  XA  INFO   [main] openjpa.Runtime - Detected slices "[One, Two]" in configuration.
1  XA  INFO   [main] openjpa.jdbc.JDBC - Using dictionary class "org.apache.openjpa.jdbc.sql.DerbyDictionary".
3  XA  INFO   [main] openjpa.Runtime - Starting OpenJPA Slice 2.1.0-SNAPSHOT
3  XA.One  INFO   [main] openjpa.jdbc.JDBC - Using dictionary class "org.apache.openjpa.jdbc.sql.DerbyDictionary".
4  XA.Two  INFO   [main] openjpa.jdbc.JDBC - Using dictionary class "org.apache.openjpa.jdbc.sql.DerbyDictionary".
0  XA  INFO   [main] openjpa.Runtime - Detected slices "[One, Two]" in configuration.
1  XA  INFO   [main] openjpa.jdbc.JDBC - Using dictionary class "org.apache.openjpa.jdbc.sql.DerbyDictionary".
4  XA  INFO   [main] openjpa.Runtime - Starting OpenJPA Slice 2.1.0-SNAPSHOT
3  XA.One  INFO   [main] openjpa.jdbc.JDBC - Using dictionary class "org.apache.openjpa.jdbc.sql.DerbyDictionary".
4  XA.Two  INFO   [main] openjpa.jdbc.JDBC - Using dictionary class "org.apache.openjpa.jdbc.sql.DerbyDictionary".
0  XA  INFO   [main] openjpa.Runtime - Detected slices "[One, Two]" in configuration.
1  XA  INFO   [main] openjpa.jdbc.JDBC - Using dictionary class "org.apache.openjpa.jdbc.sql.DerbyDictionary".
4  XA  INFO   [main] openjpa.Runtime - Starting OpenJPA Slice 2.1.0-SNAPSHOT
4  XA.One  INFO   [main] openjpa.jdbc.JDBC - Using dictionary class "org.apache.openjpa.jdbc.sql.DerbyDictionary".
3  XA.Two  INFO   [main] openjpa.jdbc.JDBC - Using dictionary class "org.apache.openjpa.jdbc.sql.DerbyDictionary".
Tests run: 3, Failures: 0, Errors: 0, Skipped: 0, Time elapsed: 0.117 sec
Running org.apache.openjpa.slice.TestQueryTargetPolicy
0  ordering  WARN   [main] openjpa.Runtime - Slice identifiers are not explicitly listed via
"openjpa.slice.Names" property.The configuration will be scanned to determine slice identifiers.
1  ordering  INFO   [main] openjpa.Runtime - Detected slices "[Even, Odd]" in configuration.
2  ordering  INFO   [main] openjpa.jdbc.JDBC - Using dictionary class "org.apache.openjpa.jdbc.sql.DerbyDictionary".
4  ordering  INFO   [main] openjpa.Runtime - Starting OpenJPA Slice 2.1.0-SNAPSHOT
3  ordering.Even  INFO   [main] openjpa.jdbc.JDBC - Using dictionary class "org.apache.openjpa.jdbc.sql.DerbyDictionary".
4  ordering.Odd  INFO   [main] openjpa.jdbc.JDBC - Using dictionary class "org.apache.openjpa.jdbc.sql.DerbyDictionary".
Tests run: 1, Failures: 0, Errors: 0, Skipped: 0, Time elapsed: 0.156 sec
Running org.apache.openjpa.slice.TestReplication
0  replication  INFO   [main] openjpa.Runtime - Detected slices "[One, Two]" in configuration.
1  replication  INFO   [main] openjpa.jdbc.JDBC - Using dictionary class "org.apache.openjpa.jdbc.sql.DerbyDictionary".
4  replication  INFO   [main] openjpa.Runtime - Starting OpenJPA Slice 2.1.0-SNAPSHOT
3  replication.One  INFO   [main] openjpa.jdbc.JDBC - Using dictionary class "org.apache.openjpa.jdbc.sql.DerbyDictionary".
4  replication.Two  INFO   [main] openjpa.jdbc.JDBC - Using dictionary class "org.apache.openjpa.jdbc.sql.DerbyDictionary".
0  replication  INFO   [main] openjpa.Runtime - Detected slices "[One, Two]" in configuration.
1  replication  INFO   [main] openjpa.jdbc.JDBC - Using dictionary class "org.apache.openjpa.jdbc.sql.DerbyDictionary".
4  replication  INFO   [main] openjpa.Runtime - Starting OpenJPA Slice 2.1.0-SNAPSHOT
3  replication.One  INFO   [main] openjpa.jdbc.JDBC - Using dictionary class "org.apache.openjpa.jdbc.sql.DerbyDictionary".
3  replication.Two  INFO   [main] openjpa.jdbc.JDBC - Using dictionary class "org.apache.openjpa.jdbc.sql.DerbyDictionary".
0  replication  INFO   [main] openjpa.Runtime - Detected slices "[One, Two]" in configuration.
1  replication  INFO   [main] openjpa.jdbc.JDBC - Using dictionary class "org.apache.openjpa.jdbc.sql.DerbyDictionary".
3  replication  INFO   [main] openjpa.Runtime - Starting OpenJPA Slice 2.1.0-SNAPSHOT
3  replication.One  INFO   [main] openjpa.jdbc.JDBC - Using dictionary class "org.apache.openjpa.jdbc.sql.DerbyDictionary".
3  replication.Two  INFO   [main] openjpa.jdbc.JDBC - Using dictionary class "org.apache.openjpa.jdbc.sql.DerbyDictionary".
Tests run: 3, Failures: 0, Errors: 0, Skipped: 0, Time elapsed: 1.069 sec

Results :

Tests run: 43, Failures: 0, Errors: 0, Skipped: 0

[HUDSON] Recording test results
[INFO] [jar:jar {execution: default-jar}]
[INFO] Building jar: <https://hudson.apache.org/hudson/job/OpenJPA-trunk-deploy/org.apache.openjpa$openjpa-slice/ws/target/openjpa-slice-2.1.0-SNAPSHOT.jar>
[INFO] [jar:jar {execution: default-jar}]
[INFO] [jar:test-jar {execution: attach-tests}]
[INFO] Building jar: <https://hudson.apache.org/hudson/job/OpenJPA-trunk-deploy/org.apache.openjpa$openjpa-slice/ws/target/openjpa-slice-2.1.0-SNAPSHOT-tests.jar>
[INFO] [ianal:verify-legal-files {execution: default}]
[INFO] Checking legal files in: openjpa-slice-2.1.0-SNAPSHOT.jar
[INFO] Checking legal files in: openjpa-slice-2.1.0-SNAPSHOT-tests.jar
[INFO] [apache-rat:check {execution: default}]
[INFO] Exclude: **/.*/**
[INFO] Exclude: **/target/**/*
[INFO] [install:install {execution: default-install}]
[INFO] Installing <https://hudson.apache.org/hudson/job/OpenJPA-trunk-deploy/org.apache.openjpa$openjpa-slice/ws/target/openjpa-slice-2.1.0-SNAPSHOT.jar>
to /home/hudson/.m2/repository/org/apache/openjpa/openjpa-slice/2.1.0-SNAPSHOT/openjpa-slice-2.1.0-SNAPSHOT.jar
[INFO] Installing <https://hudson.apache.org/hudson/job/OpenJPA-trunk-deploy/org.apache.openjpa$openjpa-slice/ws/target/openjpa-slice-2.1.0-SNAPSHOT-tests.jar>
to /home/hudson/.m2/repository/org/apache/openjpa/openjpa-slice/2.1.0-SNAPSHOT/openjpa-slice-2.1.0-SNAPSHOT-tests.jar
[INFO] [deploy:deploy {execution: default-deploy}]
[INFO] Retrieving previous build number from apache.snapshots.https
Uploading: https://repository.apache.org/content/repositories/snapshots/org/apache/openjpa/openjpa-slice/2.1.0-SNAPSHOT/openjpa-slice-2.1.0-20101012.064851-77.jar
81K uploaded  (openjpa-slice-2.1.0-20101012.064851-77.jar)
[INFO] Retrieving previous metadata from apache.snapshots.https
[INFO] Uploading repository metadata for: 'snapshot org.apache.openjpa:openjpa-slice:2.1.0-SNAPSHOT'
[INFO] Uploading project information for openjpa-slice 2.1.0-20101012.064851-77
[INFO] Retrieving previous metadata from apache.snapshots.https
[INFO] Uploading repository metadata for: 'artifact org.apache.openjpa:openjpa-slice'
[INFO] Retrieving previous build number from apache.snapshots.https
Uploading: https://repository.apache.org/content/repositories/snapshots/org/apache/openjpa/openjpa-slice/2.1.0-SNAPSHOT/openjpa-slice-2.1.0-20101012.064851-77-tests.jar
81K uploaded  (openjpa-slice-2.1.0-20101012.064851-77-tests.jar)
[INFO] Preparing javadoc:javadoc
[WARNING] Removing: javadoc from forked lifecycle, to prevent recursive invocation.
[HUDSON] Archiving <https://hudson.apache.org/hudson/job/OpenJPA-trunk-deploy/org.apache.openjpa$openjpa-slice/ws/pom.xml>
to /home/hudson/hudson/jobs/OpenJPA-trunk-deploy/modules/org.apache.openjpa$openjpa-slice/builds/2010-10-12_06-47-46/archive/org.apache.openjpa/openjpa-slice/2.1.0-SNAPSHOT/pom.xml
[HUDSON] Archiving <https://hudson.apache.org/hudson/job/OpenJPA-trunk-deploy/org.apache.openjpa$openjpa-slice/ws/target/openjpa-slice-2.1.0-SNAPSHOT.jar>
to /home/hudson/hudson/jobs/OpenJPA-trunk-deploy/modules/org.apache.openjpa$openjpa-slice/builds/2010-10-12_06-47-46/archive/org.apache.openjpa/openjpa-slice/2.1.0-20101012.064851-77/openjpa-slice-2.1.0-SNAPSHOT.jar
[HUDSON] Archiving <https://hudson.apache.org/hudson/job/OpenJPA-trunk-deploy/org.apache.openjpa$openjpa-slice/ws/target/openjpa-slice-2.1.0-SNAPSHOT-tests.jar>
to /home/hudson/hudson/jobs/OpenJPA-trunk-deploy/modules/org.apache.openjpa$openjpa-slice/builds/2010-10-12_06-47-46/archive/org.apache.openjpa/openjpa-slice/2.1.0-20101012.064851-77/openjpa-slice-2.1.0-SNAPSHOT-tests.jar
[INFO] [buildnumber:create {execution: default}]
[INFO] [enforcer:enforce {execution: default}]
[INFO] [site:site {execution: default-site}]
[INFO] Parent project loaded from repository.
[INFO] Generating "Issue Tracking" report.
[INFO] Generating "Project Team" report.
[INFO] Generating "Dependency Management" report.
[INFO] Generating "Continuous Integration" report.
[INFO] Generating "Project Plugins" report.
[INFO] Generating "Dependencies" report.
Downloading: http://repo1.maven.org/maven2/commons-collections/commons-collections/3.2.1/commons-collections-3.2.1.jar
Downloading: http://repo1.maven.org/maven2/commons-lang/commons-lang/2.4/commons-lang-2.4.jar
Downloading: http://repo1.maven.org/maven2/commons-pool/commons-pool/1.5.4/commons-pool-1.5.4.jar
Downloading: http://repo1.maven.org/maven2/net/sourceforge/serp/serp/1.13.1/serp-1.13.1.jar
[ERROR] Artifact: org.apache.geronimo.specs:geronimo-jms_1.1_spec:jar:1.1.1 has no file.
[ERROR] Artifact: org.apache.geronimo.specs:geronimo-jta_1.1_spec:jar:1.1.1 has no file.
[ERROR] Artifact: org.apache.openjpa:openjpa-lib:jar:2.1.0-SNAPSHOT has no file.
Downloading: http://repository.apache.org/snapshots/org/apache/openjpa/openjpa-lib/2.1.0-SNAPSHOT/openjpa-lib-2.1.0-20101012.064851-82.jar
[INFO] Generating "Source Repository" report.
[INFO] Generating "Plugin Management" report.
[INFO] Generating "Mailing Lists" report.
[INFO] Generating "Project Summary" report.
[INFO] Generating "About" report.
[INFO] Generating "JavaDocs" report.
[ERROR] Error fetching link: /home/hudson/hudson-slave/workspace/OpenJPA-trunk-deploy/trunk/openjpa-persistence-locking/target/site/apidocs/package-list.
Ignored it.
[ERROR] Error fetching link: /home/hudson/hudson-slave/workspace/OpenJPA-trunk-deploy/trunk/openjpa/target/site/apidocs/package-list.
Ignored it.
[ERROR] Error fetching link: /home/hudson/hudson-slave/workspace/OpenJPA-trunk-deploy/trunk/openjpa-all/target/site/apidocs/package-list.
Ignored it.
[ERROR] Error fetching link: /home/hudson/hudson-slave/workspace/OpenJPA-trunk-deploy/trunk/openjpa-integration/daytrader/target/site/apidocs/package-list.
Ignored it.
[ERROR] Error fetching link: /home/hudson/hudson-slave/workspace/OpenJPA-trunk-deploy/trunk/openjpa-integration/slf4j/target/site/apidocs/package-list.
Ignored it.
[ERROR] Error fetching link: /home/hudson/hudson-slave/workspace/OpenJPA-trunk-deploy/trunk/openjpa-integration/validation/target/site/apidocs/package-list.
Ignored it.
[ERROR] Error fetching link: /home/hudson/hudson-slave/workspace/OpenJPA-trunk-deploy/trunk/openjpa-integration/jmx/target/site/apidocs/package-list.
Ignored it.
[INFO] 
5 warnings
[WARNING] Javadoc Warnings
[WARNING] <https://hudson.apache.org/hudson/job/OpenJPA-trunk-deploy/org.apache.openjpa$openjpa-slice/ws/src/main/java/org/apache/openjpa/slice/DistributedBrokerFactory.java>:46:
warning - Tag @see: can't find addSlice(String, Map) in org.apache.openjpa.slice.DistributedConfiguration
[WARNING] <https://hudson.apache.org/hudson/job/OpenJPA-trunk-deploy/org.apache.openjpa$openjpa-slice/ws/src/main/java/org/apache/openjpa/slice/DistributedConfiguration.java>:57:
warning - @return tag has no arguments.
[WARNING] <https://hudson.apache.org/hudson/job/OpenJPA-trunk-deploy/org.apache.openjpa$openjpa-slice/ws/src/main/java/org/apache/openjpa/slice/DistributedStoreManager.java>:39:
warning - Tag @see: can't find addSlice(String, Map) in org.apache.openjpa.slice.DistributedBroker
[WARNING] <https://hudson.apache.org/hudson/job/OpenJPA-trunk-deploy/org.apache.openjpa$openjpa-slice/ws/src/main/java/org/apache/openjpa/slice/DistributedStoreManager.java>:39:
warning - @param argument "name" is not a parameter name.
[WARNING] <https://hudson.apache.org/hudson/job/OpenJPA-trunk-deploy/org.apache.openjpa$openjpa-slice/ws/src/main/java/org/apache/openjpa/slice/SliceInfo.java>:88:
warning - @return tag has no arguments.
[HUDSON] Archiving javadoc
[INFO] Generating "Project License" report.
[INFO] Generating "Dependency Convergence" report.
[HUDSON] Archiving site from <https://hudson.apache.org/hudson/job/OpenJPA-trunk-deploy/org.apache.openjpa$openjpa-slice/ws/target/site>
to /home/hudson/hudson/jobs/OpenJPA-trunk-deploy/site/openjpa-slice
FATAL: Unable to copy site from <https://hudson.apache.org/hudson/job/OpenJPA-trunk-deploy/org.apache.openjpa$openjpa-slice/ws/target/site>
to /home/hudson/hudson/jobs/OpenJPA-trunk-deploy/site/openjpa-slice
hudson.util.IOException2: hudson.util.IOException2: Failed to extract <https://hudson.apache.org/hudson/job/OpenJPA-trunk-deploy/org.apache.openjpa$openjpa-slice/ws/target/site/**/*>
	at hudson.FilePath.copyRecursiveTo(FilePath.java:1474)
	at hudson.FilePath.copyRecursiveTo(FilePath.java:1399)
	at hudson.maven.reporters.MavenSiteArchiver.postExecute(MavenSiteArchiver.java:81)
	at hudson.maven.MavenModuleSetBuild$Builder.postExecute(MavenModuleSetBuild.java:772)
	at hudson.maven.MavenBuilder$Adapter.postExecute(MavenBuilder.java:300)
	at hudson.maven.agent.PluginManagerInterceptor$1MojoIntercepterImpl.callPost(PluginManagerInterceptor.java:170)
	at hudson.maven.agent.PluginManagerInterceptor.executeMojo(PluginManagerInterceptor.java:183)
	at org.apache.maven.lifecycle.DefaultLifecycleExecutor.executeGoals(DefaultLifecycleExecutor.java:694)
	at org.apache.maven.lifecycle.DefaultLifecycleExecutor.executeGoalWithLifecycle(DefaultLifecycleExecutor.java:556)
	at org.apache.maven.lifecycle.DefaultLifecycleExecutor.executeGoal(DefaultLifecycleExecutor.java:535)
	at org.apache.maven.lifecycle.DefaultLifecycleExecutor.executeGoalAndHandleFailures(DefaultLifecycleExecutor.java:387)
	at org.apache.maven.lifecycle.DefaultLifecycleExecutor.executeTaskSegments(DefaultLifecycleExecutor.java:348)
	at org.apache.maven.lifecycle.DefaultLifecycleExecutor.execute(DefaultLifecycleExecutor.java:180)
	at org.apache.maven.lifecycle.LifecycleExecutorInterceptor.execute(LifecycleExecutorInterceptor.java:65)
	at org.apache.maven.DefaultMaven.doExecute(DefaultMaven.java:328)
	at org.apache.maven.DefaultMaven.execute(DefaultMaven.java:138)
	at org.apache.maven.cli.MavenCli.main(MavenCli.java:362)
	at sun.reflect.NativeMethodAccessorImpl.invoke0(Native Method)
	at sun.reflect.NativeMethodAccessorImpl.invoke(NativeMethodAccessorImpl.java:39)
	at sun.reflect.DelegatingMethodAccessorImpl.invoke(DelegatingMethodAccessorImpl.java:25)
	at java.lang.reflect.Method.invoke(Method.java:597)
	at org.codehaus.classworlds.Launcher.launchEnhanced(Launcher.java:315)
	at org.codehaus.classworlds.Launcher.launch(Launcher.java:255)
	at hudson.maven.agent.Main.launch(Main.java:165)
	at hudson.maven.MavenBuilder.call(MavenBuilder.java:165)
	at hudson.maven.MavenModuleSetBuild$Builder.call(MavenModuleSetBuild.java:694)
	at hudson.maven.MavenModuleSetBuild$Builder.call(MavenModuleSetBuild.java:638)
	at hudson.remoting.UserRequest.perform(UserRequest.java:114)
	at hudson.remoting.UserRequest.perform(UserRequest.java:48)
	at hudson.remoting.Request$2.run(Request.java:270)
	at java.util.concurrent.Executors$RunnableAdapter.call(Executors.java:441)
	at java.util.concurrent.FutureTask$Sync.innerRun(FutureTask.java:303)
	at java.util.concurrent.FutureTask.run(FutureTask.java:138)
	at java.util.concurrent.ThreadPoolExecutor$Worker.runTask(ThreadPoolExecutor.java:886)
	at java.util.concurrent.ThreadPoolExecutor$Worker.run(ThreadPoolExecutor.java:908)
	at java.lang.Thread.run(Thread.java:619)
Caused by: java.util.concurrent.ExecutionException: hudson.util.IOException2: Failed to extract
<https://hudson.apache.org/hudson/job/OpenJPA-trunk-deploy/org.apache.openjpa$openjpa-slice/ws/target/site/**/*>
	at hudson.remoting.Channel$2.adapt(Channel.java:663)
	at hudson.remoting.Channel$2.adapt(Channel.java:658)
	at hudson.remoting.FutureAdapter.get(FutureAdapter.java:55)
	at hudson.FilePath.copyRecursiveTo(FilePath.java:1472)
	... 35 more
Caused by: hudson.util.IOException2: Failed to extract <https://hudson.apache.org/hudson/job/OpenJPA-trunk-deploy/org.apache.openjpa$openjpa-slice/ws/target/site/**/*>
	at hudson.FilePath.readFromTar(FilePath.java:1577)
	at hudson.FilePath.access$100(FilePath.java:159)
	at hudson.FilePath$32.invoke(FilePath.java:1463)
	at hudson.FilePath$32.invoke(FilePath.java:1460)
	at hudson.FilePath$FileCallableWrapper.call(FilePath.java:1899)
	... 9 more
Caused by: java.util.zip.ZipException: invalid distance code
	at java.util.zip.InflaterInputStream.read(InflaterInputStream.java:147)
	at java.util.zip.GZIPInputStream.read(GZIPInputStream.java:92)
	at org.apache.tools.tar.TarBuffer.readBlock(TarBuffer.java:257)
	at org.apache.tools.tar.TarBuffer.readRecord(TarBuffer.java:223)
	at hudson.org.apache.tools.tar.TarInputStream.read(TarInputStream.java:345)
	at java.io.FilterInputStream.read(FilterInputStream.java:90)
	at org.apache.commons.io.IOUtils.copyLarge(IOUtils.java:1025)
	at org.apache.commons.io.IOUtils.copy(IOUtils.java:999)
	at hudson.util.IOUtils.copy(IOUtils.java:33)
	at hudson.FilePath.readFromTar(FilePath.java:1565)
	... 13 more


Mime
View raw message