openjpa-commits mailing list archives

Site index · List index
Message view « Date » · « Thread »
Top « Date » · « Thread »
From Apache Hudson Server <hud...@hudson.apache.org>
Subject Build failed in Hudson: OpenJPA-20x-deploy #15
Date Thu, 14 Oct 2010 04:48:58 GMT
See <https://hudson.apache.org/hudson/job/OpenJPA-20x-deploy/15/changes>

Changes:

[mikedd] fix manual

[mikedd] OPENJPA-1699: Update manual

[mikedd] OPENJPA-1699: Streaming LOB support for DB2
> Submitted by Heath Thomann, based on Fay's patch for trunk

------------------------------------------
[...truncated 18069 lines...]
	at org.apache.openjpa.meta.MetaDataRepository.getSequenceMetaDataInternal(MetaDataRepository.java:2155)
	at org.apache.openjpa.meta.MetaDataRepository.getSequenceMetaDataInternal(MetaDataRepository.java:2098)
	at org.apache.openjpa.meta.MetaDataRepository.getSequenceMetaData(MetaDataRepository.java:2090)
	at org.apache.openjpa.meta.MetaDataRepository.getSequenceMetaData(MetaDataRepository.java:2117)
	at org.apache.openjpa.meta.FieldMetaData.getValueSequenceMetaData(FieldMetaData.java:1052)
	at org.apache.openjpa.util.ImplHelper.generateValue(ImplHelper.java:157)
	at org.apache.openjpa.util.ImplHelper.generateFieldValue(ImplHelper.java:144)
	at org.apache.openjpa.jdbc.kernel.JDBCStoreManager.assignField(JDBCStoreManager.java:774)
	at org.apache.openjpa.util.ApplicationIds.assign(ApplicationIds.java:487)
	at org.apache.openjpa.util.ApplicationIds.assign(ApplicationIds.java:463)
	at org.apache.openjpa.jdbc.kernel.JDBCStoreManager.assignObjectId(JDBCStoreManager.java:758)
	at org.apache.openjpa.kernel.DelegatingStoreManager.assignObjectId(DelegatingStoreManager.java:135)
	at org.apache.openjpa.kernel.StateManagerImpl.assignObjectId(StateManagerImpl.java:605)
	at org.apache.openjpa.kernel.StateManagerImpl.preFlush(StateManagerImpl.java:2952)
	at org.apache.openjpa.kernel.PNewState.beforeFlush(PNewState.java:40)
	at org.apache.openjpa.kernel.StateManagerImpl.beforeFlush(StateManagerImpl.java:1047)
	at org.apache.openjpa.kernel.BrokerImpl.flush(BrokerImpl.java:2077)
	at org.apache.openjpa.kernel.BrokerImpl.flushSafe(BrokerImpl.java:2037)
	at org.apache.openjpa.kernel.BrokerImpl.beforeCompletion(BrokerImpl.java:1955)
	at org.apache.openjpa.kernel.LocalManagedRuntime.commit(LocalManagedRuntime.java:81)
	at org.apache.openjpa.kernel.BrokerImpl.commit(BrokerImpl.java:1479)
	at org.apache.openjpa.kernel.DelegatingBroker.commit(DelegatingBroker.java:925)
	at org.apache.openjpa.persistence.EntityManagerImpl.commit(EntityManagerImpl.java:560)
	at org.apache.openjpa.integration.validation.TestConstraints.testValidPassConstraint(TestConstraints.java:1249)
	at sun.reflect.NativeMethodAccessorImpl.invoke0(Native Method)
	at sun.reflect.NativeMethodAccessorImpl.invoke(NativeMethodAccessorImpl.java:39)
	at sun.reflect.DelegatingMethodAccessorImpl.invoke(DelegatingMethodAccessorImpl.java:25)
	at java.lang.reflect.Method.invoke(Method.java:597)
	at junit.framework.TestCase.runTest(TestCase.java:154)
	at junit.framework.TestCase.runBare(TestCase.java:127)
	at org.apache.openjpa.persistence.test.PersistenceTestCase.runBare(PersistenceTestCase.java:506)
	at org.apache.openjpa.persistence.test.PersistenceTestCase.runBare(PersistenceTestCase.java:481)
	at junit.framework.TestResult$1.protect(TestResult.java:106)
	at junit.framework.TestResult.runProtected(TestResult.java:124)
	at junit.framework.TestResult.run(TestResult.java:109)
	at junit.framework.TestCase.run(TestCase.java:118)
	at org.apache.openjpa.persistence.test.PersistenceTestCase.run(PersistenceTestCase.java:196)
	at junit.framework.TestSuite.runTest(TestSuite.java:208)
	at junit.framework.TestSuite.run(TestSuite.java:203)
	at sun.reflect.NativeMethodAccessorImpl.invoke0(Native Method)
	at sun.reflect.NativeMethodAccessorImpl.invoke(NativeMethodAccessorImpl.java:39)
	at sun.reflect.DelegatingMethodAccessorImpl.invoke(DelegatingMethodAccessorImpl.java:25)
	at java.lang.reflect.Method.invoke(Method.java:597)
	at org.apache.maven.surefire.junit.JUnitTestSet.execute(JUnitTestSet.java:213)
	at org.apache.maven.surefire.suite.AbstractDirectoryTestSuite.executeTestSet(AbstractDirectoryTestSuite.java:120)
	at org.apache.maven.surefire.suite.AbstractDirectoryTestSuite.execute(AbstractDirectoryTestSuite.java:103)
	at org.apache.maven.surefire.Surefire.run(Surefire.java:169)
	at sun.reflect.NativeMethodAccessorImpl.invoke0(Native Method)
	at sun.reflect.NativeMethodAccessorImpl.invoke(NativeMethodAccessorImpl.java:39)
	at sun.reflect.DelegatingMethodAccessorImpl.invoke(DelegatingMethodAccessorImpl.java:25)
	at java.lang.reflect.Method.invoke(Method.java:597)
	at org.apache.maven.surefire.booter.SurefireBooter.runSuitesInProcess(SurefireBooter.java:350)
	at org.apache.maven.surefire.booter.SurefireBooter.main(SurefireBooter.java:1021)
Tests run: 29, Failures: 0, Errors: 0, Skipped: 0, Time elapsed: 6.91 sec
Running org.apache.openjpa.integration.validation.TestValidationGroups
46  default-validation-group  INFO   [main] openjpa.Runtime - OpenJPA dynamically loaded a
validation provider.
46  default-validation-group  INFO   [main] openjpa.Runtime - Starting OpenJPA 2.0.2-SNAPSHOT
48  default-validation-group  INFO   [main] openjpa.jdbc.JDBC - Using dictionary class "org.apache.openjpa.jdbc.sql.DerbyDictionary"
(Apache Derby 10.5.3.0 - (802917) ,Apache Derby Embedded JDBC Driver 10.5.3.0 - (802917)).
46  default-validation-group  INFO   [main] openjpa.Runtime - OpenJPA dynamically loaded a
validation provider.
46  default-validation-group  INFO   [main] openjpa.Runtime - Starting OpenJPA 2.0.2-SNAPSHOT
48  default-validation-group  INFO   [main] openjpa.jdbc.JDBC - Using dictionary class "org.apache.openjpa.jdbc.sql.DerbyDictionary"
(Apache Derby 10.5.3.0 - (802917) ,Apache Derby Embedded JDBC Driver 10.5.3.0 - (802917)).
45  default-validation-group  INFO   [main] openjpa.Runtime - OpenJPA dynamically loaded a
validation provider.
45  default-validation-group  INFO   [main] openjpa.Runtime - Starting OpenJPA 2.0.2-SNAPSHOT
47  default-validation-group  INFO   [main] openjpa.jdbc.JDBC - Using dictionary class "org.apache.openjpa.jdbc.sql.DerbyDictionary"
(Apache Derby 10.5.3.0 - (802917) ,Apache Derby Embedded JDBC Driver 10.5.3.0 - (802917)).
45  default-validation-group  INFO   [main] openjpa.Runtime - OpenJPA dynamically loaded a
validation provider.
45  default-validation-group  INFO   [main] openjpa.Runtime - Starting OpenJPA 2.0.2-SNAPSHOT
47  default-validation-group  INFO   [main] openjpa.jdbc.JDBC - Using dictionary class "org.apache.openjpa.jdbc.sql.DerbyDictionary"
(Apache Derby 10.5.3.0 - (802917) ,Apache Derby Embedded JDBC Driver 10.5.3.0 - (802917)).
45  pre-remove-default-validation-group  INFO   [main] openjpa.Runtime - OpenJPA dynamically
loaded a validation provider.
45  pre-remove-default-validation-group  INFO   [main] openjpa.Runtime - Starting OpenJPA
2.0.2-SNAPSHOT
47  pre-remove-default-validation-group  INFO   [main] openjpa.jdbc.JDBC - Using dictionary
class "org.apache.openjpa.jdbc.sql.DerbyDictionary" (Apache Derby 10.5.3.0 - (802917) ,Apache
Derby Embedded JDBC Driver 10.5.3.0 - (802917)).
45  pre-remove-default-validation-group  INFO   [main] openjpa.Runtime - OpenJPA dynamically
loaded a validation provider.
45  pre-remove-default-validation-group  INFO   [main] openjpa.Runtime - Starting OpenJPA
2.0.2-SNAPSHOT
47  pre-remove-default-validation-group  INFO   [main] openjpa.jdbc.JDBC - Using dictionary
class "org.apache.openjpa.jdbc.sql.DerbyDictionary" (Apache Derby 10.5.3.0 - (802917) ,Apache
Derby Embedded JDBC Driver 10.5.3.0 - (802917)).
45  non-default-validation-group  INFO   [main] openjpa.Runtime - OpenJPA dynamically loaded
a validation provider.
45  non-default-validation-group  INFO   [main] openjpa.Runtime - Starting OpenJPA 2.0.2-SNAPSHOT
47  non-default-validation-group  INFO   [main] openjpa.jdbc.JDBC - Using dictionary class
"org.apache.openjpa.jdbc.sql.DerbyDictionary" (Apache Derby 10.5.3.0 - (802917) ,Apache Derby
Embedded JDBC Driver 10.5.3.0 - (802917)).
44  non-default-validation-group  INFO   [main] openjpa.Runtime - OpenJPA dynamically loaded
a validation provider.
44  non-default-validation-group  INFO   [main] openjpa.Runtime - Starting OpenJPA 2.0.2-SNAPSHOT
46  non-default-validation-group  INFO   [main] openjpa.jdbc.JDBC - Using dictionary class
"org.apache.openjpa.jdbc.sql.DerbyDictionary" (Apache Derby 10.5.3.0 - (802917) ,Apache Derby
Embedded JDBC Driver 10.5.3.0 - (802917)).
42  multi-validation-group  INFO   [main] openjpa.Runtime - OpenJPA dynamically loaded a validation
provider.
42  multi-validation-group  INFO   [main] openjpa.Runtime - Starting OpenJPA 2.0.2-SNAPSHOT
44  multi-validation-group  INFO   [main] openjpa.jdbc.JDBC - Using dictionary class "org.apache.openjpa.jdbc.sql.DerbyDictionary"
(Apache Derby 10.5.3.0 - (802917) ,Apache Derby Embedded JDBC Driver 10.5.3.0 - (802917)).
41  multi-validation-group  INFO   [main] openjpa.Runtime - OpenJPA dynamically loaded a validation
provider.
41  multi-validation-group  INFO   [main] openjpa.Runtime - Starting OpenJPA 2.0.2-SNAPSHOT
43  multi-validation-group  INFO   [main] openjpa.jdbc.JDBC - Using dictionary class "org.apache.openjpa.jdbc.sql.DerbyDictionary"
(Apache Derby 10.5.3.0 - (802917) ,Apache Derby Embedded JDBC Driver 10.5.3.0 - (802917)).
Tests run: 10, Failures: 0, Errors: 0, Skipped: 0, Time elapsed: 0.891 sec
Running org.apache.openjpa.integration.validation.TestTraversableResolver
1  non-validation-pu  INFO   [main] openjpa.Runtime - Starting OpenJPA 2.0.2-SNAPSHOT
3  non-validation-pu  INFO   [main] openjpa.jdbc.JDBC - Using dictionary class "org.apache.openjpa.jdbc.sql.DerbyDictionary"
(Apache Derby 10.5.3.0 - (802917) ,Apache Derby Embedded JDBC Driver 10.5.3.0 - (802917)).
41  validation-pu  INFO   [main] openjpa.Runtime - OpenJPA dynamically loaded a validation
provider.
41  validation-pu  INFO   [main] openjpa.Runtime - Starting OpenJPA 2.0.2-SNAPSHOT
43  validation-pu  INFO   [main] openjpa.jdbc.JDBC - Using dictionary class "org.apache.openjpa.jdbc.sql.DerbyDictionary"
(Apache Derby 10.5.3.0 - (802917) ,Apache Derby Embedded JDBC Driver 10.5.3.0 - (802917)).
0  non-validation-pu  INFO   [main] openjpa.Runtime - Starting OpenJPA 2.0.2-SNAPSHOT
2  non-validation-pu  INFO   [main] openjpa.jdbc.JDBC - Using dictionary class "org.apache.openjpa.jdbc.sql.DerbyDictionary"
(Apache Derby 10.5.3.0 - (802917) ,Apache Derby Embedded JDBC Driver 10.5.3.0 - (802917)).
0  non-validation-pu  INFO   [main] openjpa.Runtime - Starting OpenJPA 2.0.2-SNAPSHOT
2  non-validation-pu  INFO   [main] openjpa.jdbc.JDBC - Using dictionary class "org.apache.openjpa.jdbc.sql.DerbyDictionary"
(Apache Derby 10.5.3.0 - (802917) ,Apache Derby Embedded JDBC Driver 10.5.3.0 - (802917)).
1  non-validation-pu  INFO   [main] openjpa.Runtime - Starting OpenJPA 2.0.2-SNAPSHOT
3  non-validation-pu  INFO   [main] openjpa.jdbc.JDBC - Using dictionary class "org.apache.openjpa.jdbc.sql.DerbyDictionary"
(Apache Derby 10.5.3.0 - (802917) ,Apache Derby Embedded JDBC Driver 10.5.3.0 - (802917)).
41  validation-pu  INFO   [main] openjpa.Runtime - OpenJPA dynamically loaded a validation
provider.
41  validation-pu  INFO   [main] openjpa.Runtime - Starting OpenJPA 2.0.2-SNAPSHOT
43  validation-pu  INFO   [main] openjpa.jdbc.JDBC - Using dictionary class "org.apache.openjpa.jdbc.sql.DerbyDictionary"
(Apache Derby 10.5.3.0 - (802917) ,Apache Derby Embedded JDBC Driver 10.5.3.0 - (802917)).
0  non-validation-pu  INFO   [main] openjpa.Runtime - Starting OpenJPA 2.0.2-SNAPSHOT
2  non-validation-pu  INFO   [main] openjpa.jdbc.JDBC - Using dictionary class "org.apache.openjpa.jdbc.sql.DerbyDictionary"
(Apache Derby 10.5.3.0 - (802917) ,Apache Derby Embedded JDBC Driver 10.5.3.0 - (802917)).
40  validation-pu  INFO   [main] openjpa.Runtime - OpenJPA dynamically loaded a validation
provider.
40  validation-pu  INFO   [main] openjpa.Runtime - Starting OpenJPA 2.0.2-SNAPSHOT
42  validation-pu  INFO   [main] openjpa.jdbc.JDBC - Using dictionary class "org.apache.openjpa.jdbc.sql.DerbyDictionary"
(Apache Derby 10.5.3.0 - (802917) ,Apache Derby Embedded JDBC Driver 10.5.3.0 - (802917)).
0  non-validation-pu  INFO   [main] openjpa.Runtime - Starting OpenJPA 2.0.2-SNAPSHOT
2  non-validation-pu  INFO   [main] openjpa.jdbc.JDBC - Using dictionary class "org.apache.openjpa.jdbc.sql.DerbyDictionary"
(Apache Derby 10.5.3.0 - (802917) ,Apache Derby Embedded JDBC Driver 10.5.3.0 - (802917)).
40  validation-pu  INFO   [main] openjpa.Runtime - OpenJPA dynamically loaded a validation
provider.
40  validation-pu  INFO   [main] openjpa.Runtime - Starting OpenJPA 2.0.2-SNAPSHOT
42  validation-pu  INFO   [main] openjpa.jdbc.JDBC - Using dictionary class "org.apache.openjpa.jdbc.sql.DerbyDictionary"
(Apache Derby 10.5.3.0 - (802917) ,Apache Derby Embedded JDBC Driver 10.5.3.0 - (802917)).
Tests run: 5, Failures: 0, Errors: 0, Skipped: 0, Time elapsed: 0.746 sec
Running org.apache.openjpa.integration.persistence.provider.TestPersistenceProviderResolver
Tests run: 5, Failures: 0, Errors: 0, Skipped: 0, Time elapsed: 0.012 sec
Running org.apache.openjpa.integration.validation.TestMappedSuper
40  XMLConstraintPU  INFO   [main] openjpa.Runtime - OpenJPA dynamically loaded a validation
provider.
40  XMLConstraintPU  INFO   [main] openjpa.Runtime - Starting OpenJPA 2.0.2-SNAPSHOT
42  XMLConstraintPU  INFO   [main] openjpa.jdbc.JDBC - Using dictionary class "org.apache.openjpa.jdbc.sql.DerbyDictionary"
(Apache Derby 10.5.3.0 - (802917) ,Apache Derby Embedded JDBC Driver 10.5.3.0 - (802917)).
Tests run: 1, Failures: 0, Errors: 0, Skipped: 0, Time elapsed: 0.113 sec
Running org.apache.openjpa.integration.validation.TestValidatingLEM
1  test  INFO   [main] openjpa.Runtime - Starting OpenJPA 2.0.2-SNAPSHOT
2  test  INFO   [main] openjpa.jdbc.JDBC - Using dictionary class "org.apache.openjpa.jdbc.sql.DerbyDictionary"
(Apache Derby 10.5.3.0 - (802917) ,Apache Derby Embedded JDBC Driver 10.5.3.0 - (802917)).
0  simple-none-mode  INFO   [main] openjpa.Runtime - Starting OpenJPA 2.0.2-SNAPSHOT
2  simple-none-mode  INFO   [main] openjpa.jdbc.JDBC - Using dictionary class "org.apache.openjpa.jdbc.sql.DerbyDictionary"
(Apache Derby 10.5.3.0 - (802917) ,Apache Derby Embedded JDBC Driver 10.5.3.0 - (802917)).
0  test  INFO   [main] openjpa.Runtime - Starting OpenJPA 2.0.2-SNAPSHOT
1  test  INFO   [main] openjpa.jdbc.JDBC - Using dictionary class "org.apache.openjpa.jdbc.sql.DerbyDictionary"
(Apache Derby 10.5.3.0 - (802917) ,Apache Derby Embedded JDBC Driver 10.5.3.0 - (802917)).
43  simple-auto-mode  INFO   [main] openjpa.Runtime - OpenJPA dynamically loaded a validation
provider.
43  simple-auto-mode  INFO   [main] openjpa.Runtime - Starting OpenJPA 2.0.2-SNAPSHOT
45  simple-auto-mode  INFO   [main] openjpa.jdbc.JDBC - Using dictionary class "org.apache.openjpa.jdbc.sql.DerbyDictionary"
(Apache Derby 10.5.3.0 - (802917) ,Apache Derby Embedded JDBC Driver 10.5.3.0 - (802917)).
0  test  INFO   [main] openjpa.Runtime - Starting OpenJPA 2.0.2-SNAPSHOT
2  test  INFO   [main] openjpa.jdbc.JDBC - Using dictionary class "org.apache.openjpa.jdbc.sql.DerbyDictionary"
(Apache Derby 10.5.3.0 - (802917) ,Apache Derby Embedded JDBC Driver 10.5.3.0 - (802917)).
41  simple-none-mode  INFO   [main] openjpa.Runtime - OpenJPA dynamically loaded a validation
provider.
41  simple-none-mode  INFO   [main] openjpa.Runtime - Starting OpenJPA 2.0.2-SNAPSHOT
43  simple-none-mode  INFO   [main] openjpa.jdbc.JDBC - Using dictionary class "org.apache.openjpa.jdbc.sql.DerbyDictionary"
(Apache Derby 10.5.3.0 - (802917) ,Apache Derby Embedded JDBC Driver 10.5.3.0 - (802917)).
0  test  INFO   [main] openjpa.Runtime - Starting OpenJPA 2.0.2-SNAPSHOT
2  test  INFO   [main] openjpa.jdbc.JDBC - Using dictionary class "org.apache.openjpa.jdbc.sql.DerbyDictionary"
(Apache Derby 10.5.3.0 - (802917) ,Apache Derby Embedded JDBC Driver 10.5.3.0 - (802917)).
1  simple-auto-mode  INFO   [main] openjpa.Runtime - OpenJPA dynamically loaded a validation
provider.
1  simple-auto-mode  INFO   [main] openjpa.Runtime - Starting OpenJPA 2.0.2-SNAPSHOT
3  simple-auto-mode  INFO   [main] openjpa.jdbc.JDBC - Using dictionary class "org.apache.openjpa.jdbc.sql.DerbyDictionary"
(Apache Derby 10.5.3.0 - (802917) ,Apache Derby Embedded JDBC Driver 10.5.3.0 - (802917)).
Tests run: 4, Failures: 0, Errors: 0, Skipped: 0, Time elapsed: 0.371 sec

Results :

Tests run: 54, Failures: 0, Errors: 0, Skipped: 0

[HUDSON] Recording test results
[INFO] [jar:jar {execution: default-jar}]
[INFO] Building jar: <https://hudson.apache.org/hudson/job/OpenJPA-20x-deploy/ws/2.0.x/openjpa-integration/validation/target/openjpa-integration-validation-2.0.2-SNAPSHOT.jar>
[INFO] [jar:jar {execution: default-jar}]
[INFO] [jar:test-jar {execution: attach-tests}]
[INFO] Building jar: <https://hudson.apache.org/hudson/job/OpenJPA-20x-deploy/ws/2.0.x/openjpa-integration/validation/target/openjpa-integration-validation-2.0.2-SNAPSHOT-tests.jar>
[INFO] [ianal:verify-legal-files {execution: default}]
[INFO] Checking legal files in: openjpa-integration-validation-2.0.2-SNAPSHOT.jar
[INFO] Checking legal files in: openjpa-integration-validation-2.0.2-SNAPSHOT-tests.jar
[INFO] [apache-rat:check {execution: default}]
[INFO] Exclude: **/.*/**
[INFO] Exclude: **/target/**/*
[INFO] [install:install {execution: default-install}]
[INFO] Installing <https://hudson.apache.org/hudson/job/OpenJPA-20x-deploy/ws/2.0.x/openjpa-integration/validation/target/openjpa-integration-validation-2.0.2-SNAPSHOT.jar>
to /home/hudson/.m2/repository/org/apache/openjpa/openjpa-integration-validation/2.0.2-SNAPSHOT/openjpa-integration-validation-2.0.2-SNAPSHOT.jar
[INFO] Installing <https://hudson.apache.org/hudson/job/OpenJPA-20x-deploy/ws/2.0.x/openjpa-integration/validation/target/openjpa-integration-validation-2.0.2-SNAPSHOT-tests.jar>
to /home/hudson/.m2/repository/org/apache/openjpa/openjpa-integration-validation/2.0.2-SNAPSHOT/openjpa-integration-validation-2.0.2-SNAPSHOT-tests.jar
[INFO] [deploy:deploy {execution: default-deploy}]
[INFO] Retrieving previous build number from apache.snapshots.https
Uploading: https://repository.apache.org/content/repositories/snapshots/org/apache/openjpa/openjpa-integration-validation/2.0.2-SNAPSHOT/openjpa-integration-validation-2.0.2-20101014.035122-10.jar
8K uploaded  (openjpa-integration-validation-2.0.2-20101014.035122-10.jar)
[INFO] Retrieving previous metadata from apache.snapshots.https
[INFO] Uploading repository metadata for: 'snapshot org.apache.openjpa:openjpa-integration-validation:2.0.2-SNAPSHOT'
[INFO] Retrieving previous metadata from apache.snapshots.https
[INFO] Uploading repository metadata for: 'artifact org.apache.openjpa:openjpa-integration-validation'
[INFO] Uploading project information for openjpa-integration-validation 2.0.2-20101014.035122-10
[INFO] Retrieving previous build number from apache.snapshots.https
Uploading: https://repository.apache.org/content/repositories/snapshots/org/apache/openjpa/openjpa-integration-validation/2.0.2-SNAPSHOT/openjpa-integration-validation-2.0.2-20101014.035122-10-tests.jar
160K uploaded  (openjpa-integration-validation-2.0.2-20101014.035122-10-tests.jar)
[INFO] Preparing javadoc:javadoc
[WARNING] Removing: javadoc from forked lifecycle, to prevent recursive invocation.
[HUDSON] Archiving <https://hudson.apache.org/hudson/job/OpenJPA-20x-deploy/ws/2.0.x/openjpa-integration/validation/pom.xml>
to /home/hudson/hudson/jobs/OpenJPA-20x-deploy/modules/org.apache.openjpa$openjpa-integration-validation/builds/2010-10-14_03-50-32/archive/org.apache.openjpa/openjpa-integration-validation/2.0.2-SNAPSHOT/pom.xml
[HUDSON] Archiving <https://hudson.apache.org/hudson/job/OpenJPA-20x-deploy/ws/2.0.x/openjpa-integration/validation/target/openjpa-integration-validation-2.0.2-SNAPSHOT.jar>
to /home/hudson/hudson/jobs/OpenJPA-20x-deploy/modules/org.apache.openjpa$openjpa-integration-validation/builds/2010-10-14_03-50-32/archive/org.apache.openjpa/openjpa-integration-validation/2.0.2-20101014.035122-10/openjpa-integration-validation-2.0.2-SNAPSHOT.jar
[HUDSON] Archiving <https://hudson.apache.org/hudson/job/OpenJPA-20x-deploy/ws/2.0.x/openjpa-integration/validation/target/openjpa-integration-validation-2.0.2-SNAPSHOT-tests.jar>
to /home/hudson/hudson/jobs/OpenJPA-20x-deploy/modules/org.apache.openjpa$openjpa-integration-validation/builds/2010-10-14_03-50-32/archive/org.apache.openjpa/openjpa-integration-validation/2.0.2-20101014.035122-10/openjpa-integration-validation-2.0.2-SNAPSHOT-tests.jar
[INFO] [buildnumber:create {execution: default}]
[INFO] [enforcer:enforce {execution: default}]
[INFO] [site:site {execution: default-site}]
[INFO] Parent project loaded from repository.
[INFO] Generating "Issue Tracking" report.
[INFO] Generating "Project Team" report.
[INFO] Generating "Dependency Management" report.
[INFO] Generating "Continuous Integration" report.
[INFO] Generating "Project Plugins" report.
[INFO] Generating "Dependencies" report.
Downloading: http://repo1.maven.org/maven2/commons-collections/commons-collections/3.2.1/commons-collections-3.2.1.jar
Downloading: http://repo1.maven.org/maven2/commons-logging/commons-logging/1.0.4/commons-logging-1.0.4.jar
Downloading: http://repo1.maven.org/maven2/commons-pool/commons-pool/1.5.3/commons-pool-1.5.3.jar
Downloading: http://repo1.maven.org/maven2/net/sourceforge/serp/serp/1.13.1/serp-1.13.1.jar
Downloading: http://repo1.maven.org/maven2/org/apache/bval/bval-core/0.2-incubating/bval-core-0.2-incubating.jar
Downloading: http://repo1.maven.org/maven2/org/apache/bval/bval-jsr303/0.2-incubating/bval-jsr303-0.2-incubating.jar
[ERROR] Artifact: org.apache.geronimo.specs:geronimo-jms_1.1_spec:jar:1.1.1 has no file.
[ERROR] Artifact: org.apache.geronimo.specs:geronimo-jpa_2.0_spec:jar:1.1 has no file.
[ERROR] Artifact: org.apache.geronimo.specs:geronimo-jta_1.1_spec:jar:1.1.1 has no file.
[ERROR] Artifact: org.apache.openjpa:openjpa-jdbc:jar:2.0.2-SNAPSHOT has no file.
[ERROR] Artifact: org.apache.openjpa:openjpa-kernel:jar:2.0.2-SNAPSHOT has no file.
[ERROR] Artifact: org.apache.openjpa:openjpa-lib:jar:2.0.2-SNAPSHOT has no file.
[ERROR] Artifact: org.apache.openjpa:openjpa-persistence:jar:2.0.2-SNAPSHOT has no file.
Downloading: http://repository.apache.org/snapshots/org/apache/openjpa/openjpa-jdbc/2.0.2-SNAPSHOT/openjpa-jdbc-2.0.2-20101014.035122-12.jar
Downloading: http://repository.apache.org/snapshots/org/apache/openjpa/openjpa-kernel/2.0.2-SNAPSHOT/openjpa-kernel-2.0.2-20101014.035122-12.jar
Downloading: http://repository.apache.org/snapshots/org/apache/openjpa/openjpa-lib/2.0.2-SNAPSHOT/openjpa-lib-2.0.2-20101014.035122-12.jar
Downloading: http://repository.apache.org/snapshots/org/apache/openjpa/openjpa-persistence/2.0.2-SNAPSHOT/openjpa-persistence-2.0.2-20101014.035122-12.jar
[INFO] Generating "Source Repository" report.
[INFO] Generating "Plugin Management" report.
[INFO] Generating "Mailing Lists" report.
[INFO] Generating "Project Summary" report.
[INFO] Generating "About" report.
[INFO] Generating "Project License" report.
[INFO] Generating "Dependency Convergence" report.
[HUDSON] Archiving site from <https://hudson.apache.org/hudson/job/OpenJPA-20x-deploy/ws/2.0.x/openjpa-integration/validation/target/site>
to /home/hudson/hudson/jobs/OpenJPA-20x-deploy/site/openjpa-integration-validation
[INFO] 
[INFO] 
[INFO] ------------------------------------------------------------------------
[INFO] Reactor Summary:
[INFO] ------------------------------------------------------------------------
[INFO] OpenJPA Parent POM .................................... SUCCESS [1:14.061s]
[INFO] OpenJPA Utilities Library ............................. SUCCESS [1:31.492s]
[INFO] OpenJPA Kernel ........................................ SUCCESS [1:26.591s]
[INFO] OpenJPA JDBC .......................................... SUCCESS [2:03.040s]
[INFO] OpenJPA Persistence ................................... SUCCESS [1:13.291s]
[INFO] OpenJPA Persistence JDBC .............................. SUCCESS [12:00.790s]
[INFO] OpenJPA Persistence Locking Tests ..................... SUCCESS [23:06.369s]
[INFO] OpenJPA XML Store ..................................... SUCCESS [1:00.199s]
[INFO] OpenJPA Slice ......................................... SUCCESS [51.600s]
[INFO] OpenJPA Aggregate Jar ................................. SUCCESS [53.213s]
[INFO] OpenJPA Aggregate Jar with Dependencies ............... SUCCESS [1:04.234s]
[INFO] OpenJPA Project Docs and Assemblies ................... SUCCESS [4:49.794s]
[INFO] OpenJPA Examples ...................................... SUCCESS [4:21.668s]
[INFO] OpenJPA Integration Tests ............................. SUCCESS [15.799s]
[INFO] OpenJPA Integration Tests - Daytrader ................. SUCCESS [53.153s]
[INFO] OpenJPA Integration Tests - Examples .................. SUCCESS [10.290s]
[INFO] OpenJPA Integration Tests - JPA TCK ................... SUCCESS [7.343s]
[INFO] OpenJPA Integration Tests - Bean Validation ........... SUCCESS [43.964s]
[INFO] ------------------------------------------------------------------------
[INFO] ------------------------------------------------------------------------
[INFO] BUILD SUCCESSFUL
[INFO] ------------------------------------------------------------------------
[INFO] Total time: 58 minutes 11 seconds
[INFO] Finished at: Thu Oct 14 04:48:52 UTC 2010
[INFO] Final Memory: 136M/542M
[INFO] ------------------------------------------------------------------------
Sending e-mails to: commits@openjpa.apache.org
Sending e-mails to: commits@openjpa.apache.org
Sending e-mails to: commits@openjpa.apache.org
Sending e-mails to: commits@openjpa.apache.org
Sending e-mails to: commits@openjpa.apache.org
channel stopped


Mime
View raw message