openjpa-commits mailing list archives

Site index · List index
Message view « Date » · « Thread »
Top « Date » · « Thread »
From Apache Hudson Server <hud...@hudson.apache.org>
Subject Build failed in Hudson: OpenJPA-trunk #267
Date Thu, 21 Oct 2010 19:12:58 GMT
See <https://hudson.apache.org/hudson/job/OpenJPA-trunk/267/changes>

Changes:

[curtisr7] OPENJPA-1844: Fix TestJMXPlatformMBeans.

------------------------------------------
[...truncated 18900 lines...]
82  ConstraintPU  INFO   [main] openjpa.Runtime - Starting OpenJPA 2.1.0-SNAPSHOT
82  ConstraintPU  INFO   [main] openjpa.jdbc.JDBC - Using dictionary class "org.apache.openjpa.jdbc.sql.DerbyDictionary".
82  ConstraintPU  INFO   [main] openjpa.Runtime - OpenJPA dynamically loaded a validation
provider.
83  ConstraintPU  INFO   [main] openjpa.Runtime - Starting OpenJPA 2.1.0-SNAPSHOT
83  ConstraintPU  INFO   [main] openjpa.jdbc.JDBC - Using dictionary class "org.apache.openjpa.jdbc.sql.DerbyDictionary".
130  ConstraintPU  INFO   [main] openjpa.Runtime - OpenJPA dynamically loaded a validation
provider.
0  address-none-mode  INFO   [main] openjpa.Runtime - Starting OpenJPA 2.1.0-SNAPSHOT
2  address-none-mode  INFO   [main] openjpa.jdbc.JDBC - Using dictionary class "org.apache.openjpa.jdbc.sql.DerbyDictionary".
260  ConstraintPU  INFO   [main] openjpa.Runtime - Starting OpenJPA 2.1.0-SNAPSHOT
261  ConstraintPU  INFO   [main] openjpa.jdbc.JDBC - Using dictionary class "org.apache.openjpa.jdbc.sql.DerbyDictionary".
109  ConstraintPU  INFO   [main] openjpa.Runtime - OpenJPA dynamically loaded a validation
provider.
110  ConstraintPU  INFO   [main] openjpa.Runtime - Starting OpenJPA 2.1.0-SNAPSHOT
111  ConstraintPU  INFO   [main] openjpa.jdbc.JDBC - Using dictionary class "org.apache.openjpa.jdbc.sql.DerbyDictionary".
325  ConstraintPU  WARN   [main] openjpa.MetaData - <openjpa-2.1.0-SNAPSHOT-r422266:1025814
fatal user error> org.apache.openjpa.util.MetaDataException: No metadata was found for
type "class org.apache.openjpa.integration.validation.Publisher". The class does not appear
in the list of persistent types: [org.apache.openjpa.integration.validation.Book, org.apache.openjpa.integration.validation.ConstraintDates,
org.apache.openjpa.integration.validation.ConstraintNull, org.apache.openjpa.integration.validation.Person,
org.apache.openjpa.integration.validation.ConstraintSize, org.apache.openjpa.integration.validation.Address,
org.apache.openjpa.integration.validation.ConstraintDecimal, org.apache.openjpa.integration.validation.ConstraintNumber,
org.apache.openjpa.integration.validation.ConstraintDigits, org.apache.openjpa.integration.validation.ConstraintBoolean,
org.apache.openjpa.integration.validation.ConstraintPattern].
<openjpa-2.1.0-SNAPSHOT-r422266:1025814 fatal user error> org.apache.openjpa.util.MetaDataException:
No metadata was found for type "class org.apache.openjpa.integration.validation.Publisher".
The class does not appear in the list of persistent types: [org.apache.openjpa.integration.validation.Book,
org.apache.openjpa.integration.validation.ConstraintDates, org.apache.openjpa.integration.validation.ConstraintNull,
org.apache.openjpa.integration.validation.Person, org.apache.openjpa.integration.validation.ConstraintSize,
org.apache.openjpa.integration.validation.Address, org.apache.openjpa.integration.validation.ConstraintDecimal,
org.apache.openjpa.integration.validation.ConstraintNumber, org.apache.openjpa.integration.validation.ConstraintDigits,
org.apache.openjpa.integration.validation.ConstraintBoolean, org.apache.openjpa.integration.validation.ConstraintPattern].
	at org.apache.openjpa.meta.MetaDataRepository.getMetaDataInternal(MetaDataRepository.java:394)
	at org.apache.openjpa.meta.MetaDataRepository.getMetaData(MetaDataRepository.java:371)
	at org.apache.openjpa.meta.ClassMetaData.resolveMeta(ClassMetaData.java:1822)
	at org.apache.openjpa.meta.ClassMetaData.resolve(ClassMetaData.java:1787)
	at org.apache.openjpa.meta.ValueMetaDataImpl.resolve(ValueMetaDataImpl.java:435)
	at org.apache.openjpa.jdbc.meta.ValueMappingImpl.resolve(ValueMappingImpl.java:494)
	at org.apache.openjpa.meta.FieldMetaData.resolve(FieldMetaData.java:1730)
	at org.apache.openjpa.jdbc.meta.FieldMapping.resolve(FieldMapping.java:458)
	at org.apache.openjpa.meta.ClassMetaData.resolveMeta(ClassMetaData.java:1853)
	at org.apache.openjpa.meta.ClassMetaData.resolve(ClassMetaData.java:1787)
	at org.apache.openjpa.meta.MetaDataRepository.processBuffer(MetaDataRepository.java:809)
	at org.apache.openjpa.meta.MetaDataRepository.resolveMeta(MetaDataRepository.java:706)
	at org.apache.openjpa.meta.MetaDataRepository.resolve(MetaDataRepository.java:630)
	at org.apache.openjpa.meta.MetaDataRepository.getMetaDataInternal(MetaDataRepository.java:398)
	at org.apache.openjpa.meta.MetaDataRepository.getMetaData(MetaDataRepository.java:371)
	at org.apache.openjpa.meta.MetaDataRepository.loadRegisteredClassMetaData(MetaDataRepository.java:1596)
	at org.apache.openjpa.meta.MetaDataRepository.getSequenceMetaDataInternal(MetaDataRepository.java:2172)
	at org.apache.openjpa.meta.MetaDataRepository.getSequenceMetaDataInternal(MetaDataRepository.java:2115)
	at org.apache.openjpa.meta.MetaDataRepository.getSequenceMetaData(MetaDataRepository.java:2107)
	at org.apache.openjpa.meta.MetaDataRepository.getSequenceMetaData(MetaDataRepository.java:2134)
	at org.apache.openjpa.meta.FieldMetaData.getValueSequenceMetaData(FieldMetaData.java:1052)
	at org.apache.openjpa.util.ImplHelper.generateValue(ImplHelper.java:157)
	at org.apache.openjpa.util.ImplHelper.generateFieldValue(ImplHelper.java:144)
	at org.apache.openjpa.jdbc.kernel.JDBCStoreManager.assignField(JDBCStoreManager.java:781)
	at org.apache.openjpa.util.ApplicationIds.assign(ApplicationIds.java:493)
	at org.apache.openjpa.util.ApplicationIds.assign(ApplicationIds.java:469)
	at org.apache.openjpa.jdbc.kernel.JDBCStoreManager.assignObjectId(JDBCStoreManager.java:765)
	at org.apache.openjpa.kernel.DelegatingStoreManager.assignObjectId(DelegatingStoreManager.java:135)
	at org.apache.openjpa.kernel.StateManagerImpl.assignObjectId(StateManagerImpl.java:605)
	at org.apache.openjpa.kernel.StateManagerImpl.preFlush(StateManagerImpl.java:2952)
	at org.apache.openjpa.kernel.PNewState.beforeFlush(PNewState.java:40)
	at org.apache.openjpa.kernel.StateManagerImpl.beforeFlush(StateManagerImpl.java:1047)
	at org.apache.openjpa.kernel.BrokerImpl.flush(BrokerImpl.java:2086)
	at org.apache.openjpa.kernel.BrokerImpl.flushSafe(BrokerImpl.java:2046)
	at org.apache.openjpa.kernel.BrokerImpl.beforeCompletion(BrokerImpl.java:1964)
	at org.apache.openjpa.kernel.LocalManagedRuntime.commit(LocalManagedRuntime.java:81)
	at org.apache.openjpa.kernel.BrokerImpl.commit(BrokerImpl.java:1488)
	at org.apache.openjpa.kernel.DelegatingBroker.commit(DelegatingBroker.java:925)
	at org.apache.openjpa.persistence.EntityManagerImpl.commit(EntityManagerImpl.java:560)
	at org.apache.openjpa.integration.validation.TestConstraints.testValidPassConstraint(TestConstraints.java:1131)
	at sun.reflect.NativeMethodAccessorImpl.invoke0(Native Method)
	at sun.reflect.NativeMethodAccessorImpl.invoke(NativeMethodAccessorImpl.java:39)
	at sun.reflect.DelegatingMethodAccessorImpl.invoke(DelegatingMethodAccessorImpl.java:25)
	at java.lang.reflect.Method.invoke(Method.java:597)
	at junit.framework.TestCase.runTest(TestCase.java:154)
	at org.apache.openjpa.persistence.test.AbstractPersistenceTestCase.runTest(AbstractPersistenceTestCase.java:575)
	at junit.framework.TestCase.runBare(TestCase.java:127)
	at org.apache.openjpa.persistence.test.AbstractPersistenceTestCase.runBare(AbstractPersistenceTestCase.java:562)
	at org.apache.openjpa.persistence.test.AbstractPersistenceTestCase.runBare(AbstractPersistenceTestCase.java:538)
	at junit.framework.TestResult$1.protect(TestResult.java:106)
	at junit.framework.TestResult.runProtected(TestResult.java:124)
	at junit.framework.TestResult.run(TestResult.java:109)
	at junit.framework.TestCase.run(TestCase.java:118)
	at org.apache.openjpa.persistence.test.AbstractPersistenceTestCase.run(AbstractPersistenceTestCase.java:206)
	at junit.framework.TestSuite.runTest(TestSuite.java:208)
	at junit.framework.TestSuite.run(TestSuite.java:203)
	at sun.reflect.NativeMethodAccessorImpl.invoke0(Native Method)
	at sun.reflect.NativeMethodAccessorImpl.invoke(NativeMethodAccessorImpl.java:39)
	at sun.reflect.DelegatingMethodAccessorImpl.invoke(DelegatingMethodAccessorImpl.java:25)
	at java.lang.reflect.Method.invoke(Method.java:597)
	at org.apache.maven.surefire.junit.JUnitTestSet.execute(JUnitTestSet.java:213)
	at org.apache.maven.surefire.suite.AbstractDirectoryTestSuite.executeTestSet(AbstractDirectoryTestSuite.java:120)
	at org.apache.maven.surefire.suite.AbstractDirectoryTestSuite.execute(AbstractDirectoryTestSuite.java:103)
	at org.apache.maven.surefire.Surefire.run(Surefire.java:169)
	at sun.reflect.NativeMethodAccessorImpl.invoke0(Native Method)
	at sun.reflect.NativeMethodAccessorImpl.invoke(NativeMethodAccessorImpl.java:39)
	at sun.reflect.DelegatingMethodAccessorImpl.invoke(DelegatingMethodAccessorImpl.java:25)
	at java.lang.reflect.Method.invoke(Method.java:597)
	at org.apache.maven.surefire.booter.SurefireBooter.runSuitesInProcess(SurefireBooter.java:350)
	at org.apache.maven.surefire.booter.SurefireBooter.main(SurefireBooter.java:1021)
Tests run: 29, Failures: 0, Errors: 0, Skipped: 0, Time elapsed: 23.676 sec
Running org.apache.openjpa.integration.validation.TestValidationGroups
80  default-validation-group  INFO   [main] openjpa.Runtime - OpenJPA dynamically loaded a
validation provider.
81  default-validation-group  INFO   [main] openjpa.Runtime - Starting OpenJPA 2.1.0-SNAPSHOT
81  default-validation-group  INFO   [main] openjpa.jdbc.JDBC - Using dictionary class "org.apache.openjpa.jdbc.sql.DerbyDictionary".
77  default-validation-group  INFO   [main] openjpa.Runtime - OpenJPA dynamically loaded a
validation provider.
78  default-validation-group  INFO   [main] openjpa.Runtime - Starting OpenJPA 2.1.0-SNAPSHOT
78  default-validation-group  INFO   [main] openjpa.jdbc.JDBC - Using dictionary class "org.apache.openjpa.jdbc.sql.DerbyDictionary".
527  default-validation-group  INFO   [main] openjpa.Runtime - OpenJPA dynamically loaded
a validation provider.
528  default-validation-group  INFO   [main] openjpa.Runtime - Starting OpenJPA 2.1.0-SNAPSHOT
529  default-validation-group  INFO   [main] openjpa.jdbc.JDBC - Using dictionary class "org.apache.openjpa.jdbc.sql.DerbyDictionary".
277  default-validation-group  INFO   [main] openjpa.Runtime - OpenJPA dynamically loaded
a validation provider.
278  default-validation-group  INFO   [main] openjpa.Runtime - Starting OpenJPA 2.1.0-SNAPSHOT
278  default-validation-group  INFO   [main] openjpa.jdbc.JDBC - Using dictionary class "org.apache.openjpa.jdbc.sql.DerbyDictionary".
121  pre-remove-default-validation-group  INFO   [main] openjpa.Runtime - OpenJPA dynamically
loaded a validation provider.
122  pre-remove-default-validation-group  INFO   [main] openjpa.Runtime - Starting OpenJPA
2.1.0-SNAPSHOT
123  pre-remove-default-validation-group  INFO   [main] openjpa.jdbc.JDBC - Using dictionary
class "org.apache.openjpa.jdbc.sql.DerbyDictionary".
135  pre-remove-default-validation-group  INFO   [main] openjpa.Runtime - OpenJPA dynamically
loaded a validation provider.
136  pre-remove-default-validation-group  INFO   [main] openjpa.Runtime - Starting OpenJPA
2.1.0-SNAPSHOT
136  pre-remove-default-validation-group  INFO   [main] openjpa.jdbc.JDBC - Using dictionary
class "org.apache.openjpa.jdbc.sql.DerbyDictionary".
72  non-default-validation-group  INFO   [main] openjpa.Runtime - OpenJPA dynamically loaded
a validation provider.
73  non-default-validation-group  INFO   [main] openjpa.Runtime - Starting OpenJPA 2.1.0-SNAPSHOT
74  non-default-validation-group  INFO   [main] openjpa.jdbc.JDBC - Using dictionary class
"org.apache.openjpa.jdbc.sql.DerbyDictionary".
75  non-default-validation-group  INFO   [main] openjpa.Runtime - OpenJPA dynamically loaded
a validation provider.
76  non-default-validation-group  INFO   [main] openjpa.Runtime - Starting OpenJPA 2.1.0-SNAPSHOT
76  non-default-validation-group  INFO   [main] openjpa.jdbc.JDBC - Using dictionary class
"org.apache.openjpa.jdbc.sql.DerbyDictionary".
281  multi-validation-group-xml  INFO   [main] openjpa.Runtime - OpenJPA dynamically loaded
a validation provider.
282  multi-validation-group-xml  INFO   [main] openjpa.Runtime - Starting OpenJPA 2.1.0-SNAPSHOT
282  multi-validation-group-xml  INFO   [main] openjpa.jdbc.JDBC - Using dictionary class
"org.apache.openjpa.jdbc.sql.DerbyDictionary".
89  multi-validation-group  INFO   [main] openjpa.Runtime - OpenJPA dynamically loaded a validation
provider.
90  multi-validation-group  INFO   [main] openjpa.Runtime - Starting OpenJPA 2.1.0-SNAPSHOT
91  multi-validation-group  INFO   [main] openjpa.jdbc.JDBC - Using dictionary class "org.apache.openjpa.jdbc.sql.DerbyDictionary".
318  multi-validation-group  INFO   [main] openjpa.Runtime - OpenJPA dynamically loaded a
validation provider.
319  multi-validation-group  INFO   [main] openjpa.Runtime - Starting OpenJPA 2.1.0-SNAPSHOT
319  multi-validation-group  INFO   [main] openjpa.jdbc.JDBC - Using dictionary class "org.apache.openjpa.jdbc.sql.DerbyDictionary".
Tests run: 11, Failures: 0, Errors: 0, Skipped: 0, Time elapsed: 4.846 sec
Running org.apache.openjpa.integration.validation.TestTraversableResolver
1  non-validation-pu  INFO   [main] openjpa.Runtime - Starting OpenJPA 2.1.0-SNAPSHOT
4  non-validation-pu  INFO   [main] openjpa.jdbc.JDBC - Using dictionary class "org.apache.openjpa.jdbc.sql.DerbyDictionary".
98  validation-pu  INFO   [main] openjpa.Runtime - OpenJPA dynamically loaded a validation
provider.
99  validation-pu  INFO   [main] openjpa.Runtime - Starting OpenJPA 2.1.0-SNAPSHOT
99  validation-pu  INFO   [main] openjpa.jdbc.JDBC - Using dictionary class "org.apache.openjpa.jdbc.sql.DerbyDictionary".
0  non-validation-pu  INFO   [main] openjpa.Runtime - Starting OpenJPA 2.1.0-SNAPSHOT
5  non-validation-pu  INFO   [main] openjpa.jdbc.JDBC - Using dictionary class "org.apache.openjpa.jdbc.sql.DerbyDictionary".
1  non-validation-pu  INFO   [main] openjpa.Runtime - Starting OpenJPA 2.1.0-SNAPSHOT
2  non-validation-pu  INFO   [main] openjpa.jdbc.JDBC - Using dictionary class "org.apache.openjpa.jdbc.sql.DerbyDictionary".
1  non-validation-pu  INFO   [main] openjpa.Runtime - Starting OpenJPA 2.1.0-SNAPSHOT
2  non-validation-pu  INFO   [main] openjpa.jdbc.JDBC - Using dictionary class "org.apache.openjpa.jdbc.sql.DerbyDictionary".
279  validation-pu  INFO   [main] openjpa.Runtime - OpenJPA dynamically loaded a validation
provider.
279  validation-pu  INFO   [main] openjpa.Runtime - Starting OpenJPA 2.1.0-SNAPSHOT
280  validation-pu  INFO   [main] openjpa.jdbc.JDBC - Using dictionary class "org.apache.openjpa.jdbc.sql.DerbyDictionary".
0  non-validation-pu  INFO   [main] openjpa.Runtime - Starting OpenJPA 2.1.0-SNAPSHOT
2  non-validation-pu  INFO   [main] openjpa.jdbc.JDBC - Using dictionary class "org.apache.openjpa.jdbc.sql.DerbyDictionary".
569  validation-pu  INFO   [main] openjpa.Runtime - OpenJPA dynamically loaded a validation
provider.
570  validation-pu  INFO   [main] openjpa.Runtime - Starting OpenJPA 2.1.0-SNAPSHOT
571  validation-pu  INFO   [main] openjpa.jdbc.JDBC - Using dictionary class "org.apache.openjpa.jdbc.sql.DerbyDictionary".
1  non-validation-pu  INFO   [main] openjpa.Runtime - Starting OpenJPA 2.1.0-SNAPSHOT
2  non-validation-pu  INFO   [main] openjpa.jdbc.JDBC - Using dictionary class "org.apache.openjpa.jdbc.sql.DerbyDictionary".
83  validation-pu  INFO   [main] openjpa.Runtime - OpenJPA dynamically loaded a validation
provider.
84  validation-pu  INFO   [main] openjpa.Runtime - Starting OpenJPA 2.1.0-SNAPSHOT
84  validation-pu  INFO   [main] openjpa.jdbc.JDBC - Using dictionary class "org.apache.openjpa.jdbc.sql.DerbyDictionary".
Tests run: 5, Failures: 0, Errors: 0, Skipped: 0, Time elapsed: 4.808 sec
Running org.apache.openjpa.integration.persistence.provider.TestPersistenceProviderResolver
Tests run: 5, Failures: 0, Errors: 0, Skipped: 0, Time elapsed: 0.029 sec
Running org.apache.openjpa.integration.validation.TestMappedSuper
78  XMLConstraintPU  INFO   [main] openjpa.Runtime - OpenJPA dynamically loaded a validation
provider.
79  XMLConstraintPU  INFO   [main] openjpa.Runtime - Starting OpenJPA 2.1.0-SNAPSHOT
79  XMLConstraintPU  INFO   [main] openjpa.jdbc.JDBC - Using dictionary class "org.apache.openjpa.jdbc.sql.DerbyDictionary".
Tests run: 1, Failures: 0, Errors: 0, Skipped: 0, Time elapsed: 0.526 sec
Running org.apache.openjpa.integration.validation.TestValidatingLEM
0  test  INFO   [main] openjpa.Runtime - Starting OpenJPA 2.1.0-SNAPSHOT
1  test  INFO   [main] openjpa.jdbc.JDBC - Using dictionary class "org.apache.openjpa.jdbc.sql.DerbyDictionary".
1  simple-none-mode  INFO   [main] openjpa.Runtime - Starting OpenJPA 2.1.0-SNAPSHOT
2  simple-none-mode  INFO   [main] openjpa.jdbc.JDBC - Using dictionary class "org.apache.openjpa.jdbc.sql.DerbyDictionary".
0  test  INFO   [main] openjpa.Runtime - Starting OpenJPA 2.1.0-SNAPSHOT
1  test  INFO   [main] openjpa.jdbc.JDBC - Using dictionary class "org.apache.openjpa.jdbc.sql.DerbyDictionary".
243  simple-auto-mode  INFO   [main] openjpa.Runtime - OpenJPA dynamically loaded a validation
provider.
244  simple-auto-mode  INFO   [main] openjpa.Runtime - Starting OpenJPA 2.1.0-SNAPSHOT
245  simple-auto-mode  INFO   [main] openjpa.jdbc.JDBC - Using dictionary class "org.apache.openjpa.jdbc.sql.DerbyDictionary".
0  test  INFO   [main] openjpa.Runtime - Starting OpenJPA 2.1.0-SNAPSHOT
1  test  INFO   [main] openjpa.jdbc.JDBC - Using dictionary class "org.apache.openjpa.jdbc.sql.DerbyDictionary".
75  simple-none-mode  INFO   [main] openjpa.Runtime - OpenJPA dynamically loaded a validation
provider.
76  simple-none-mode  INFO   [main] openjpa.Runtime - Starting OpenJPA 2.1.0-SNAPSHOT
76  simple-none-mode  INFO   [main] openjpa.jdbc.JDBC - Using dictionary class "org.apache.openjpa.jdbc.sql.DerbyDictionary".
0  test  INFO   [main] openjpa.Runtime - Starting OpenJPA 2.1.0-SNAPSHOT
1  test  INFO   [main] openjpa.jdbc.JDBC - Using dictionary class "org.apache.openjpa.jdbc.sql.DerbyDictionary".
1  simple-auto-mode  INFO   [main] openjpa.Runtime - OpenJPA dynamically loaded a validation
provider.
2  simple-auto-mode  INFO   [main] openjpa.Runtime - Starting OpenJPA 2.1.0-SNAPSHOT
2  simple-auto-mode  INFO   [main] openjpa.jdbc.JDBC - Using dictionary class "org.apache.openjpa.jdbc.sql.DerbyDictionary".
Tests run: 4, Failures: 0, Errors: 0, Skipped: 0, Time elapsed: 1.543 sec

Results :

Tests run: 55, Failures: 0, Errors: 0, Skipped: 0

[HUDSON] Recording test results
[INFO] [jar:jar {execution: default-jar}]
[INFO] Building jar: C:\hudson\hudson-slave\workspace\OpenJPA-trunk\trunk\openjpa-integration\validation\target\openjpa-integration-validation-2.1.0-SNAPSHOT.jar
[INFO] [jar:jar {execution: default-jar}]
[INFO] [jar:test-jar {execution: attach-tests}]
[INFO] Building jar: C:\hudson\hudson-slave\workspace\OpenJPA-trunk\trunk\openjpa-integration\validation\target\openjpa-integration-validation-2.1.0-SNAPSHOT-tests.jar
[INFO] [ianal:verify-legal-files {execution: default}]
[INFO] Checking legal files in: openjpa-integration-validation-2.1.0-SNAPSHOT.jar
[INFO] Checking legal files in: openjpa-integration-validation-2.1.0-SNAPSHOT-tests.jar
[INFO] [apache-rat:check {execution: default}]
[INFO] Exclude: **/.*/**
[INFO] Exclude: **/target/**/*
[INFO] [install:install {execution: default-install}]
[INFO] Installing C:\hudson\hudson-slave\workspace\OpenJPA-trunk\trunk\openjpa-integration\validation\target\openjpa-integration-validation-2.1.0-SNAPSHOT.jar
to C:\Users\hudson\.m2\repository\org\apache\openjpa\openjpa-integration-validation\2.1.0-SNAPSHOT\openjpa-integration-validation-2.1.0-SNAPSHOT.jar
[INFO] Installing C:\hudson\hudson-slave\workspace\OpenJPA-trunk\trunk\openjpa-integration\validation\target\openjpa-integration-validation-2.1.0-SNAPSHOT-tests.jar
to C:\Users\hudson\.m2\repository\org\apache\openjpa\openjpa-integration-validation\2.1.0-SNAPSHOT\openjpa-integration-validation-2.1.0-SNAPSHOT-tests.jar
[HUDSON] Archiving C:\hudson\hudson-slave\workspace\OpenJPA-trunk\trunk\openjpa-integration\validation\pom.xml
to /home/hudson/hudson/jobs/OpenJPA-trunk/modules/org.apache.openjpa$openjpa-integration-validation/builds/2010-10-21_18-06-59/archive/org.apache.openjpa/openjpa-integration-validation/2.1.0-SNAPSHOT/pom.xml
[HUDSON] Archiving C:\hudson\hudson-slave\workspace\OpenJPA-trunk\trunk\openjpa-integration\validation\target\openjpa-integration-validation-2.1.0-SNAPSHOT.jar
to /home/hudson/hudson/jobs/OpenJPA-trunk/modules/org.apache.openjpa$openjpa-integration-validation/builds/2010-10-21_18-06-59/archive/org.apache.openjpa/openjpa-integration-validation/2.1.0-SNAPSHOT/openjpa-integration-validation-2.1.0-SNAPSHOT.jar
[HUDSON] Archiving C:\hudson\hudson-slave\workspace\OpenJPA-trunk\trunk\openjpa-integration\validation\target\openjpa-integration-validation-2.1.0-SNAPSHOT-tests.jar
to /home/hudson/hudson/jobs/OpenJPA-trunk/modules/org.apache.openjpa$openjpa-integration-validation/builds/2010-10-21_18-06-59/archive/org.apache.openjpa/openjpa-integration-validation/2.1.0-SNAPSHOT/openjpa-integration-validation-2.1.0-SNAPSHOT-tests.jar
[INFO] ------------------------------------------------------------------------
[INFO] Building OpenJPA Integration Tests - JMX Platform MBeans
[INFO]    task-segment: [clean, install]
[INFO] ------------------------------------------------------------------------
[INFO] [clean:clean {execution: default-clean}]
[INFO] Deleting file set: C:\hudson\hudson-slave\workspace\OpenJPA-trunk\trunk\openjpa-integration\jmx\target
(included: [**], excluded: [])
[INFO] [buildnumber:create {execution: default}]
[INFO] [enforcer:enforce {execution: default}]
[INFO] [checkstyle:checkstyle {execution: default}]
[INFO] Source directory does not exist - skipping report.
[INFO] [remote-resources:process {execution: default}]
[INFO] [resources:resources {execution: default-resources}]
[INFO] Using 'UTF-8' encoding to copy filtered resources.
[INFO] skip non existing resourceDirectory C:\hudson\hudson-slave\workspace\OpenJPA-trunk\trunk\openjpa-integration\jmx\src\main\resources
[INFO] Copying 3 resources
[INFO] [compiler:compile {execution: default-compile}]
[INFO] No sources to compile
[INFO] [resources:testResources {execution: default-testResources}]
[INFO] Using 'UTF-8' encoding to copy filtered resources.
[INFO] Copying 1 resource
[INFO] Copying 3 resources
[INFO] [compiler:testCompile {execution: default-testCompile}]
[INFO] Compiling 2 source files to C:\hudson\hudson-slave\workspace\OpenJPA-trunk\trunk\openjpa-integration\jmx\target\test-classes
[INFO] -------------------------------------------------------------
[ERROR] COMPILATION ERROR : 
[INFO] -------------------------------------------------------------
[ERROR] \hudson\hudson-slave\workspace\OpenJPA-trunk\trunk\openjpa-integration\jmx\src\test\java\org\apache\openjpa\integration\jmx\TestJMXPlatformMBeans.java:[88,22]
cannot find symbol
symbol  : method getCacheStatistics()
location: interface org.apache.openjpa.instrumentation.DataCacheInstrument

[INFO] 1error
[INFO] -------------------------------------------------------------
[HUDSON] Archiving C:\hudson\hudson-slave\workspace\OpenJPA-trunk\trunk\openjpa-integration\jmx\pom.xml
to /home/hudson/hudson/jobs/OpenJPA-trunk/modules/org.apache.openjpa$openjpa-integration-jmx/builds/2010-10-21_18-06-59/archive/org.apache.openjpa/openjpa-integration-jmx/2.1.0-SNAPSHOT/pom.xml
[INFO] ------------------------------------------------------------------------
[ERROR] BUILD FAILURE
[INFO] ------------------------------------------------------------------------
[INFO] Compilation failure
\hudson\hudson-slave\workspace\OpenJPA-trunk\trunk\openjpa-integration\jmx\src\test\java\org\apache\openjpa\integration\jmx\TestJMXPlatformMBeans.java:[88,22]
cannot find symbol
symbol  : method getCacheStatistics()
location: interface org.apache.openjpa.instrumentation.DataCacheInstrument


[INFO] ------------------------------------------------------------------------
[INFO] For more information, run Maven with the -e switch
[INFO] ------------------------------------------------------------------------
[INFO] Total time: 65 minutes 54 seconds
[INFO] Finished at: Thu Oct 21 03:12:58 BST 2010
[INFO] Final Memory: 211M/658M
[INFO] ------------------------------------------------------------------------
Sending e-mails to: commits@openjpa.apache.org
channel stopped


Mime
View raw message