openjpa-commits mailing list archives

Site index · List index
Message view « Date » · « Thread »
Top « Date » · « Thread »
From Apache Hudson Server <hud...@hudson.apache.org>
Subject Build failed in Hudson: OpenJPA-trunk-deploy #26
Date Sat, 09 Oct 2010 08:45:34 GMT
See <https://hudson.apache.org/hudson/job/OpenJPA-trunk-deploy/26/changes>

Changes:

[dwoods] make sure tests cleanup EMs and EMFs. 6 of the TestSwitchConnection and TestOverrideNonJtaDataSource
are failing on everything except Derby, so exclude them on other DBs.

[dwoods] rollback all SingleEMTestCase changes

[dwoods] make sure tests cleanup EMs and EMFs

[dwoods] make sure tests cleanup EMs and EMFs

[dwoods] rollback setting em=null on cleanup

[dwoods] minor testcase helper tweaks

[dwoods] some extra tearDown cleanup

[mikedd] Filter connection setup SQL from SybaseDictionary.decorate when running unit tests.

[dwoods] close streams

[mikedd] Sybase converts "" to " ", update testcase expectations appropriately.

[dwoods] make sure tests cleanup EMs and EMFs

[mikedd] More helpful assert in testcase

[mikedd] Set scale and precision for AllFieldsTypeTest.

[dwoods] make sure tests cleanup EMs and EMFs

[dwoods] make sure tests cleanup EMs and EMFs

[dwoods] add comment

[dwoods] make sure tests cleanup EMs and EMFs

[dwoods] surefire excluded tests

[dwoods] surefire excluded tests

[dwoods] make sure tests cleanup EMs and EMFs

[mikedd] Exclude test for Sybase and minor update to SEmfTC

[dwoods] make sure tests cleanup EMs and EMFs

[dwoods] make sure tests cleanup EMs and EMFs

[dwoods] make sure tests cleanup EMs and EMFs

[mikedd] Prevent table name collision.

[dwoods] make sure tests cleanup EMs and EMFs

[dwoods] make sure tests cleanup EMs and EMFs

[dwoods] make sure tests cleanup EMs and EMFs

[dwoods] allow normal tearDown() to run to cleanup EMs and EMFs

[dwoods] make sure tests cleanup EMs and EMFs

[dwoods] make sure tests cleanup EMs and EMFs

[dwoods] make sure tests cleanup EMs and EMFs

[dwoods] make sure tests cleanup EMs and EMFs

[dwoods] still close EMF even if exceptions occur on closing EMs

[dwoods] match javadoc definition of protected

------------------------------------------
[...truncated 19825 lines...]
	at org.apache.openjpa.meta.MetaDataRepository.resolve(MetaDataRepository.java:630)
	at org.apache.openjpa.meta.MetaDataRepository.getMetaDataInternal(MetaDataRepository.java:398)
	at org.apache.openjpa.meta.MetaDataRepository.getMetaData(MetaDataRepository.java:371)
	at org.apache.openjpa.meta.MetaDataRepository.loadRegisteredClassMetaData(MetaDataRepository.java:1596)
	at org.apache.openjpa.meta.MetaDataRepository.getSequenceMetaDataInternal(MetaDataRepository.java:2172)
	at org.apache.openjpa.meta.MetaDataRepository.getSequenceMetaDataInternal(MetaDataRepository.java:2115)
	at org.apache.openjpa.meta.MetaDataRepository.getSequenceMetaData(MetaDataRepository.java:2107)
	at org.apache.openjpa.meta.MetaDataRepository.getSequenceMetaData(MetaDataRepository.java:2134)
	at org.apache.openjpa.meta.FieldMetaData.getValueSequenceMetaData(FieldMetaData.java:1052)
	at org.apache.openjpa.util.ImplHelper.generateValue(ImplHelper.java:157)
	at org.apache.openjpa.util.ImplHelper.generateFieldValue(ImplHelper.java:144)
	at org.apache.openjpa.jdbc.kernel.JDBCStoreManager.assignField(JDBCStoreManager.java:781)
	at org.apache.openjpa.util.ApplicationIds.assign(ApplicationIds.java:493)
	at org.apache.openjpa.util.ApplicationIds.assign(ApplicationIds.java:469)
	at org.apache.openjpa.jdbc.kernel.JDBCStoreManager.assignObjectId(JDBCStoreManager.java:765)
	at org.apache.openjpa.kernel.DelegatingStoreManager.assignObjectId(DelegatingStoreManager.java:135)
	at org.apache.openjpa.kernel.StateManagerImpl.assignObjectId(StateManagerImpl.java:605)
	at org.apache.openjpa.kernel.StateManagerImpl.preFlush(StateManagerImpl.java:2952)
	at org.apache.openjpa.kernel.PNewState.beforeFlush(PNewState.java:40)
	at org.apache.openjpa.kernel.StateManagerImpl.beforeFlush(StateManagerImpl.java:1047)
	at org.apache.openjpa.kernel.BrokerImpl.flush(BrokerImpl.java:2086)
	at org.apache.openjpa.kernel.BrokerImpl.flushSafe(BrokerImpl.java:2046)
	at org.apache.openjpa.kernel.BrokerImpl.beforeCompletion(BrokerImpl.java:1964)
	at org.apache.openjpa.kernel.LocalManagedRuntime.commit(LocalManagedRuntime.java:81)
	at org.apache.openjpa.kernel.BrokerImpl.commit(BrokerImpl.java:1488)
	at org.apache.openjpa.kernel.DelegatingBroker.commit(DelegatingBroker.java:925)
	at org.apache.openjpa.persistence.EntityManagerImpl.commit(EntityManagerImpl.java:560)
	at org.apache.openjpa.integration.validation.TestConstraints.testValidPassConstraint(TestConstraints.java:1249)
	at sun.reflect.NativeMethodAccessorImpl.invoke0(Native Method)
	at sun.reflect.NativeMethodAccessorImpl.invoke(NativeMethodAccessorImpl.java:39)
	at sun.reflect.DelegatingMethodAccessorImpl.invoke(DelegatingMethodAccessorImpl.java:25)
	at java.lang.reflect.Method.invoke(Method.java:597)
	at junit.framework.TestCase.runTest(TestCase.java:154)
	at junit.framework.TestCase.runBare(TestCase.java:127)
	at org.apache.openjpa.persistence.test.PersistenceTestCase.runBare(PersistenceTestCase.java:506)
	at org.apache.openjpa.persistence.test.PersistenceTestCase.runBare(PersistenceTestCase.java:481)
	at junit.framework.TestResult$1.protect(TestResult.java:106)
	at junit.framework.TestResult.runProtected(TestResult.java:124)
	at junit.framework.TestResult.run(TestResult.java:109)
	at junit.framework.TestCase.run(TestCase.java:118)
	at org.apache.openjpa.persistence.test.PersistenceTestCase.run(PersistenceTestCase.java:196)
	at junit.framework.TestSuite.runTest(TestSuite.java:208)
	at junit.framework.TestSuite.run(TestSuite.java:203)
	at sun.reflect.NativeMethodAccessorImpl.invoke0(Native Method)
	at sun.reflect.NativeMethodAccessorImpl.invoke(NativeMethodAccessorImpl.java:39)
	at sun.reflect.DelegatingMethodAccessorImpl.invoke(DelegatingMethodAccessorImpl.java:25)
	at java.lang.reflect.Method.invoke(Method.java:597)
	at org.apache.maven.surefire.junit.JUnitTestSet.execute(JUnitTestSet.java:213)
	at org.apache.maven.surefire.suite.AbstractDirectoryTestSuite.executeTestSet(AbstractDirectoryTestSuite.java:120)
	at org.apache.maven.surefire.suite.AbstractDirectoryTestSuite.execute(AbstractDirectoryTestSuite.java:103)
	at org.apache.maven.surefire.Surefire.run(Surefire.java:169)
	at sun.reflect.NativeMethodAccessorImpl.invoke0(Native Method)
	at sun.reflect.NativeMethodAccessorImpl.invoke(NativeMethodAccessorImpl.java:39)
	at sun.reflect.DelegatingMethodAccessorImpl.invoke(DelegatingMethodAccessorImpl.java:25)
	at java.lang.reflect.Method.invoke(Method.java:597)
	at org.apache.maven.surefire.booter.SurefireBooter.runSuitesInProcess(SurefireBooter.java:350)
	at org.apache.maven.surefire.booter.SurefireBooter.main(SurefireBooter.java:1021)
Tests run: 29, Failures: 0, Errors: 0, Skipped: 0, Time elapsed: 19.064 sec
Running org.apache.openjpa.integration.validation.TestValidationGroups
43  default-validation-group  INFO   [main] openjpa.Runtime - OpenJPA dynamically loaded a
validation provider.
43  default-validation-group  INFO   [main] openjpa.Runtime - Starting OpenJPA 2.1.0-SNAPSHOT
43  default-validation-group  INFO   [main] openjpa.jdbc.JDBC - Using dictionary class "org.apache.openjpa.jdbc.sql.DerbyDictionary".
43  default-validation-group  INFO   [main] openjpa.Runtime - OpenJPA dynamically loaded a
validation provider.
43  default-validation-group  INFO   [main] openjpa.Runtime - Starting OpenJPA 2.1.0-SNAPSHOT
43  default-validation-group  INFO   [main] openjpa.jdbc.JDBC - Using dictionary class "org.apache.openjpa.jdbc.sql.DerbyDictionary".
43  default-validation-group  INFO   [main] openjpa.Runtime - OpenJPA dynamically loaded a
validation provider.
43  default-validation-group  INFO   [main] openjpa.Runtime - Starting OpenJPA 2.1.0-SNAPSHOT
43  default-validation-group  INFO   [main] openjpa.jdbc.JDBC - Using dictionary class "org.apache.openjpa.jdbc.sql.DerbyDictionary".
43  default-validation-group  INFO   [main] openjpa.Runtime - OpenJPA dynamically loaded a
validation provider.
43  default-validation-group  INFO   [main] openjpa.Runtime - Starting OpenJPA 2.1.0-SNAPSHOT
43  default-validation-group  INFO   [main] openjpa.jdbc.JDBC - Using dictionary class "org.apache.openjpa.jdbc.sql.DerbyDictionary".
43  pre-remove-default-validation-group  INFO   [main] openjpa.Runtime - OpenJPA dynamically
loaded a validation provider.
43  pre-remove-default-validation-group  INFO   [main] openjpa.Runtime - Starting OpenJPA
2.1.0-SNAPSHOT
43  pre-remove-default-validation-group  INFO   [main] openjpa.jdbc.JDBC - Using dictionary
class "org.apache.openjpa.jdbc.sql.DerbyDictionary".
42  pre-remove-default-validation-group  INFO   [main] openjpa.Runtime - OpenJPA dynamically
loaded a validation provider.
42  pre-remove-default-validation-group  INFO   [main] openjpa.Runtime - Starting OpenJPA
2.1.0-SNAPSHOT
43  pre-remove-default-validation-group  INFO   [main] openjpa.jdbc.JDBC - Using dictionary
class "org.apache.openjpa.jdbc.sql.DerbyDictionary".
43  non-default-validation-group  INFO   [main] openjpa.Runtime - OpenJPA dynamically loaded
a validation provider.
43  non-default-validation-group  INFO   [main] openjpa.Runtime - Starting OpenJPA 2.1.0-SNAPSHOT
43  non-default-validation-group  INFO   [main] openjpa.jdbc.JDBC - Using dictionary class
"org.apache.openjpa.jdbc.sql.DerbyDictionary".
42  non-default-validation-group  INFO   [main] openjpa.Runtime - OpenJPA dynamically loaded
a validation provider.
42  non-default-validation-group  INFO   [main] openjpa.Runtime - Starting OpenJPA 2.1.0-SNAPSHOT
42  non-default-validation-group  INFO   [main] openjpa.jdbc.JDBC - Using dictionary class
"org.apache.openjpa.jdbc.sql.DerbyDictionary".
43  multi-validation-group-xml  INFO   [main] openjpa.Runtime - OpenJPA dynamically loaded
a validation provider.
43  multi-validation-group-xml  INFO   [main] openjpa.Runtime - Starting OpenJPA 2.1.0-SNAPSHOT
44  multi-validation-group-xml  INFO   [main] openjpa.jdbc.JDBC - Using dictionary class "org.apache.openjpa.jdbc.sql.DerbyDictionary".
42  multi-validation-group  INFO   [main] openjpa.Runtime - OpenJPA dynamically loaded a validation
provider.
42  multi-validation-group  INFO   [main] openjpa.Runtime - Starting OpenJPA 2.1.0-SNAPSHOT
42  multi-validation-group  INFO   [main] openjpa.jdbc.JDBC - Using dictionary class "org.apache.openjpa.jdbc.sql.DerbyDictionary".
42  multi-validation-group  INFO   [main] openjpa.Runtime - OpenJPA dynamically loaded a validation
provider.
42  multi-validation-group  INFO   [main] openjpa.Runtime - Starting OpenJPA 2.1.0-SNAPSHOT
42  multi-validation-group  INFO   [main] openjpa.jdbc.JDBC - Using dictionary class "org.apache.openjpa.jdbc.sql.DerbyDictionary".
Tests run: 11, Failures: 0, Errors: 0, Skipped: 0, Time elapsed: 4.457 sec
Running org.apache.openjpa.integration.validation.TestTraversableResolver
0  non-validation-pu  INFO   [main] openjpa.Runtime - Starting OpenJPA 2.1.0-SNAPSHOT
1  non-validation-pu  INFO   [main] openjpa.jdbc.JDBC - Using dictionary class "org.apache.openjpa.jdbc.sql.DerbyDictionary".
41  validation-pu  INFO   [main] openjpa.Runtime - OpenJPA dynamically loaded a validation
provider.
41  validation-pu  INFO   [main] openjpa.Runtime - Starting OpenJPA 2.1.0-SNAPSHOT
41  validation-pu  INFO   [main] openjpa.jdbc.JDBC - Using dictionary class "org.apache.openjpa.jdbc.sql.DerbyDictionary".
0  non-validation-pu  INFO   [main] openjpa.Runtime - Starting OpenJPA 2.1.0-SNAPSHOT
1  non-validation-pu  INFO   [main] openjpa.jdbc.JDBC - Using dictionary class "org.apache.openjpa.jdbc.sql.DerbyDictionary".
1  non-validation-pu  INFO   [main] openjpa.Runtime - Starting OpenJPA 2.1.0-SNAPSHOT
1  non-validation-pu  INFO   [main] openjpa.jdbc.JDBC - Using dictionary class "org.apache.openjpa.jdbc.sql.DerbyDictionary".
0  non-validation-pu  INFO   [main] openjpa.Runtime - Starting OpenJPA 2.1.0-SNAPSHOT
0  non-validation-pu  INFO   [main] openjpa.jdbc.JDBC - Using dictionary class "org.apache.openjpa.jdbc.sql.DerbyDictionary".
40  validation-pu  INFO   [main] openjpa.Runtime - OpenJPA dynamically loaded a validation
provider.
41  validation-pu  INFO   [main] openjpa.Runtime - Starting OpenJPA 2.1.0-SNAPSHOT
41  validation-pu  INFO   [main] openjpa.jdbc.JDBC - Using dictionary class "org.apache.openjpa.jdbc.sql.DerbyDictionary".
0  non-validation-pu  INFO   [main] openjpa.Runtime - Starting OpenJPA 2.1.0-SNAPSHOT
0  non-validation-pu  INFO   [main] openjpa.jdbc.JDBC - Using dictionary class "org.apache.openjpa.jdbc.sql.DerbyDictionary".
41  validation-pu  INFO   [main] openjpa.Runtime - OpenJPA dynamically loaded a validation
provider.
41  validation-pu  INFO   [main] openjpa.Runtime - Starting OpenJPA 2.1.0-SNAPSHOT
41  validation-pu  INFO   [main] openjpa.jdbc.JDBC - Using dictionary class "org.apache.openjpa.jdbc.sql.DerbyDictionary".
1  non-validation-pu  INFO   [main] openjpa.Runtime - Starting OpenJPA 2.1.0-SNAPSHOT
1  non-validation-pu  INFO   [main] openjpa.jdbc.JDBC - Using dictionary class "org.apache.openjpa.jdbc.sql.DerbyDictionary".
41  validation-pu  INFO   [main] openjpa.Runtime - OpenJPA dynamically loaded a validation
provider.
41  validation-pu  INFO   [main] openjpa.Runtime - Starting OpenJPA 2.1.0-SNAPSHOT
41  validation-pu  INFO   [main] openjpa.jdbc.JDBC - Using dictionary class "org.apache.openjpa.jdbc.sql.DerbyDictionary".
Tests run: 5, Failures: 0, Errors: 0, Skipped: 0, Time elapsed: 4.64 sec
Running org.apache.openjpa.integration.persistence.provider.TestPersistenceProviderResolver
Tests run: 5, Failures: 0, Errors: 0, Skipped: 0, Time elapsed: 0.014 sec
Running org.apache.openjpa.integration.validation.TestMappedSuper
40  XMLConstraintPU  INFO   [main] openjpa.Runtime - OpenJPA dynamically loaded a validation
provider.
41  XMLConstraintPU  INFO   [main] openjpa.Runtime - Starting OpenJPA 2.1.0-SNAPSHOT
41  XMLConstraintPU  INFO   [main] openjpa.jdbc.JDBC - Using dictionary class "org.apache.openjpa.jdbc.sql.DerbyDictionary".
Tests run: 1, Failures: 0, Errors: 0, Skipped: 0, Time elapsed: 0.695 sec
Running org.apache.openjpa.integration.validation.TestValidatingLEM
0  test  INFO   [main] openjpa.Runtime - Starting OpenJPA 2.1.0-SNAPSHOT
1  test  INFO   [main] openjpa.jdbc.JDBC - Using dictionary class "org.apache.openjpa.jdbc.sql.DerbyDictionary".
1  simple-none-mode  INFO   [main] openjpa.Runtime - Starting OpenJPA 2.1.0-SNAPSHOT
1  simple-none-mode  INFO   [main] openjpa.jdbc.JDBC - Using dictionary class "org.apache.openjpa.jdbc.sql.DerbyDictionary".
0  test  INFO   [main] openjpa.Runtime - Starting OpenJPA 2.1.0-SNAPSHOT
0  test  INFO   [main] openjpa.jdbc.JDBC - Using dictionary class "org.apache.openjpa.jdbc.sql.DerbyDictionary".
43  simple-auto-mode  INFO   [main] openjpa.Runtime - OpenJPA dynamically loaded a validation
provider.
43  simple-auto-mode  INFO   [main] openjpa.Runtime - Starting OpenJPA 2.1.0-SNAPSHOT
43  simple-auto-mode  INFO   [main] openjpa.jdbc.JDBC - Using dictionary class "org.apache.openjpa.jdbc.sql.DerbyDictionary".
0  test  INFO   [main] openjpa.Runtime - Starting OpenJPA 2.1.0-SNAPSHOT
0  test  INFO   [main] openjpa.jdbc.JDBC - Using dictionary class "org.apache.openjpa.jdbc.sql.DerbyDictionary".
42  simple-none-mode  INFO   [main] openjpa.Runtime - OpenJPA dynamically loaded a validation
provider.
42  simple-none-mode  INFO   [main] openjpa.Runtime - Starting OpenJPA 2.1.0-SNAPSHOT
43  simple-none-mode  INFO   [main] openjpa.jdbc.JDBC - Using dictionary class "org.apache.openjpa.jdbc.sql.DerbyDictionary".
0  test  INFO   [main] openjpa.Runtime - Starting OpenJPA 2.1.0-SNAPSHOT
1  test  INFO   [main] openjpa.jdbc.JDBC - Using dictionary class "org.apache.openjpa.jdbc.sql.DerbyDictionary".
1  simple-auto-mode  INFO   [main] openjpa.Runtime - OpenJPA dynamically loaded a validation
provider.
1  simple-auto-mode  INFO   [main] openjpa.Runtime - Starting OpenJPA 2.1.0-SNAPSHOT
1  simple-auto-mode  INFO   [main] openjpa.jdbc.JDBC - Using dictionary class "org.apache.openjpa.jdbc.sql.DerbyDictionary".
Tests run: 4, Failures: 0, Errors: 0, Skipped: 0, Time elapsed: 2.413 sec

Results :

Tests run: 55, Failures: 0, Errors: 0, Skipped: 0

[HUDSON] Recording test results
[INFO] [jar:jar {execution: default-jar}]
[INFO] Building jar: <https://hudson.apache.org/hudson/job/OpenJPA-trunk-deploy/ws/trunk/openjpa-integration/validation/target/openjpa-integration-validation-2.1.0-SNAPSHOT.jar>
[INFO] [jar:jar {execution: default-jar}]
[INFO] [jar:test-jar {execution: attach-tests}]
[INFO] Building jar: <https://hudson.apache.org/hudson/job/OpenJPA-trunk-deploy/ws/trunk/openjpa-integration/validation/target/openjpa-integration-validation-2.1.0-SNAPSHOT-tests.jar>
[INFO] [ianal:verify-legal-files {execution: default}]
[INFO] Checking legal files in: openjpa-integration-validation-2.1.0-SNAPSHOT.jar
[INFO] Checking legal files in: openjpa-integration-validation-2.1.0-SNAPSHOT-tests.jar
[INFO] [apache-rat:check {execution: default}]
[INFO] Exclude: **/.*/**
[INFO] Exclude: **/target/**/*
[INFO] [install:install {execution: default-install}]
[INFO] Installing <https://hudson.apache.org/hudson/job/OpenJPA-trunk-deploy/ws/trunk/openjpa-integration/validation/target/openjpa-integration-validation-2.1.0-SNAPSHOT.jar>
to /home/hudson/.m2/repository/org/apache/openjpa/openjpa-integration-validation/2.1.0-SNAPSHOT/openjpa-integration-validation-2.1.0-SNAPSHOT.jar
[INFO] Installing <https://hudson.apache.org/hudson/job/OpenJPA-trunk-deploy/ws/trunk/openjpa-integration/validation/target/openjpa-integration-validation-2.1.0-SNAPSHOT-tests.jar>
to /home/hudson/.m2/repository/org/apache/openjpa/openjpa-integration-validation/2.1.0-SNAPSHOT/openjpa-integration-validation-2.1.0-SNAPSHOT-tests.jar
[INFO] [deploy:deploy {execution: default-deploy}]
[INFO] Retrieving previous build number from apache.snapshots.https
Uploading: https://repository.apache.org/content/repositories/snapshots/org/apache/openjpa/openjpa-integration-validation/2.1.0-SNAPSHOT/openjpa-integration-validation-2.1.0-20101009.064830-71.jar
8K uploaded  (openjpa-integration-validation-2.1.0-20101009.064830-71.jar)
[INFO] Retrieving previous metadata from apache.snapshots.https
[INFO] Uploading repository metadata for: 'artifact org.apache.openjpa:openjpa-integration-validation'
[INFO] Retrieving previous metadata from apache.snapshots.https
[INFO] Uploading repository metadata for: 'snapshot org.apache.openjpa:openjpa-integration-validation:2.1.0-SNAPSHOT'
[INFO] Uploading project information for openjpa-integration-validation 2.1.0-20101009.064830-71
[INFO] Retrieving previous build number from apache.snapshots.https
Uploading: https://repository.apache.org/content/repositories/snapshots/org/apache/openjpa/openjpa-integration-validation/2.1.0-SNAPSHOT/openjpa-integration-validation-2.1.0-20101009.064830-71-tests.jar
160K uploaded  (openjpa-integration-validation-2.1.0-20101009.064830-71-tests.jar)
[INFO] Preparing javadoc:javadoc
[WARNING] Removing: javadoc from forked lifecycle, to prevent recursive invocation.
[HUDSON] Archiving <https://hudson.apache.org/hudson/job/OpenJPA-trunk-deploy/ws/trunk/openjpa-integration/validation/pom.xml>
to /home/hudson/hudson/jobs/OpenJPA-trunk-deploy/modules/org.apache.openjpa$openjpa-integration-validation/builds/2010-10-09_06-47-41/archive/org.apache.openjpa/openjpa-integration-validation/2.1.0-SNAPSHOT/pom.xml
[HUDSON] Archiving <https://hudson.apache.org/hudson/job/OpenJPA-trunk-deploy/ws/trunk/openjpa-integration/validation/target/openjpa-integration-validation-2.1.0-SNAPSHOT.jar>
to /home/hudson/hudson/jobs/OpenJPA-trunk-deploy/modules/org.apache.openjpa$openjpa-integration-validation/builds/2010-10-09_06-47-41/archive/org.apache.openjpa/openjpa-integration-validation/2.1.0-20101009.064830-71/openjpa-integration-validation-2.1.0-SNAPSHOT.jar
[HUDSON] Archiving <https://hudson.apache.org/hudson/job/OpenJPA-trunk-deploy/ws/trunk/openjpa-integration/validation/target/openjpa-integration-validation-2.1.0-SNAPSHOT-tests.jar>
to /home/hudson/hudson/jobs/OpenJPA-trunk-deploy/modules/org.apache.openjpa$openjpa-integration-validation/builds/2010-10-09_06-47-41/archive/org.apache.openjpa/openjpa-integration-validation/2.1.0-20101009.064830-71/openjpa-integration-validation-2.1.0-SNAPSHOT-tests.jar
[INFO] [buildnumber:create {execution: default}]
[INFO] [enforcer:enforce {execution: default}]
[INFO] [site:site {execution: default-site}]
[INFO] Parent project loaded from repository.
[INFO] Generating "Issue Tracking" report.
[INFO] Generating "Project Team" report.
[INFO] Generating "Dependency Management" report.
[INFO] Generating "Continuous Integration" report.
[INFO] Generating "Project Plugins" report.
[INFO] Generating "Dependencies" report.
Downloading: http://repo1.maven.org/maven2/commons-collections/commons-collections/3.2.1/commons-collections-3.2.1.jar
Downloading: http://repo1.maven.org/maven2/commons-lang/commons-lang/2.4/commons-lang-2.4.jar
Downloading: http://repo1.maven.org/maven2/commons-pool/commons-pool/1.5.4/commons-pool-1.5.4.jar
Downloading: http://repo1.maven.org/maven2/net/sourceforge/serp/serp/1.13.1/serp-1.13.1.jar
[ERROR] Artifact: org.apache.geronimo.specs:geronimo-jms_1.1_spec:jar:1.1.1 has no file.
[ERROR] Artifact: org.apache.geronimo.specs:geronimo-jpa_2.0_spec:jar:1.1 has no file.
[ERROR] Artifact: org.apache.geronimo.specs:geronimo-jta_1.1_spec:jar:1.1.1 has no file.
[ERROR] Artifact: org.apache.openjpa:openjpa-jdbc:jar:2.1.0-SNAPSHOT has no file.
[ERROR] Artifact: org.apache.openjpa:openjpa-kernel:jar:2.1.0-SNAPSHOT has no file.
[ERROR] Artifact: org.apache.openjpa:openjpa-lib:jar:2.1.0-SNAPSHOT has no file.
[ERROR] Artifact: org.apache.openjpa:openjpa-persistence:jar:2.1.0-SNAPSHOT has no file.
Downloading: http://repository.apache.org/snapshots/org/apache/openjpa/openjpa-jdbc/2.1.0-SNAPSHOT/openjpa-jdbc-2.1.0-20101009.064830-79.jar
Downloading: http://repository.apache.org/snapshots/org/apache/openjpa/openjpa-kernel/2.1.0-SNAPSHOT/openjpa-kernel-2.1.0-20101009.064830-79.jar
Downloading: http://repository.apache.org/snapshots/org/apache/openjpa/openjpa-lib/2.1.0-SNAPSHOT/openjpa-lib-2.1.0-20101009.064830-80.jar
Downloading: http://repository.apache.org/snapshots/org/apache/openjpa/openjpa-persistence/2.1.0-SNAPSHOT/openjpa-persistence-2.1.0-SNAPSHOT.jar
[INFO] Unable to find resource 'org.apache.openjpa:openjpa-persistence:jar:2.1.0-SNAPSHOT'
in repository apache.snapshots (http://repository.apache.org/snapshots)
[INFO] Generating "Source Repository" report.
[INFO] Generating "Plugin Management" report.
[INFO] Generating "Mailing Lists" report.
[INFO] Generating "Project Summary" report.
[INFO] Generating "About" report.
[INFO] Generating "Project License" report.
[INFO] Generating "Dependency Convergence" report.
[HUDSON] Archiving site from <https://hudson.apache.org/hudson/job/OpenJPA-trunk-deploy/ws/trunk/openjpa-integration/validation/target/site>
to /home/hudson/hudson/jobs/OpenJPA-trunk-deploy/site/openjpa-integration-validation
[INFO] ------------------------------------------------------------------------
[INFO] Building OpenJPA Integration Tests - JMX Platform MBeans
[INFO]    task-segment: [clean, deploy, site]
[INFO] ------------------------------------------------------------------------
[INFO] [clean:clean {execution: default-clean}]
[INFO] Deleting file set: <https://hudson.apache.org/hudson/job/OpenJPA-trunk-deploy/ws/trunk/openjpa-integration/jmx/target>
(included: [**], excluded: [])
[INFO] [buildnumber:create {execution: default}]
[INFO] [enforcer:enforce {execution: default}]
[INFO] [checkstyle:checkstyle {execution: default}]
[INFO] Source directory does not exist - skipping report.
[INFO] [remote-resources:process {execution: default}]
[INFO] [resources:resources {execution: default-resources}]
[INFO] Using 'UTF-8' encoding to copy filtered resources.
[INFO] skip non existing resourceDirectory <https://hudson.apache.org/hudson/job/OpenJPA-trunk-deploy/ws/trunk/openjpa-integration/jmx/src/main/resources>
[INFO] Copying 3 resources
[INFO] [compiler:compile {execution: default-compile}]
[INFO] No sources to compile
[INFO] [resources:testResources {execution: default-testResources}]
[INFO] Using 'UTF-8' encoding to copy filtered resources.
[INFO] Copying 1 resource
[INFO] Copying 3 resources
[INFO] [compiler:testCompile {execution: default-testCompile}]
[INFO] Compiling 2 source files to <https://hudson.apache.org/hudson/job/OpenJPA-trunk-deploy/ws/trunk/openjpa-integration/jmx/target/test-classes>
Build timed out. Aborting
Sending e-mails to: commits@openjpa.apache.org
[INFO] [dependency:unpack {execution: unpack}]
[INFO] Configured Artifact: org.apache.openjpa:openjpa-persistence-jdbc:2.1.0-SNAPSHOT:test-jar
[INFO] Unpacking /home/hudson/.m2/repository/org/apache/openjpa/openjpa-persistence-jdbc/2.1.0-SNAPSHOT/openjpa-persistence-jdbc-2.1.0-SNAPSHOT-tests.jar
to
  <https://hudson.apache.org/hudson/job/OpenJPA-trunk-deploy/ws/trunk/openjpa-integration/jmx/target/test-classes>
   with includes org/apache/openjpa/persistence/test/*.class and excludes:null
channel stopped


Mime
View raw message