openjpa-commits mailing list archives

Site index · List index
Message view « Date » · « Thread »
Top « Date » · « Thread »
From Apache Hudson Server <hud...@hudson.apache.org>
Subject Build failed in Hudson: OpenJPA-trunk #155
Date Sat, 04 Sep 2010 04:40:39 GMT
See <https://hudson.apache.org/hudson/job/OpenJPA-trunk/155/changes>

Changes:

[ppoddar] Delete redundant classes

------------------------------------------
[...truncated 195 lines...]
[INFO] [jar:test-jar {execution: attach-tests}]
[INFO] Building jar: C:\hudson\hudson-slave\workspace\OpenJPA-trunk\trunk\openjpa-lib\target\openjpa-lib-2.1.0-SNAPSHOT-tests.jar
[INFO] [ianal:verify-legal-files {execution: default}]
[INFO] Checking legal files in: openjpa-lib-2.1.0-SNAPSHOT.jar
[INFO] Checking legal files in: openjpa-lib-2.1.0-SNAPSHOT-tests.jar
[INFO] [apache-rat:check {execution: default}]
[INFO] Exclude: **/.*/**
[INFO] Exclude: **/target/**/*
[INFO] [install:install {execution: default-install}]
[INFO] Installing C:\hudson\hudson-slave\workspace\OpenJPA-trunk\trunk\openjpa-lib\target\openjpa-lib-2.1.0-SNAPSHOT.jar
to C:\Users\hudson\.m2\repository\org\apache\openjpa\openjpa-lib\2.1.0-SNAPSHOT\openjpa-lib-2.1.0-SNAPSHOT.jar
[INFO] Installing C:\hudson\hudson-slave\workspace\OpenJPA-trunk\trunk\openjpa-lib\target\openjpa-lib-2.1.0-SNAPSHOT-tests.jar
to C:\Users\hudson\.m2\repository\org\apache\openjpa\openjpa-lib\2.1.0-SNAPSHOT\openjpa-lib-2.1.0-SNAPSHOT-tests.jar
[HUDSON] Archiving C:\hudson\hudson-slave\workspace\OpenJPA-trunk\trunk\openjpa-lib\pom.xml
to /home/hudson/hudson/jobs/OpenJPA-trunk/modules/org.apache.openjpa$openjpa-lib/builds/2010-09-04_04-33-46/archive/org.apache.openjpa/openjpa-lib/2.1.0-SNAPSHOT/pom.xml
[HUDSON] Archiving C:\hudson\hudson-slave\workspace\OpenJPA-trunk\trunk\openjpa-lib\target\openjpa-lib-2.1.0-SNAPSHOT.jar
to /home/hudson/hudson/jobs/OpenJPA-trunk/modules/org.apache.openjpa$openjpa-lib/builds/2010-09-04_04-33-46/archive/org.apache.openjpa/openjpa-lib/2.1.0-SNAPSHOT/openjpa-lib-2.1.0-SNAPSHOT.jar
[HUDSON] Archiving C:\hudson\hudson-slave\workspace\OpenJPA-trunk\trunk\openjpa-lib\target\openjpa-lib-2.1.0-SNAPSHOT-tests.jar
to /home/hudson/hudson/jobs/OpenJPA-trunk/modules/org.apache.openjpa$openjpa-lib/builds/2010-09-04_04-33-46/archive/org.apache.openjpa/openjpa-lib/2.1.0-SNAPSHOT/openjpa-lib-2.1.0-SNAPSHOT-tests.jar
[INFO] ------------------------------------------------------------------------
[INFO] Building OpenJPA Kernel
[INFO]    task-segment: [clean, install]
[INFO] ------------------------------------------------------------------------
[INFO] [clean:clean {execution: default-clean}]
[INFO] Deleting file set: C:\hudson\hudson-slave\workspace\OpenJPA-trunk\trunk\openjpa-kernel\target
(included: [**], excluded: [])
[INFO] [buildnumber:create {execution: default}]
[INFO] [enforcer:enforce {execution: default}]
[INFO] [javacc:jjtree-javacc {execution: jjtree-javacc-jpql}]
Java Compiler Compiler Version 4.0 (Tree Builder)
(type "jjtree" with no arguments for help)
Reading from file C:\hudson\hudson-slave\workspace\OpenJPA-trunk\trunk\openjpa-kernel\src\main\jjtree\org\apache\openjpa\kernel\jpql\JPQL.jjt
. . .
File "C:\hudson\hudson-slave\workspace\OpenJPA-trunk\trunk\openjpa-kernel\target\generated-sources\jjtree\org\apache\openjpa\kernel\jpql\Node.java"
does not exist.  Will create one.
Annotated grammar generated successfully in C:\hudson\hudson-slave\workspace\OpenJPA-trunk\trunk\openjpa-kernel\target\generated-sources\jjtree\org\apache\openjpa\kernel\jpql\JPQL.jj
Java Compiler Compiler Version 4.0 (Parser Generator)
(type "javacc" with no arguments for help)
Reading from file C:\hudson\hudson-slave\workspace\OpenJPA-trunk\trunk\openjpa-kernel\target\generated-sources\jjtree\org\apache\openjpa\kernel\jpql\JPQL.jj
. . .
Warning: Choice conflict in (...)* construct at line 935, column 17.
         Expansion nested within construct and expansion following construct
         have common prefixes, one of which is: "+"
         Consider using a lookahead of 2 or more for nested expansion.
Warning: Choice conflict in (...)* construct at line 944, column 17.
         Expansion nested within construct and expansion following construct
         have common prefixes, one of which is: "*"
         Consider using a lookahead of 2 or more for nested expansion.
File "TokenMgrError.java" does not exist.  Will create one.
Warning: ParseException.java: File is obsolete.  Please rename or delete this file so that
a new one can be generated for you.
File "Token.java" does not exist.  Will create one.
File "JavaCharStream.java" does not exist.  Will create one.
Parser generated with 0 errors and 3 warnings.
[INFO] Processed 1 grammar
[INFO] [checkstyle:checkstyle {execution: default}]
[INFO] Starting audit...
Audit done.

[WARNING] Unable to locate Source XRef to link to - DISABLED
[INFO] [remote-resources:process {execution: default}]
[INFO] [resources:resources {execution: default-resources}]
[INFO] Using 'UTF-8' encoding to copy filtered resources.
[INFO] Copying 15 resources
[INFO] Copying 3 resources
[INFO] [compiler:compile {execution: default-compile}]
[INFO] Compiling 485 source files to C:\hudson\hudson-slave\workspace\OpenJPA-trunk\trunk\openjpa-kernel\target\classes
[INFO] [antrun:run {execution: add-was-interfaces}]
[INFO] Executing tasks
[INFO] Executed tasks
[INFO] [antrun:run {execution: generate-standard-sco-proxies}]
[INFO] Executing tasks
org.apache.openjpa.util.java$sql$Date$proxy
org.apache.openjpa.util.java$sql$Time$proxy
org.apache.openjpa.util.java$sql$Timestamp$proxy
org.apache.openjpa.util.java$util$ArrayList$proxy
org.apache.openjpa.util.java$util$Date$proxy
org.apache.openjpa.util.java$util$GregorianCalendar$proxy
org.apache.openjpa.util.java$util$HashMap$proxy
org.apache.openjpa.util.java$util$HashSet$proxy
org.apache.openjpa.util.java$util$Hashtable$proxy
org.apache.openjpa.util.java$util$LinkedList$proxy
org.apache.openjpa.util.java$util$Properties$proxy
org.apache.openjpa.util.java$util$TreeMap$proxy
org.apache.openjpa.util.java$util$TreeSet$proxy
org.apache.openjpa.util.java$util$Vector$proxy
org.apache.openjpa.util.java$util$EnumMap$proxy
org.apache.openjpa.util.java$util$IdentityHashMap$proxy
org.apache.openjpa.util.java$util$LinkedHashMap$proxy
org.apache.openjpa.util.java$util$LinkedHashSet$proxy
org.apache.openjpa.util.java$util$PriorityQueue$proxy
[INFO] Executed tasks
[INFO] [resources:testResources {execution: default-testResources}]
[INFO] Using 'UTF-8' encoding to copy filtered resources.
[INFO] skip non existing resourceDirectory C:\hudson\hudson-slave\workspace\OpenJPA-trunk\trunk\openjpa-kernel\src\test\resources
[INFO] Copying 3 resources
[INFO] [compiler:testCompile {execution: default-testCompile}]
[INFO] Compiling 8 source files to C:\hudson\hudson-slave\workspace\OpenJPA-trunk\trunk\openjpa-kernel\target\test-classes
[INFO] [surefire:test {execution: default-test}]
[INFO] Surefire report directory: C:\hudson\hudson-slave\workspace\OpenJPA-trunk\trunk\openjpa-kernel\target\surefire-reports

-------------------------------------------------------
 T E S T S
-------------------------------------------------------
Running org.apache.openjpa.meta.TestMemberProvider
Tests run: 2, Failures: 0, Errors: 0, Skipped: 0, Time elapsed: 1.189 sec
Running org.apache.openjpa.enhance.TestPCSubclassNameConversion
Tests run: 1, Failures: 0, Errors: 0, Skipped: 0, Time elapsed: 2.197 sec
Running org.apache.openjpa.conf.TestSpecification
Tests run: 3, Failures: 0, Errors: 0, Skipped: 0, Time elapsed: 0.022 sec
Running org.apache.openjpa.meta.TestAccessCode
Tests run: 8, Failures: 0, Errors: 0, Skipped: 0, Time elapsed: 0.122 sec
Running org.apache.openjpa.enhance.TestGetDeclaredMethod
Tests run: 3, Failures: 0, Errors: 0, Skipped: 0, Time elapsed: 0.101 sec
Running org.apache.openjpa.util.TestProxyManager
Tests run: 41, Failures: 0, Errors: 0, Skipped: 0, Time elapsed: 4.211 sec
Running org.apache.openjpa.util.TestResultShape
Tests run: 8, Failures: 0, Errors: 0, Skipped: 0, Time elapsed: 0.195 sec
Running org.apache.openjpa.ee.TestWASManagedRuntime
Tests run: 1, Failures: 0, Errors: 0, Skipped: 0, Time elapsed: 0.041 sec

Results :

Tests run: 67, Failures: 0, Errors: 0, Skipped: 0

[HUDSON] Recording test results
[INFO] [jar:jar {execution: default-jar}]
[INFO] Building jar: C:\hudson\hudson-slave\workspace\OpenJPA-trunk\trunk\openjpa-kernel\target\openjpa-kernel-2.1.0-SNAPSHOT.jar
[INFO] [jar:jar {execution: default-jar}]
[INFO] [jar:test-jar {execution: attach-tests}]
[INFO] Building jar: C:\hudson\hudson-slave\workspace\OpenJPA-trunk\trunk\openjpa-kernel\target\openjpa-kernel-2.1.0-SNAPSHOT-tests.jar
[INFO] [ianal:verify-legal-files {execution: default}]
[INFO] Checking legal files in: openjpa-kernel-2.1.0-SNAPSHOT.jar
[INFO] Checking legal files in: openjpa-kernel-2.1.0-SNAPSHOT-tests.jar
[INFO] [apache-rat:check {execution: default}]
[INFO] Exclude: **/.*/**
[INFO] Exclude: **/target/**/*
[INFO] [install:install {execution: default-install}]
[INFO] Installing C:\hudson\hudson-slave\workspace\OpenJPA-trunk\trunk\openjpa-kernel\target\openjpa-kernel-2.1.0-SNAPSHOT.jar
to C:\Users\hudson\.m2\repository\org\apache\openjpa\openjpa-kernel\2.1.0-SNAPSHOT\openjpa-kernel-2.1.0-SNAPSHOT.jar
[INFO] Installing C:\hudson\hudson-slave\workspace\OpenJPA-trunk\trunk\openjpa-kernel\target\openjpa-kernel-2.1.0-SNAPSHOT-tests.jar
to C:\Users\hudson\.m2\repository\org\apache\openjpa\openjpa-kernel\2.1.0-SNAPSHOT\openjpa-kernel-2.1.0-SNAPSHOT-tests.jar
[HUDSON] Archiving C:\hudson\hudson-slave\workspace\OpenJPA-trunk\trunk\openjpa-kernel\pom.xml
to /home/hudson/hudson/jobs/OpenJPA-trunk/modules/org.apache.openjpa$openjpa-kernel/builds/2010-09-04_04-33-46/archive/org.apache.openjpa/openjpa-kernel/2.1.0-SNAPSHOT/pom.xml
[HUDSON] Archiving C:\hudson\hudson-slave\workspace\OpenJPA-trunk\trunk\openjpa-kernel\target\openjpa-kernel-2.1.0-SNAPSHOT.jar
to /home/hudson/hudson/jobs/OpenJPA-trunk/modules/org.apache.openjpa$openjpa-kernel/builds/2010-09-04_04-33-46/archive/org.apache.openjpa/openjpa-kernel/2.1.0-SNAPSHOT/openjpa-kernel-2.1.0-SNAPSHOT.jar
[HUDSON] Archiving C:\hudson\hudson-slave\workspace\OpenJPA-trunk\trunk\openjpa-kernel\target\openjpa-kernel-2.1.0-SNAPSHOT-tests.jar
to /home/hudson/hudson/jobs/OpenJPA-trunk/modules/org.apache.openjpa$openjpa-kernel/builds/2010-09-04_04-33-46/archive/org.apache.openjpa/openjpa-kernel/2.1.0-SNAPSHOT/openjpa-kernel-2.1.0-SNAPSHOT-tests.jar
[INFO] ------------------------------------------------------------------------
[INFO] Building OpenJPA JDBC
[INFO]    task-segment: [clean, install]
[INFO] ------------------------------------------------------------------------
[INFO] [clean:clean {execution: default-clean}]
[INFO] Deleting file set: C:\hudson\hudson-slave\workspace\OpenJPA-trunk\trunk\openjpa-jdbc\target
(included: [**], excluded: [])
[INFO] [buildnumber:create {execution: default}]
[INFO] [enforcer:enforce {execution: default}]
[INFO] [checkstyle:checkstyle {execution: default}]
[INFO] Starting audit...
Audit done.

[WARNING] Unable to locate Source XRef to link to - DISABLED
[INFO] [remote-resources:process {execution: default}]
[INFO] [resources:resources {execution: default-resources}]
[INFO] Using 'UTF-8' encoding to copy filtered resources.
[INFO] Copying 14 resources
[INFO] Copying 3 resources
[INFO] [compiler:compile {execution: default-compile}]
[INFO] Compiling 354 source files to C:\hudson\hudson-slave\workspace\OpenJPA-trunk\trunk\openjpa-jdbc\target\classes
[INFO] [resources:testResources {execution: default-testResources}]
[INFO] Using 'UTF-8' encoding to copy filtered resources.
[INFO] skip non existing resourceDirectory C:\hudson\hudson-slave\workspace\OpenJPA-trunk\trunk\openjpa-jdbc\src\test\resources
[INFO] Copying 3 resources
[INFO] [compiler:testCompile {execution: default-testCompile}]
[INFO] Compiling 5 source files to C:\hudson\hudson-slave\workspace\OpenJPA-trunk\trunk\openjpa-jdbc\target\test-classes
[INFO] [surefire:test {execution: default-test}]
[INFO] Surefire report directory: C:\hudson\hudson-slave\workspace\OpenJPA-trunk\trunk\openjpa-jdbc\target\surefire-reports

-------------------------------------------------------
 T E S T S
-------------------------------------------------------
Running org.apache.openjpa.jdbc.sql.identifier.TestDBIdentifiers
Tests run: 5, Failures: 0, Errors: 0, Skipped: 0, Time elapsed: 0.838 sec
Running org.apache.openjpa.jdbc.meta.TestMappingDefaultsImpl
246  INFO   [main] openjpa.jdbc.JDBC - Using dictionary class "org.apache.openjpa.jdbc.sql.OracleDictionary".
Tests run: 1, Failures: 0, Errors: 0, Skipped: 0, Time elapsed: 4.556 sec
Running org.apache.openjpa.jdbc.sql.TestMySQLDictionary
Tests run: 3, Failures: 0, Errors: 0, Skipped: 0, Time elapsed: 3.164 sec
Running org.apache.openjpa.jdbc.kernel.TestUpdateManagerFlushException
Tests run: 1, Failures: 0, Errors: 0, Skipped: 0, Time elapsed: 0.091 sec
Running org.apache.openjpa.jdbc.sql.TestDictionaryFactory
Tests run: 1, Failures: 0, Errors: 0, Skipped: 0, Time elapsed: 0.098 sec

Results :

Tests run: 11, Failures: 0, Errors: 0, Skipped: 0

[HUDSON] Recording test results
FATAL: Failed to save the JUnit test result
hudson.util.IOException2: Failed to create a temporary file in /home/hudson/hudson/jobs/OpenJPA-trunk/modules/org.apache.openjpa$openjpa-jdbc/builds/2010-09-04_04-33-46
	at hudson.util.AtomicFileWriter.<init>(AtomicFileWriter.java:67)
	at hudson.util.AtomicFileWriter.<init>(AtomicFileWriter.java:54)
	at hudson.XmlFile.write(XmlFile.java:162)
	at hudson.tasks.junit.TestResultAction.setResult(TestResultAction.java:82)
	at hudson.tasks.junit.TestResultAction.<init>(TestResultAction.java:67)
	at hudson.maven.reporters.SurefireReport.<init>(SurefireReport.java:45)
	at hudson.maven.reporters.SurefireArchiver$1.call(SurefireArchiver.java:114)
	at hudson.maven.reporters.SurefireArchiver$1.call(SurefireArchiver.java:110)
	at hudson.maven.MavenBuild$ProxyImpl.execute(MavenBuild.java:341)
	at sun.reflect.GeneratedMethodAccessor695.invoke(Unknown Source)
	at sun.reflect.DelegatingMethodAccessorImpl.invoke(DelegatingMethodAccessorImpl.java:25)
	at java.lang.reflect.Method.invoke(Method.java:597)
	at hudson.model.Executor$1.call(Executor.java:380)
	at hudson.util.InterceptingProxy$1.invoke(InterceptingProxy.java:23)
	at $Proxy46.execute(Unknown Source)
	at sun.reflect.GeneratedMethodAccessor4757.invoke(Unknown Source)
	at sun.reflect.DelegatingMethodAccessorImpl.invoke(DelegatingMethodAccessorImpl.java:25)
	at java.lang.reflect.Method.invoke(Method.java:597)
	at hudson.remoting.RemoteInvocationHandler$RPCRequest.perform(RemoteInvocationHandler.java:274)
	at hudson.remoting.RemoteInvocationHandler$RPCRequest.call(RemoteInvocationHandler.java:255)
	at hudson.remoting.RemoteInvocationHandler$RPCRequest.call(RemoteInvocationHandler.java:215)
	at hudson.remoting.UserRequest.perform(UserRequest.java:114)
	at hudson.remoting.UserRequest.perform(UserRequest.java:48)
	at hudson.remoting.Request$2.run(Request.java:270)
	at java.util.concurrent.Executors$RunnableAdapter.call(Executors.java:441)
	at java.util.concurrent.FutureTask$Sync.innerRun(FutureTask.java:303)
	at java.util.concurrent.FutureTask.run(FutureTask.java:138)
	at java.util.concurrent.ThreadPoolExecutor$Worker.runTask(ThreadPoolExecutor.java:886)
	at java.util.concurrent.ThreadPoolExecutor$Worker.run(ThreadPoolExecutor.java:908)
	at java.lang.Thread.run(Thread.java:619)
Caused by: java.io.IOException: Too many open files
	at java.io.UnixFileSystem.createFileExclusively(Native Method)
	at java.io.File.checkAndCreate(File.java:1704)
	at java.io.File.createTempFile(File.java:1792)
	at hudson.util.AtomicFileWriter.<init>(AtomicFileWriter.java:65)
	... 29 more
[INFO] [jar:jar {execution: default-jar}]
[INFO] Building jar: C:\hudson\hudson-slave\workspace\OpenJPA-trunk\trunk\openjpa-jdbc\target\openjpa-jdbc-2.1.0-SNAPSHOT.jar
[INFO] [jar:jar {execution: default-jar}]
[INFO] [jar:test-jar {execution: attach-tests}]
[INFO] Building jar: C:\hudson\hudson-slave\workspace\OpenJPA-trunk\trunk\openjpa-jdbc\target\openjpa-jdbc-2.1.0-SNAPSHOT-tests.jar
[INFO] [ianal:verify-legal-files {execution: default}]
[INFO] Checking legal files in: openjpa-jdbc-2.1.0-SNAPSHOT.jar
[INFO] Checking legal files in: openjpa-jdbc-2.1.0-SNAPSHOT-tests.jar
[INFO] [apache-rat:check {execution: default}]
[INFO] Exclude: **/.*/**
[INFO] Exclude: **/target/**/*
[INFO] [install:install {execution: default-install}]
[INFO] Installing C:\hudson\hudson-slave\workspace\OpenJPA-trunk\trunk\openjpa-jdbc\target\openjpa-jdbc-2.1.0-SNAPSHOT.jar
to C:\Users\hudson\.m2\repository\org\apache\openjpa\openjpa-jdbc\2.1.0-SNAPSHOT\openjpa-jdbc-2.1.0-SNAPSHOT.jar
[INFO] Installing C:\hudson\hudson-slave\workspace\OpenJPA-trunk\trunk\openjpa-jdbc\target\openjpa-jdbc-2.1.0-SNAPSHOT-tests.jar
to C:\Users\hudson\.m2\repository\org\apache\openjpa\openjpa-jdbc\2.1.0-SNAPSHOT\openjpa-jdbc-2.1.0-SNAPSHOT-tests.jar
[HUDSON] Archiving C:\hudson\hudson-slave\workspace\OpenJPA-trunk\trunk\openjpa-jdbc\pom.xml
to /home/hudson/hudson/jobs/OpenJPA-trunk/modules/org.apache.openjpa$openjpa-jdbc/builds/2010-09-04_04-33-46/archive/org.apache.openjpa/openjpa-jdbc/2.1.0-SNAPSHOT/pom.xml
[HUDSON] Archiving C:\hudson\hudson-slave\workspace\OpenJPA-trunk\trunk\openjpa-jdbc\pom.xml
to /home/hudson/hudson/jobs/OpenJPA-trunk/modules/org.apache.openjpa$openjpa-jdbc/builds/2010-09-04_04-33-46/archive/org.apache.openjpa/openjpa-jdbc/2.1.0-SNAPSHOT/pom.xml
[INFO] ------------------------------------------------------------------------
[ERROR] BUILD FAILURE
[INFO] ------------------------------------------------------------------------
[INFO] Failed to copy C:\hudson\hudson-slave\workspace\OpenJPA-trunk\trunk\openjpa-jdbc\pom.xml
to /home/hudson/hudson/jobs/OpenJPA-trunk/modules/org.apache.openjpa$openjpa-jdbc/builds/2010-09-04_04-33-46/archive/org.apache.openjpa/openjpa-jdbc/2.1.0-SNAPSHOT/pom.xml
/home/hudson/hudson/jobs/OpenJPA-trunk/modules/org.apache.openjpa$openjpa-jdbc/builds/2010-09-04_04-33-46/archive/org.apache.openjpa/openjpa-jdbc/2.1.0-SNAPSHOT/pom.xml
(Too many open files)
[INFO] ------------------------------------------------------------------------
[INFO] For more information, run Maven with the -e switch
[INFO] ------------------------------------------------------------------------
[INFO] Total time: 6 minutes 33 seconds
[INFO] Finished at: Sat Sep 04 05:40:23 BST 2010
[INFO] Final Memory: 128M/310M
[INFO] ------------------------------------------------------------------------
channel stopped


Mime
View raw message