openjpa-commits mailing list archives

Site index · List index
Message view « Date » · « Thread »
Top « Date » · « Thread »
From Apache Hudson Server <hud...@hudson.apache.org>
Subject Build failed in Hudson: OpenJPA-trunk » OpenJPA Persistence JDBC #171
Date Thu, 16 Sep 2010 19:40:47 GMT
See <https://hudson.apache.org/hudson/job/OpenJPA-trunk/org.apache.openjpa$openjpa-persistence-jdbc/171/changes>

Changes:

[mikedd] convert long->string in java - database might not support implicit conversion

------------------------------------------
[INFO] ------------------------------------------------------------------------
[INFO] Building OpenJPA Persistence JDBC
[INFO]    task-segment: [clean, install]
[INFO] ------------------------------------------------------------------------
[INFO] [clean:clean {execution: default-clean}]
[INFO] Deleting file set: C:\hudson\hudson-slave\workspace\OpenJPA-trunk\trunk\openjpa-persistence-jdbc\target
(included: [**], excluded: [])
[INFO] [buildnumber:create {execution: default}]
[INFO] [enforcer:enforce {execution: default}]
[INFO] [checkstyle:checkstyle {execution: default}]
[INFO] Starting audit...
Audit done.

[WARNING] Unable to locate Source XRef to link to - DISABLED
[INFO] [remote-resources:process {execution: default}]
[INFO] [resources:resources {execution: default-resources}]
[INFO] Using 'UTF-8' encoding to copy filtered resources.
[INFO] Copying 2 resources
[INFO] Copying 3 resources
[INFO] [compiler:compile {execution: default-compile}]
[INFO] Compiling 65 source files to C:\hudson\hudson-slave\workspace\OpenJPA-trunk\trunk\openjpa-persistence-jdbc\target\classes
[INFO] [resources:testResources {execution: default-testResources}]
[INFO] Using 'UTF-8' encoding to copy filtered resources.
[INFO] Copying 93 resources
[INFO] Copying 3 resources
[INFO] [compiler:testCompile {execution: default-testCompile}]
[INFO] Compiling 2442 source files to C:\hudson\hudson-slave\workspace\OpenJPA-trunk\trunk\openjpa-persistence-jdbc\target\test-classes
[INFO] -------------------------------------------------------------
[ERROR] COMPILATION ERROR : 
[INFO] -------------------------------------------------------------
[ERROR] \hudson\hudson-slave\workspace\OpenJPA-trunk\trunk\openjpa-persistence-jdbc\src\test\java\org\apache\openjpa\persistence\jpql\expressions\TestJPQLScalarExpressions.java:[198,49]
cannot find symbol
symbol  : variable trimsTrailingWhitespace
location: class org.apache.openjpa.jdbc.sql.DBDictionary

[INFO] 1error
[INFO] -------------------------------------------------------------
[HUDSON] Archiving C:\hudson\hudson-slave\workspace\OpenJPA-trunk\trunk\openjpa-persistence-jdbc\pom.xml
to /home/hudson/hudson/jobs/OpenJPA-trunk/modules/org.apache.openjpa$openjpa-persistence-jdbc/builds/2010-09-16_19-34-01/archive/org.apache.openjpa/openjpa-persistence-jdbc/2.1.0-SNAPSHOT/pom.xml
[INFO] ------------------------------------------------------------------------
[ERROR] BUILD FAILURE
[INFO] ------------------------------------------------------------------------
[INFO] Compilation failure
\hudson\hudson-slave\workspace\OpenJPA-trunk\trunk\openjpa-persistence-jdbc\src\test\java\org\apache\openjpa\persistence\jpql\expressions\TestJPQLScalarExpressions.java:[198,49]
cannot find symbol
symbol  : variable trimsTrailingWhitespace
location: class org.apache.openjpa.jdbc.sql.DBDictionary


[INFO] ------------------------------------------------------------------------
[INFO] For more information, run Maven with the -e switch
[INFO] ------------------------------------------------------------------------
[INFO] Total time: 6 minutes 38 seconds
[INFO] Finished at: Thu Sep 16 20:21:40 BST 2010
[INFO] Final Memory: 141M/653M
[INFO] ------------------------------------------------------------------------


Mime
View raw message