openjpa-commits mailing list archives

Site index · List index
Message view « Date » · « Thread »
Top « Date » · « Thread »
From Apache Hudson Server <hud...@hudson.zones.apache.org>
Subject Build failed in Hudson: OpenJPA-trunk #53
Date Tue, 20 Jul 2010 20:21:44 GMT
See <http://hudson.zones.apache.org/hudson/job/OpenJPA-trunk/53/changes>

Changes:

[faywang] OPENJPA-1726: fix intermittent failure in TestTimestampVersion. The next bulkUpdate
timestamp version should be consistently generated as nextVersion method.

------------------------------------------
[...truncated 7608 lines...]
2  test  INFO   [main] openjpa.jdbc.JDBC - Using dictionary class "org.apache.openjpa.jdbc.sql.DerbyDictionary"
(Apache Derby 10.5.3.0 - (802917) ,Apache Derby Embedded JDBC Driver 10.5.3.0 - (802917)).
1  test  INFO   [main] openjpa.Runtime - Starting OpenJPA 2.1.0-SNAPSHOT
2  test  INFO   [main] openjpa.jdbc.JDBC - Using dictionary class "org.apache.openjpa.jdbc.sql.DerbyDictionary"
(Apache Derby 10.5.3.0 - (802917) ,Apache Derby Embedded JDBC Driver 10.5.3.0 - (802917)).
0  test  INFO   [main] openjpa.Runtime - Starting OpenJPA 2.1.0-SNAPSHOT
2  test  INFO   [main] openjpa.jdbc.JDBC - Using dictionary class "org.apache.openjpa.jdbc.sql.DerbyDictionary"
(Apache Derby 10.5.3.0 - (802917) ,Apache Derby Embedded JDBC Driver 10.5.3.0 - (802917)).
0  test  INFO   [main] openjpa.Runtime - Starting OpenJPA 2.1.0-SNAPSHOT
1  test  INFO   [main] openjpa.jdbc.JDBC - Using dictionary class "org.apache.openjpa.jdbc.sql.DerbyDictionary"
(Apache Derby 10.5.3.0 - (802917) ,Apache Derby Embedded JDBC Driver 10.5.3.0 - (802917)).
Tests run: 4, Failures: 0, Errors: 0, Skipped: 0, Time elapsed: 0.195 sec
Running org.apache.openjpa.persistence.fields.TestEnumsInJPQL
0  test  INFO   [main] openjpa.Runtime - Starting OpenJPA 2.1.0-SNAPSHOT
1  test  INFO   [main] openjpa.jdbc.JDBC - Using dictionary class "org.apache.openjpa.jdbc.sql.DerbyDictionary"
(Apache Derby 10.5.3.0 - (802917) ,Apache Derby Embedded JDBC Driver 10.5.3.0 - (802917)).
0  test  INFO   [main] openjpa.Runtime - Starting OpenJPA 2.1.0-SNAPSHOT
1  test  INFO   [main] openjpa.jdbc.JDBC - Using dictionary class "org.apache.openjpa.jdbc.sql.DerbyDictionary"
(Apache Derby 10.5.3.0 - (802917) ,Apache Derby Embedded JDBC Driver 10.5.3.0 - (802917)).
0  test  INFO   [main] openjpa.Runtime - Starting OpenJPA 2.1.0-SNAPSHOT
2  test  INFO   [main] openjpa.jdbc.JDBC - Using dictionary class "org.apache.openjpa.jdbc.sql.DerbyDictionary"
(Apache Derby 10.5.3.0 - (802917) ,Apache Derby Embedded JDBC Driver 10.5.3.0 - (802917)).
0  test  INFO   [main] openjpa.Runtime - Starting OpenJPA 2.1.0-SNAPSHOT
1  test  INFO   [main] openjpa.jdbc.JDBC - Using dictionary class "org.apache.openjpa.jdbc.sql.DerbyDictionary"
(Apache Derby 10.5.3.0 - (802917) ,Apache Derby Embedded JDBC Driver 10.5.3.0 - (802917)).
0  test  INFO   [main] openjpa.Runtime - Starting OpenJPA 2.1.0-SNAPSHOT
1  test  INFO   [main] openjpa.jdbc.JDBC - Using dictionary class "org.apache.openjpa.jdbc.sql.DerbyDictionary"
(Apache Derby 10.5.3.0 - (802917) ,Apache Derby Embedded JDBC Driver 10.5.3.0 - (802917)).
0  test  INFO   [main] openjpa.Runtime - Starting OpenJPA 2.1.0-SNAPSHOT
1  test  INFO   [main] openjpa.jdbc.JDBC - Using dictionary class "org.apache.openjpa.jdbc.sql.DerbyDictionary"
(Apache Derby 10.5.3.0 - (802917) ,Apache Derby Embedded JDBC Driver 10.5.3.0 - (802917)).
0  test  INFO   [main] openjpa.Runtime - Starting OpenJPA 2.1.0-SNAPSHOT
1  test  INFO   [main] openjpa.jdbc.JDBC - Using dictionary class "org.apache.openjpa.jdbc.sql.DerbyDictionary"
(Apache Derby 10.5.3.0 - (802917) ,Apache Derby Embedded JDBC Driver 10.5.3.0 - (802917)).
0  test  INFO   [main] openjpa.Runtime - Starting OpenJPA 2.1.0-SNAPSHOT
1  test  INFO   [main] openjpa.jdbc.JDBC - Using dictionary class "org.apache.openjpa.jdbc.sql.DerbyDictionary"
(Apache Derby 10.5.3.0 - (802917) ,Apache Derby Embedded JDBC Driver 10.5.3.0 - (802917)).
Tests run: 8, Failures: 0, Errors: 0, Skipped: 0, Time elapsed: 0.896 sec
Running org.apache.openjpa.persistence.managedinterface.TestSimpleManagedInterface
0  test  INFO   [main] openjpa.Runtime - Starting OpenJPA 2.1.0-SNAPSHOT
1  test  INFO   [main] openjpa.jdbc.JDBC - Using dictionary class "org.apache.openjpa.jdbc.sql.DerbyDictionary"
(Apache Derby 10.5.3.0 - (802917) ,Apache Derby Embedded JDBC Driver 10.5.3.0 - (802917)).
0  test  INFO   [main] openjpa.Runtime - Starting OpenJPA 2.1.0-SNAPSHOT
1  test  INFO   [main] openjpa.jdbc.JDBC - Using dictionary class "org.apache.openjpa.jdbc.sql.DerbyDictionary"
(Apache Derby 10.5.3.0 - (802917) ,Apache Derby Embedded JDBC Driver 10.5.3.0 - (802917)).
0  test  INFO   [main] openjpa.Runtime - Starting OpenJPA 2.1.0-SNAPSHOT
1  test  INFO   [main] openjpa.jdbc.JDBC - Using dictionary class "org.apache.openjpa.jdbc.sql.DerbyDictionary"
(Apache Derby 10.5.3.0 - (802917) ,Apache Derby Embedded JDBC Driver 10.5.3.0 - (802917)).
0  test  INFO   [main] openjpa.Runtime - Starting OpenJPA 2.1.0-SNAPSHOT
1  test  INFO   [main] openjpa.jdbc.JDBC - Using dictionary class "org.apache.openjpa.jdbc.sql.DerbyDictionary"
(Apache Derby 10.5.3.0 - (802917) ,Apache Derby Embedded JDBC Driver 10.5.3.0 - (802917)).
Tests run: 4, Failures: 0, Errors: 0, Skipped: 0, Time elapsed: 0.302 sec
Running org.apache.openjpa.meta.TestMetaDataInheritanceComparator
1  test  INFO   [main] openjpa.jdbc.JDBC - Using dictionary class "org.apache.openjpa.jdbc.sql.DerbyDictionary"
(Apache Derby 10.5.3.0 - (802917) ,Apache Derby Embedded JDBC Driver 10.5.3.0 - (802917)).
4  test  WARN   [main] openjpa.Runtime - Found no persistent property in "org.apache.openjpa.meta.A"
1  test  INFO   [main] openjpa.Runtime - Starting OpenJPA 2.1.0-SNAPSHOT
2  test  INFO   [main] openjpa.jdbc.JDBC - Using dictionary class "org.apache.openjpa.jdbc.sql.DerbyDictionary"
(Apache Derby 10.5.3.0 - (802917) ,Apache Derby Embedded JDBC Driver 10.5.3.0 - (802917)).
Tests run: 3, Failures: 0, Errors: 0, Skipped: 0, Time elapsed: 0.905 sec
Running org.apache.openjpa.persistence.kernel.TestStateManagerImplData
0  test  INFO   [main] openjpa.Runtime - Starting OpenJPA 2.1.0-SNAPSHOT
1  test  INFO   [main] openjpa.jdbc.JDBC - Using dictionary class "org.apache.openjpa.jdbc.sql.DerbyDictionary"
(Apache Derby 10.5.3.0 - (802917) ,Apache Derby Embedded JDBC Driver 10.5.3.0 - (802917)).
0  test  INFO   [main] openjpa.Runtime - Starting OpenJPA 2.1.0-SNAPSHOT
1  test  INFO   [main] openjpa.jdbc.JDBC - Using dictionary class "org.apache.openjpa.jdbc.sql.DerbyDictionary"
(Apache Derby 10.5.3.0 - (802917) ,Apache Derby Embedded JDBC Driver 10.5.3.0 - (802917)).
Tests run: 2, Failures: 0, Errors: 0, Skipped: 0, Time elapsed: 0.119 sec
Running org.apache.openjpa.persistence.jdbc.maps.m2mmapex8.TestMany2ManyMapEx8
0  test  INFO   [main] openjpa.Runtime - Starting OpenJPA 2.1.0-SNAPSHOT
1  test  INFO   [main] openjpa.jdbc.JDBC - Using dictionary class "org.apache.openjpa.jdbc.sql.DerbyDictionary"
(Apache Derby 10.5.3.0 - (802917) ,Apache Derby Embedded JDBC Driver 10.5.3.0 - (802917)).
8  test  INFO   [main] openjpa.MetaData - Inefficient mapping: You have declared that field
"org.apache.openjpa.persistence.jdbc.maps.m2mmapex8.PhoneNumber.emps" is mapped by collection
"org.apache.openjpa.persistence.jdbc.maps.m2mmapex8.Employee.phones".  The mapping would be
much more efficient if instead you map "org.apache.openjpa.persistence.jdbc.maps.m2mmapex8.PhoneNumber.emps"
and declare that "org.apache.openjpa.persistence.jdbc.maps.m2mmapex8.Employee.phones" is mapped
by it.
468  test  INFO   [main] openjpa.MetaData - Inefficient mapping: You have declared that field
"org.apache.openjpa.persistence.jdbc.maps.m2mmapex8.PhoneNumber.emps" is mapped by collection
"org.apache.openjpa.persistence.jdbc.maps.m2mmapex8.Employee.phones".  The mapping would be
much more efficient if instead you map "org.apache.openjpa.persistence.jdbc.maps.m2mmapex8.PhoneNumber.emps"
and declare that "org.apache.openjpa.persistence.jdbc.maps.m2mmapex8.Employee.phones" is mapped
by it.
0  test  INFO   [main] openjpa.Runtime - Starting OpenJPA 2.1.0-SNAPSHOT
1  test  INFO   [main] openjpa.jdbc.JDBC - Using dictionary class "org.apache.openjpa.jdbc.sql.DerbyDictionary"
(Apache Derby 10.5.3.0 - (802917) ,Apache Derby Embedded JDBC Driver 10.5.3.0 - (802917)).
5  test  INFO   [main] openjpa.MetaData - Inefficient mapping: You have declared that field
"org.apache.openjpa.persistence.jdbc.maps.m2mmapex8.PhoneNumber.emps" is mapped by collection
"org.apache.openjpa.persistence.jdbc.maps.m2mmapex8.Employee.phones".  The mapping would be
much more efficient if instead you map "org.apache.openjpa.persistence.jdbc.maps.m2mmapex8.PhoneNumber.emps"
and declare that "org.apache.openjpa.persistence.jdbc.maps.m2mmapex8.Employee.phones" is mapped
by it.
20  test  INFO   [main] openjpa.MetaData - Inefficient mapping: You have declared that field
"org.apache.openjpa.persistence.jdbc.maps.m2mmapex8.PhoneNumber.emps" is mapped by collection
"org.apache.openjpa.persistence.jdbc.maps.m2mmapex8.Employee.phones".  The mapping would be
much more efficient if instead you map "org.apache.openjpa.persistence.jdbc.maps.m2mmapex8.PhoneNumber.emps"
and declare that "org.apache.openjpa.persistence.jdbc.maps.m2mmapex8.Employee.phones" is mapped
by it.
Tests run: 3, Failures: 0, Errors: 0, Skipped: 0, Time elapsed: 0.582 sec
Running org.apache.openjpa.persistence.query.TestJPAQuerySubclassFunc
0  TestConv  INFO   [main] openjpa.Runtime - Starting OpenJPA 2.1.0-SNAPSHOT
1  TestConv  INFO   [main] openjpa.jdbc.JDBC - Using dictionary class "org.apache.openjpa.jdbc.sql.DerbyDictionary"
(Apache Derby 10.5.3.0 - (802917) ,Apache Derby Embedded JDBC Driver 10.5.3.0 - (802917)).
7  TestConv  WARN   [main] openjpa.MetaData - OpenJPA cannot map field "org.apache.openjpa.persistence.query.common.apps.RuntimeTest1.selfOneMany"
efficiently.  It is of an unsupported type. The field value will be serialized to a BLOB by
default.
472  TestConv  WARN   [main] openjpa.MetaData - OpenJPA cannot map field "org.apache.openjpa.persistence.query.common.apps.RuntimeTest1.selfOneMany"
efficiently.  It is of an unsupported type. The field value will be serialized to a BLOB by
default.
0  TestConv  INFO   [main] openjpa.Runtime - Starting OpenJPA 2.1.0-SNAPSHOT
1  TestConv  INFO   [main] openjpa.jdbc.JDBC - Using dictionary class "org.apache.openjpa.jdbc.sql.DerbyDictionary"
(Apache Derby 10.5.3.0 - (802917) ,Apache Derby Embedded JDBC Driver 10.5.3.0 - (802917)).
6  TestConv  WARN   [main] openjpa.MetaData - OpenJPA cannot map field "org.apache.openjpa.persistence.query.common.apps.RuntimeTest1.selfOneMany"
efficiently.  It is of an unsupported type. The field value will be serialized to a BLOB by
default.
71  TestConv  WARN   [main] openjpa.MetaData - OpenJPA cannot map field "org.apache.openjpa.persistence.query.common.apps.RuntimeTest1.selfOneMany"
efficiently.  It is of an unsupported type. The field value will be serialized to a BLOB by
default.
Tests run: 2, Failures: 0, Errors: 0, Skipped: 0, Time elapsed: 0.653 sec
Running org.apache.openjpa.persistence.property.TestCompatAccessMods
0  test  INFO   [main] openjpa.Runtime - Starting OpenJPA 2.1.0-SNAPSHOT
1  test  INFO   [main] openjpa.jdbc.JDBC - Using dictionary class "org.apache.openjpa.jdbc.sql.DerbyDictionary"
(Apache Derby 10.5.3.0 - (802917) ,Apache Derby Embedded JDBC Driver 10.5.3.0 - (802917)).
Tests run: 1, Failures: 0, Errors: 0, Skipped: 0, Time elapsed: 0.24 sec
Running org.apache.openjpa.persistence.kernel.TestStoreBlob
0  test  INFO   [main] openjpa.Runtime - Starting OpenJPA 2.1.0-SNAPSHOT
1  test  INFO   [main] openjpa.jdbc.JDBC - Using dictionary class "org.apache.openjpa.jdbc.sql.DerbyDictionary"
(Apache Derby 10.5.3.0 - (802917) ,Apache Derby Embedded JDBC Driver 10.5.3.0 - (802917)).
5  test  WARN   [main] openjpa.MetaData - OpenJPA cannot map field "org.apache.openjpa.persistence.kernel.common.apps.BlobTest.blob"
efficiently.  It is of an unsupported type. The field value will be serialized to a BLOB by
default.
308  test  WARN   [main] openjpa.MetaData - OpenJPA cannot map field "org.apache.openjpa.persistence.kernel.common.apps.BlobTest.blob"
efficiently.  It is of an unsupported type. The field value will be serialized to a BLOB by
default.
Tests run: 1, Failures: 0, Errors: 0, Skipped: 0, Time elapsed: 0.347 sec
Running org.apache.openjpa.persistence.util.TestProviderUtil
0  test  INFO   [main] openjpa.Runtime - Starting OpenJPA 2.1.0-SNAPSHOT
1  test  INFO   [main] openjpa.jdbc.JDBC - Using dictionary class "org.apache.openjpa.jdbc.sql.DerbyDictionary"
(Apache Derby 10.5.3.0 - (802917) ,Apache Derby Embedded JDBC Driver 10.5.3.0 - (802917)).
0  test  INFO   [main] openjpa.Runtime - Starting OpenJPA 2.1.0-SNAPSHOT
1  test  INFO   [main] openjpa.jdbc.JDBC - Using dictionary class "org.apache.openjpa.jdbc.sql.DerbyDictionary"
(Apache Derby 10.5.3.0 - (802917) ,Apache Derby Embedded JDBC Driver 10.5.3.0 - (802917)).
0  test  INFO   [main] openjpa.Runtime - Starting OpenJPA 2.1.0-SNAPSHOT
2  test  INFO   [main] openjpa.jdbc.JDBC - Using dictionary class "org.apache.openjpa.jdbc.sql.DerbyDictionary"
(Apache Derby 10.5.3.0 - (802917) ,Apache Derby Embedded JDBC Driver 10.5.3.0 - (802917)).
0  test  INFO   [main] openjpa.Runtime - Starting OpenJPA 2.1.0-SNAPSHOT
1  test  INFO   [main] openjpa.jdbc.JDBC - Using dictionary class "org.apache.openjpa.jdbc.sql.DerbyDictionary"
(Apache Derby 10.5.3.0 - (802917) ,Apache Derby Embedded JDBC Driver 10.5.3.0 - (802917)).
0  test  INFO   [main] openjpa.Runtime - Starting OpenJPA 2.1.0-SNAPSHOT
1  test  INFO   [main] openjpa.jdbc.JDBC - Using dictionary class "org.apache.openjpa.jdbc.sql.DerbyDictionary"
(Apache Derby 10.5.3.0 - (802917) ,Apache Derby Embedded JDBC Driver 10.5.3.0 - (802917)).
1  test  INFO   [main] openjpa.jdbc.JDBC - Using dictionary class "org.apache.openjpa.jdbc.sql.DerbyDictionary"
(Apache Derby 10.5.3.0 - (802917) ,Apache Derby Embedded JDBC Driver 10.5.3.0 - (802917)).
Tests run: 6, Failures: 0, Errors: 0, Skipped: 0, Time elapsed: 0.321 sec
Running org.apache.openjpa.jdbc.kernel.TestForeignKeyCountViolation
0  test  INFO   [main] openjpa.Runtime - Starting OpenJPA 2.1.0-SNAPSHOT
1  test  INFO   [main] openjpa.jdbc.JDBC - Using dictionary class "org.apache.openjpa.jdbc.sql.DerbyDictionary"
(Apache Derby 10.5.3.0 - (802917) ,Apache Derby Embedded JDBC Driver 10.5.3.0 - (802917)).
1  test  INFO   [main] openjpa.Runtime - Starting OpenJPA 2.1.0-SNAPSHOT
2  test  INFO   [main] openjpa.jdbc.JDBC - Using dictionary class "org.apache.openjpa.jdbc.sql.DerbyDictionary"
(Apache Derby 10.5.3.0 - (802917) ,Apache Derby Embedded JDBC Driver 10.5.3.0 - (802917)).
Tests run: 2, Failures: 0, Errors: 0, Skipped: 0, Time elapsed: 0.088 sec
Running org.apache.openjpa.jdbc.kernel.TestCollectionTracking
0  test  INFO   [main] openjpa.Runtime - Starting OpenJPA 2.1.0-SNAPSHOT
2  test  INFO   [main] openjpa.jdbc.JDBC - Using dictionary class "org.apache.openjpa.jdbc.sql.DerbyDictionary"
(Apache Derby 10.5.3.0 - (802917) ,Apache Derby Embedded JDBC Driver 10.5.3.0 - (802917)).
Tests run: 1, Failures: 0, Errors: 0, Skipped: 0, Time elapsed: 0.396 sec
Running org.apache.openjpa.persistence.criteria.TestEdit
JPQL:[select p from Person p where p.name='XYZ']
CQL :[SELECT * FROM Person p WHERE p.name = 'XYZ'
JPQL:[select p from Person p where p.name='XYZ' or p.name='ABC']
CQL :[SELECT * FROM Person p WHERE (p.name = 'XYZ' OR p.name = 'ABC')
JPQL:[select p from Person p where p.name='XYZ']
CQL :[SELECT * FROM Person p WHERE p.name = 'XYZ'
JPQL:[select p from Person p where p.name='XYZ' and p.name='ABC']
CQL :[SELECT * FROM Person p WHERE (p.name = 'XYZ' AND p.name = 'ABC')
JPQL:[select p from Person p where p.name='XYZ' and p.name='ABC']
CQL :[SELECT * FROM Person p WHERE (p.name = 'XYZ' AND p.name = 'ABC')
JPQL:[select p from Person p where p.name='XYZ' and p.name='ABC']
CQL :[SELECT * FROM Person p WHERE (p.name = 'XYZ' AND p.name = 'ABC')
JPQL:[select p from Person p where p.name='XYZ']
CQL :[SELECT * FROM Person p WHERE p.name = 'XYZ'
JPQL:[select p from Person p ORDER BY p.name]
CQL :[SELECT * FROM Person p ORDER BY p.name
JPQL:[select p from Person p ORDER BY p.name]
CQL :[SELECT * FROM Person p ORDER BY p.name
JPQL:[select p from Person p ORDER BY p.name, p.id DESC]
CQL :[SELECT * FROM Person p ORDER BY p.namep.id DESC
JPQL:[select p from Person p]
CQL :[SELECT p FROM Person p
JPQL:[select p from Person p]
CQL :[SELECT p FROM Person p
JPQL:[select p,p.name from Person p]
CQL :[SELECT p, p.name FROM Person p
JPQL:[select p from Person p]
CQL :[SELECT * FROM Person p
JPQL:[select p from Person p where p.name=:p1]
CQL :[SELECT * FROM Person p WHERE p.name = :p1
JPQL:[select p from Person p where p.name=:p1 and p.name=:p2]
CQL :[SELECT * FROM Person p WHERE (p.name = :p1 AND p.name = :p2)
JPQL:[select p from Person p where p.name=:p1 and p.name=:p2]
CQL :[SELECT * FROM Person p WHERE (p.name = :p1 AND p.name = :p2)
JPQL:[select p from Person p where p.name=:p3]
CQL :[SELECT * FROM Person p WHERE p.name = :p3
JPQL:[select p from Person p where p.name=:p1 and p.name=:p2]
CQL :[SELECT * FROM Person p WHERE (p.name = :p1 AND p.name = :p2)
JPQL:[select p from Person p where p.name=:p1]
CQL :[SELECT * FROM Person p WHERE p.name = :p1
Tests run: 13, Failures: 0, Errors: 0, Skipped: 0, Time elapsed: 0.073 sec
Running org.apache.openjpa.persistence.annotations.TestEmbeddedId
1  TestConv  INFO   [main] openjpa.Runtime - Starting OpenJPA 2.1.0-SNAPSHOT
2  TestConv  INFO   [main] openjpa.jdbc.JDBC - Using dictionary class "org.apache.openjpa.jdbc.sql.DerbyDictionary"
(Apache Derby 10.5.3.0 - (802917) ,Apache Derby Embedded JDBC Driver 10.5.3.0 - (802917)).
1  TestConv  INFO   [main] openjpa.Runtime - Starting OpenJPA 2.1.0-SNAPSHOT
2  TestConv  INFO   [main] openjpa.jdbc.JDBC - Using dictionary class "org.apache.openjpa.jdbc.sql.DerbyDictionary"
(Apache Derby 10.5.3.0 - (802917) ,Apache Derby Embedded JDBC Driver 10.5.3.0 - (802917)).
0  TestConv  INFO   [main] openjpa.Runtime - Starting OpenJPA 2.1.0-SNAPSHOT
1  TestConv  INFO   [main] openjpa.jdbc.JDBC - Using dictionary class "org.apache.openjpa.jdbc.sql.DerbyDictionary"
(Apache Derby 10.5.3.0 - (802917) ,Apache Derby Embedded JDBC Driver 10.5.3.0 - (802917)).
0  TestConv  INFO   [main] openjpa.Runtime - Starting OpenJPA 2.1.0-SNAPSHOT
1  TestConv  INFO   [main] openjpa.jdbc.JDBC - Using dictionary class "org.apache.openjpa.jdbc.sql.DerbyDictionary"
(Apache Derby 10.5.3.0 - (802917) ,Apache Derby Embedded JDBC Driver 10.5.3.0 - (802917)).
0  TestConv  INFO   [main] openjpa.Runtime - Starting OpenJPA 2.1.0-SNAPSHOT
2  TestConv  INFO   [main] openjpa.jdbc.JDBC - Using dictionary class "org.apache.openjpa.jdbc.sql.DerbyDictionary"
(Apache Derby 10.5.3.0 - (802917) ,Apache Derby Embedded JDBC Driver 10.5.3.0 - (802917)).
0  TestConv  INFO   [main] openjpa.Runtime - Starting OpenJPA 2.1.0-SNAPSHOT
1  TestConv  INFO   [main] openjpa.jdbc.JDBC - Using dictionary class "org.apache.openjpa.jdbc.sql.DerbyDictionary"
(Apache Derby 10.5.3.0 - (802917) ,Apache Derby Embedded JDBC Driver 10.5.3.0 - (802917)).
Tests run: 6, Failures: 0, Errors: 0, Skipped: 0, Time elapsed: 1.225 sec
Running org.apache.openjpa.persistence.util.TestPersistenceUnitUtil
1  test  INFO   [main] openjpa.Runtime - Starting OpenJPA 2.1.0-SNAPSHOT
2  test  INFO   [main] openjpa.jdbc.JDBC - Using dictionary class "org.apache.openjpa.jdbc.sql.DerbyDictionary"
(Apache Derby 10.5.3.0 - (802917) ,Apache Derby Embedded JDBC Driver 10.5.3.0 - (802917)).
0  test  INFO   [main] openjpa.Runtime - Starting OpenJPA 2.1.0-SNAPSHOT
1  test  INFO   [main] openjpa.jdbc.JDBC - Using dictionary class "org.apache.openjpa.jdbc.sql.DerbyDictionary"
(Apache Derby 10.5.3.0 - (802917) ,Apache Derby Embedded JDBC Driver 10.5.3.0 - (802917)).
0  test  INFO   [main] openjpa.Runtime - Starting OpenJPA 2.1.0-SNAPSHOT
1  test  INFO   [main] openjpa.jdbc.JDBC - Using dictionary class "org.apache.openjpa.jdbc.sql.DerbyDictionary"
(Apache Derby 10.5.3.0 - (802917) ,Apache Derby Embedded JDBC Driver 10.5.3.0 - (802917)).
0  test  INFO   [main] openjpa.Runtime - Starting OpenJPA 2.1.0-SNAPSHOT
2  test  INFO   [main] openjpa.jdbc.JDBC - Using dictionary class "org.apache.openjpa.jdbc.sql.DerbyDictionary"
(Apache Derby 10.5.3.0 - (802917) ,Apache Derby Embedded JDBC Driver 10.5.3.0 - (802917)).
0  test  INFO   [main] openjpa.Runtime - Starting OpenJPA 2.1.0-SNAPSHOT
1  test  INFO   [main] openjpa.jdbc.JDBC - Using dictionary class "org.apache.openjpa.jdbc.sql.DerbyDictionary"
(Apache Derby 10.5.3.0 - (802917) ,Apache Derby Embedded JDBC Driver 10.5.3.0 - (802917)).
6  test  INFO   [main] openjpa.Runtime - Starting OpenJPA 2.1.0-SNAPSHOT
7  test  INFO   [main] openjpa.jdbc.JDBC - Using dictionary class "org.apache.openjpa.jdbc.sql.DerbyDictionary"
(Apache Derby 10.5.3.0 - (802917) ,Apache Derby Embedded JDBC Driver 10.5.3.0 - (802917)).
36  PUtil1  INFO   [main] openjpa.Runtime - Starting OpenJPA 2.1.0-SNAPSHOT
37  PUtil1  INFO   [main] openjpa.jdbc.JDBC - Using dictionary class "org.apache.openjpa.jdbc.sql.DerbyDictionary"
(Apache Derby 10.5.3.0 - (802917) ,Apache Derby Embedded JDBC Driver 10.5.3.0 - (802917)).
49  PUtil2  INFO   [main] openjpa.Runtime - Starting OpenJPA 2.1.0-SNAPSHOT
54  PUtil2  INFO   [main] openjpa.jdbc.JDBC - Using dictionary class "org.apache.openjpa.jdbc.sql.DerbyDictionary"
(Apache Derby 10.5.3.0 - (802917) ,Apache Derby Embedded JDBC Driver 10.5.3.0 - (802917)).
1  test  INFO   [main] openjpa.Runtime - Starting OpenJPA 2.1.0-SNAPSHOT
2  test  INFO   [main] openjpa.jdbc.JDBC - Using dictionary class "org.apache.openjpa.jdbc.sql.DerbyDictionary"
(Apache Derby 10.5.3.0 - (802917) ,Apache Derby Embedded JDBC Driver 10.5.3.0 - (802917)).
0  test  INFO   [main] openjpa.Runtime - Starting OpenJPA 2.1.0-SNAPSHOT
2  test  INFO   [main] openjpa.jdbc.JDBC - Using dictionary class "org.apache.openjpa.jdbc.sql.DerbyDictionary"
(Apache Derby 10.5.3.0 - (802917) ,Apache Derby Embedded JDBC Driver 10.5.3.0 - (802917)).
0  test  INFO   [main] openjpa.Runtime - Starting OpenJPA 2.1.0-SNAPSHOT
1  test  INFO   [main] openjpa.jdbc.JDBC - Using dictionary class "org.apache.openjpa.jdbc.sql.DerbyDictionary"
(Apache Derby 10.5.3.0 - (802917) ,Apache Derby Embedded JDBC Driver 10.5.3.0 - (802917)).
0  test  INFO   [main] openjpa.Runtime - Starting OpenJPA 2.1.0-SNAPSHOT
1  test  INFO   [main] openjpa.jdbc.JDBC - Using dictionary class "org.apache.openjpa.jdbc.sql.DerbyDictionary"
(Apache Derby 10.5.3.0 - (802917) ,Apache Derby Embedded JDBC Driver 10.5.3.0 - (802917)).
Tests run: 10, Failures: 0, Errors: 0, Skipped: 0, Time elapsed: 2.259 sec
Running org.apache.openjpa.persistence.conf.TestSwitchConnection
0  test  INFO   [main] openjpa.Runtime - Starting OpenJPA 2.1.0-SNAPSHOT
4507  test  INFO   [main] openjpa.jdbc.JDBC - Using dictionary class "org.apache.openjpa.jdbc.sql.DerbyDictionary"
(Apache Derby 10.5.3.0 - (802917) ,Apache Derby Embedded JDBC Driver 10.5.3.0 - (802917)).
1  test  INFO   [main] openjpa.Runtime - Starting OpenJPA 2.1.0-SNAPSHOT
4094  test  INFO   [main] openjpa.jdbc.JDBC - Using dictionary class "org.apache.openjpa.jdbc.sql.DerbyDictionary"
(Apache Derby 10.5.3.0 - (802917) ,Apache Derby Embedded JDBC Driver 10.5.3.0 - (802917)).
0  test  INFO   [main] openjpa.Runtime - Starting OpenJPA 2.1.0-SNAPSHOT
1  test  INFO   [main] openjpa.jdbc.JDBC - Using dictionary class "org.apache.openjpa.jdbc.sql.DerbyDictionary"
(Apache Derby 10.5.3.0 - (802917) ,Apache Derby Embedded JDBC Driver 10.5.3.0 - (802917)).
Tests run: 1, Failures: 0, Errors: 0, Skipped: 0, Time elapsed: 9.058 sec
Running org.apache.openjpa.conf.TestQueryProperties
2  qtimeout-no-properties  INFO   [main] openjpa.Runtime - Starting OpenJPA 2.1.0-SNAPSHOT
4  qtimeout-no-properties  INFO   [main] openjpa.jdbc.JDBC - Using dictionary class "org.apache.openjpa.jdbc.sql.DerbyDictionary"
(Apache Derby 10.5.3.0 - (802917) ,Apache Derby Embedded JDBC Driver 10.5.3.0 - (802917)).
5  qtimeout-no-properties  INFO   [main] openjpa.Runtime - Starting OpenJPA 2.1.0-SNAPSHOT
6  qtimeout-no-properties  INFO   [main] openjpa.jdbc.JDBC - Using dictionary class "org.apache.openjpa.jdbc.sql.DerbyDictionary"
(Apache Derby 10.5.3.0 - (802917) ,Apache Derby Embedded JDBC Driver 10.5.3.0 - (802917)).
14  test  INFO   [main] openjpa.jdbc.JDBC - Using dictionary class "org.apache.openjpa.jdbc.sql.DerbyDictionary"
(Apache Derby 10.5.3.0 - (802917) ,Apache Derby Embedded JDBC Driver 10.5.3.0 - (802917)).
3  qtimeout-with-properties  INFO   [main] openjpa.Runtime - Starting OpenJPA 2.1.0-SNAPSHOT
4  qtimeout-with-properties  INFO   [main] openjpa.jdbc.JDBC - Using dictionary class "org.apache.openjpa.jdbc.sql.DerbyDictionary"
(Apache Derby 10.5.3.0 - (802917) ,Apache Derby Embedded JDBC Driver 10.5.3.0 - (802917)).
4  qtimeout-with-properties  INFO   [main] openjpa.Runtime - Starting OpenJPA 2.1.0-SNAPSHOT
5  qtimeout-with-properties  INFO   [main] openjpa.jdbc.JDBC - Using dictionary class "org.apache.openjpa.jdbc.sql.DerbyDictionary"
(Apache Derby 10.5.3.0 - (802917) ,Apache Derby Embedded JDBC Driver 10.5.3.0 - (802917)).
14  test  INFO   [main] openjpa.jdbc.JDBC - Using dictionary class "org.apache.openjpa.jdbc.sql.DerbyDictionary"
(Apache Derby 10.5.3.0 - (802917) ,Apache Derby Embedded JDBC Driver 10.5.3.0 - (802917)).
Tests run: 2, Failures: 0, Errors: 0, Skipped: 0, Time elapsed: 0.044 sec
Running org.apache.openjpa.persistence.kernel.TestSimple
0  test  INFO   [main] openjpa.Runtime - Starting OpenJPA 2.1.0-SNAPSHOT
1  test  INFO   [main] openjpa.jdbc.JDBC - Using dictionary class "org.apache.openjpa.jdbc.sql.DerbyDictionary"
(Apache Derby 10.5.3.0 - (802917) ,Apache Derby Embedded JDBC Driver 10.5.3.0 - (802917)).
Tests run: 1, Failures: 0, Errors: 0, Skipped: 0, Time elapsed: 0.069 sec
Running org.apache.openjpa.persistence.jdbc.maps.spec_10_1_26_ex1.TestSpec10_1_26_Ex1
1  test  INFO   [main] openjpa.Runtime - Starting OpenJPA 2.1.0-SNAPSHOT
2  test  INFO   [main] openjpa.jdbc.JDBC - Using dictionary class "org.apache.openjpa.jdbc.sql.DerbyDictionary"
(Apache Derby 10.5.3.0 - (802917) ,Apache Derby Embedded JDBC Driver 10.5.3.0 - (802917)).
rs size=4
0  test  INFO   [main] openjpa.Runtime - Starting OpenJPA 2.1.0-SNAPSHOT
1  test  INFO   [main] openjpa.jdbc.JDBC - Using dictionary class "org.apache.openjpa.jdbc.sql.DerbyDictionary"
(Apache Derby 10.5.3.0 - (802917) ,Apache Derby Embedded JDBC Driver 10.5.3.0 - (802917)).
Tests run: 3, Failures: 0, Errors: 0, Skipped: 0, Time elapsed: 0.487 sec
Running org.apache.openjpa.persistence.criteria.results.TestMultiselect
java.lang.IllegalArgumentException: You have specified selection term to construct an instance
of "class org.apache.openjpa.persistence.criteria.results.Foo" with argument types "[long]".
But "class org.apache.openjpa.persistence.criteria.results.Foo" has no constructor with such
argument types. 	
java.lang.IllegalArgumentException: You have specified selection term to construct an instance
of "class org.apache.openjpa.persistence.criteria.results.Foo" with argument types "[]". But
"class org.apache.openjpa.persistence.criteria.results.Foo" has no constructor with such argument
types. 	
Tests run: 26, Failures: 0, Errors: 0, Skipped: 0, Time elapsed: 0.067 sec
Running org.apache.openjpa.persistence.annotations.TestJoinedInheritance
0  TestConv  INFO   [main] openjpa.Runtime - Starting OpenJPA 2.1.0-SNAPSHOT
2  TestConv  INFO   [main] openjpa.jdbc.JDBC - Using dictionary class "org.apache.openjpa.jdbc.sql.DerbyDictionary"
(Apache Derby 10.5.3.0 - (802917) ,Apache Derby Embedded JDBC Driver 10.5.3.0 - (802917)).
Tests run: 1, Failures: 0, Errors: 0, Skipped: 0, Time elapsed: 0.51 sec
Running org.apache.openjpa.persistence.jdbc.meta.TestEJBCustomMapping
0  TestConv  INFO   [main] openjpa.Runtime - Starting OpenJPA 2.1.0-SNAPSHOT
2  TestConv  INFO   [main] openjpa.jdbc.JDBC - Using dictionary class "org.apache.openjpa.jdbc.sql.DerbyDictionary"
(Apache Derby 10.5.3.0 - (802917) ,Apache Derby Embedded JDBC Driver 10.5.3.0 - (802917)).
13  TestConv  WARN   [main] openjpa.MetaData - OpenJPA cannot map field "org.apache.openjpa.persistence.jdbc.common.apps.ConstantJoinPC4.manyToMany"
efficiently.  It is of an unsupported type. The field value will be serialized to a BLOB by
default.
0  TestConv  INFO   [main] openjpa.Runtime - Starting OpenJPA 2.1.0-SNAPSHOT
2  TestConv  INFO   [main] openjpa.jdbc.JDBC - Using dictionary class "org.apache.openjpa.jdbc.sql.DerbyDictionary"
(Apache Derby 10.5.3.0 - (802917) ,Apache Derby Embedded JDBC Driver 10.5.3.0 - (802917)).
13  TestConv  WARN   [main] openjpa.MetaData - OpenJPA cannot map field "org.apache.openjpa.persistence.jdbc.common.apps.ConstantJoinPC4.manyToMany"
efficiently.  It is of an unsupported type. The field value will be serialized to a BLOB by
default.
Tests run: 2, Failures: 0, Errors: 0, Skipped: 0, Time elapsed: 0.171 sec
Running org.apache.openjpa.persistence.kernel.TestIncrementalFlushesDeletes
0  test  INFO   [main] openjpa.Runtime - Starting OpenJPA 2.1.0-SNAPSHOT
2  test  INFO   [main] openjpa.jdbc.JDBC - Using dictionary class "org.apache.openjpa.jdbc.sql.DerbyDictionary"
(Apache Derby 10.5.3.0 - (802917) ,Apache Derby Embedded JDBC Driver 10.5.3.0 - (802917)).
0  test  INFO   [main] openjpa.Runtime - Starting OpenJPA 2.1.0-SNAPSHOT
1  test  INFO   [main] openjpa.jdbc.JDBC - Using dictionary class "org.apache.openjpa.jdbc.sql.DerbyDictionary"
(Apache Derby 10.5.3.0 - (802917) ,Apache Derby Embedded JDBC Driver 10.5.3.0 - (802917)).
0  test  INFO   [main] openjpa.Runtime - Starting OpenJPA 2.1.0-SNAPSHOT
1  test  INFO   [main] openjpa.jdbc.JDBC - Using dictionary class "org.apache.openjpa.jdbc.sql.DerbyDictionary"
(Apache Derby 10.5.3.0 - (802917) ,Apache Derby Embedded JDBC Driver 10.5.3.0 - (802917)).
Build timed out. Aborting
FATAL: channel is already closed
hudson.remoting.ChannelClosedException: channel is already closed
	at hudson.remoting.Channel.send(Channel.java:412)
	at hudson.remoting.Request.call(Request.java:105)
	at hudson.remoting.Channel.call(Channel.java:555)
	at hudson.Launcher$RemoteLauncher.kill(Launcher.java:744)
	at hudson.model.AbstractBuild$AbstractRunner.run(AbstractBuild.java:421)
	at hudson.model.Run.run(Run.java:1257)
	at hudson.maven.MavenModuleSetBuild.run(MavenModuleSetBuild.java:306)
	at hudson.model.ResourceController.execute(ResourceController.java:88)
	at hudson.model.Executor.run(Executor.java:127)


Mime
View raw message