oodt-dev mailing list archives

Site index · List index
Message view « Date » · « Thread »
Top « Date » · « Thread »
From Apache Jenkins Server <jenk...@builds.apache.org>
Subject Build failed in Jenkins: oodt-2.0-development #47
Date Tue, 12 Dec 2017 23:05:49 GMT
See <https://builds.apache.org/job/oodt-2.0-development/47/display/redirect>

------------------------------------------
[...truncated 7.71 KB...]
[INFO] Reactor Build Order:
[INFO] 
[INFO] OODT Core
[INFO] Common Utilities
[INFO] CAS Command Line Interface
[INFO] OODT - Configuration Management
[INFO] Process Control System Input Data Package
[INFO] Catalog and Archive Service Generic Multi-valued Metadata Container
[INFO] Catalog and Archive File Management Component
[INFO] Catalog and Archive Resource Management Component
[INFO] Catalog and Archive Workflow Management Component
[INFO] Catalog and Archive Crawling Framework
[INFO] OODT CAS Curator Single Sign On Security Package
[INFO] CAS Curation Web Services
[INFO] Process Control System Core Package
[INFO] OODT Wicket Web Components
[INFO] CAS Curation Interface
[INFO] CAS PGE Adaptor Framework
[INFO] CAS Installer Maven Mojo
[INFO] OODT :: Archetypes :: OpsUI
[INFO] OODT :: Archetypes :: RADiX
[INFO] OODT :: Archetypes
[INFO] CAS File Manager Browser Web App
[INFO] CAS Workflow Manager Monitor Web App
[INFO] CAS Product Server Web Application
[INFO] CAS Workflow REST Services
[INFO] Process Control System Operator Interface Webapp
[INFO] OODT Process Control System JAX-RS service layer
[INFO] Apache OODT
[INFO] 
[INFO] ------------------------------------------------------------------------
[INFO] Building OODT Core 1.9-SNAPSHOT
[INFO] ------------------------------------------------------------------------
[INFO] 
[INFO] --- maven-clean-plugin:2.5:clean (default-clean) @ oodt-core ---
[INFO] Deleting <https://builds.apache.org/job/oodt-2.0-development/ws/core/target>
[INFO] 
[INFO] --- maven-remote-resources-plugin:1.5:process (default) @ oodt-core ---
[INFO] 
[INFO] --- maven-site-plugin:3.4:attach-descriptor (attach-descriptor) @ oodt-core ---
[INFO] 
[INFO] >>> maven-javadoc-plugin:2.10.3:javadoc (attach-javadocs) > generate-sources
@ oodt-core >>>
[INFO] 
[INFO] <<< maven-javadoc-plugin:2.10.3:javadoc (attach-javadocs) < generate-sources
@ oodt-core <<<
[INFO] 
[INFO] 
[INFO] --- maven-javadoc-plugin:2.10.3:javadoc (attach-javadocs) @ oodt-core ---
[INFO] 
[INFO] --- maven-install-plugin:2.5.2:install (default-install) @ oodt-core ---
[INFO] Installing <https://builds.apache.org/job/oodt-2.0-development/ws/core/pom.xml>
to <https://builds.apache.org/job/oodt-2.0-development/ws/.repository/org/apache/oodt/oodt-core/1.9-SNAPSHOT/oodt-core-1.9-SNAPSHOT.pom>
[INFO] Installing <https://builds.apache.org/job/oodt-2.0-development/ws/core/target/oodt-core-1.9-SNAPSHOT-site.xml>
to <https://builds.apache.org/job/oodt-2.0-development/ws/.repository/org/apache/oodt/oodt-core/1.9-SNAPSHOT/oodt-core-1.9-SNAPSHOT-site.xml>
[INFO] 
[INFO] ------------------------------------------------------------------------
[INFO] Building Common Utilities 1.9-SNAPSHOT
[INFO] ------------------------------------------------------------------------
[INFO] 
[INFO] --- maven-clean-plugin:2.5:clean (default-clean) @ oodt-commons ---
[INFO] Deleting <https://builds.apache.org/job/oodt-2.0-development/ws/commons/target>
[INFO] 
[INFO] --- maven-remote-resources-plugin:1.5:process (default) @ oodt-commons ---
[INFO] 
[INFO] --- maven-resources-plugin:2.6:resources (default-resources) @ oodt-commons ---
[INFO] Using 'UTF-8' encoding to copy filtered resources.
[INFO] Copying 1 resource to org/apache/oodt/commons
[INFO] Copying 1 resource to org/apache/oodt/commons/util
[INFO] Copying 3 resources
[INFO] 
[INFO] --- maven-compiler-plugin:3.1:compile (default-compile) @ oodt-commons ---
[INFO] Changes detected - recompiling the module!
[INFO] Compiling 87 source files to <https://builds.apache.org/job/oodt-2.0-development/ws/commons/target/classes>
[WARNING] <https://builds.apache.org/job/oodt-2.0-development/ws/commons/src/main/java/org/apache/oodt/commons/ExecServer.java>:
Some input files use or override a deprecated API.
[WARNING] <https://builds.apache.org/job/oodt-2.0-development/ws/commons/src/main/java/org/apache/oodt/commons/ExecServer.java>:
Recompile with -Xlint:deprecation for details.
[WARNING] <https://builds.apache.org/job/oodt-2.0-development/ws/commons/src/main/java/org/apache/oodt/commons/activity/SQLDatabaseRetrieval.java>:
Some input files use unchecked or unsafe operations.
[WARNING] <https://builds.apache.org/job/oodt-2.0-development/ws/commons/src/main/java/org/apache/oodt/commons/activity/SQLDatabaseRetrieval.java>:
Recompile with -Xlint:unchecked for details.
[INFO] 
[INFO] --- maven-resources-plugin:2.6:testResources (default-testResources) @ oodt-commons
---
[INFO] Using 'UTF-8' encoding to copy filtered resources.
[INFO] Copying 2 resources
[INFO] Copying 3 resources
[INFO] 
[INFO] --- maven-compiler-plugin:3.1:testCompile (default-testCompile) @ oodt-commons ---
[INFO] Changes detected - recompiling the module!
[INFO] Compiling 30 source files to <https://builds.apache.org/job/oodt-2.0-development/ws/commons/target/test-classes>
[WARNING] <https://builds.apache.org/job/oodt-2.0-development/ws/commons/src/test/java/org/apache/oodt/commons/MultiServerTest.java>:
Some input files use or override a deprecated API.
[WARNING] <https://builds.apache.org/job/oodt-2.0-development/ws/commons/src/test/java/org/apache/oodt/commons/MultiServerTest.java>:
Recompile with -Xlint:deprecation for details.
[WARNING] <https://builds.apache.org/job/oodt-2.0-development/ws/commons/src/test/java/org/apache/oodt/commons/object/jndi/TContext.java>:
Some input files use unchecked or unsafe operations.
[WARNING] <https://builds.apache.org/job/oodt-2.0-development/ws/commons/src/test/java/org/apache/oodt/commons/object/jndi/TContext.java>:
Recompile with -Xlint:unchecked for details.
[INFO] 
[INFO] --- maven-surefire-plugin:2.4:test (default-test) @ oodt-commons ---
[INFO] Surefire report directory: <https://builds.apache.org/job/oodt-2.0-development/ws/commons/target/surefire-reports>

-------------------------------------------------------
 T E S T S
-------------------------------------------------------
Running org.apache.oodt.commons.activity.ActivityTest
Tests run: 1, Failures: 0, Errors: 0, Skipped: 0, Time elapsed: 0.055 sec
Running org.apache.oodt.commons.util.EnterpriseEntityResolverTest
Tests run: 4, Failures: 0, Errors: 0, Skipped: 0, Time elapsed: 5.191 sec
Running org.apache.oodt.commons.util.LDAPTest
Tests run: 1, Failures: 0, Errors: 0, Skipped: 0, Time elapsed: 0.033 sec
Running org.apache.oodt.commons.io.NullOutputStreamTest
Tests run: 3, Failures: 0, Errors: 0, Skipped: 0, Time elapsed: 0.023 sec
Running org.apache.oodt.commons.util.CacheMapTest
Tests run: 5, Failures: 0, Errors: 0, Skipped: 0, Time elapsed: 0.027 sec
Running org.apache.oodt.commons.activity.ActivityStoppedTest
Tests run: 1, Failures: 0, Errors: 0, Skipped: 0, Time elapsed: 0.126 sec
Running org.apache.oodt.commons.net.NetTest
Tests run: 2, Failures: 0, Errors: 0, Skipped: 0, Time elapsed: 0.031 sec
Running org.apache.oodt.commons.util.XMLTest
Tests run: 9, Failures: 0, Errors: 0, Skipped: 0, Time elapsed: 0.304 sec
Running org.apache.oodt.commons.io.FixedBufferOutputStreamTest
Tests run: 3, Failures: 0, Errors: 0, Skipped: 0, Time elapsed: 0.024 sec
Running org.apache.oodt.commons.MultiServerTest
Tests run: 1, Failures: 0, Errors: 0, Skipped: 0, Time elapsed: 0.233 sec
Running org.apache.oodt.commons.util.Base64Test
Tests run: 1, Failures: 0, Errors: 0, Skipped: 0, Time elapsed: 0.027 sec
Running org.apache.oodt.commons.AppTest
Tests run: 1, Failures: 0, Errors: 0, Skipped: 0, Time elapsed: 0.025 sec
Running org.apache.oodt.commons.io.NullInputStreamTest
Tests run: 2, Failures: 0, Errors: 0, Skipped: 0, Time elapsed: 0.024 sec
Running org.apache.oodt.commons.exec.TestEnvUtilities
Tests run: 5, Failures: 0, Errors: 0, Skipped: 0, Time elapsed: 0.045 sec
Running org.apache.oodt.commons.filter.TestTimeEventWeightedHash
Tests run: 1, Failures: 0, Errors: 0, Skipped: 0, Time elapsed: 0.031 sec
Running org.apache.oodt.commons.ConfigurationTest
Tests run: 1, Failures: 0, Errors: 0, Skipped: 0, Time elapsed: 5.276 sec
Running org.apache.oodt.commons.activity.HistoryTest
Tests run: 5, Failures: 0, Errors: 0, Skipped: 0, Time elapsed: 3.842 sec
Running org.apache.oodt.commons.activity.IncidentTest
Tests run: 2, Failures: 0, Errors: 0, Skipped: 0, Time elapsed: 0.045 sec
Running org.apache.oodt.commons.io.TestLoggerOutputStream
Tests run: 1, Failures: 0, Errors: 0, Skipped: 0, Time elapsed: 0.036 sec
Running org.apache.oodt.commons.activity.CompositeActivityTest
Tests run: 1, Failures: 0, Errors: 0, Skipped: 0, Time elapsed: 0.057 sec
Running org.apache.oodt.commons.object.jndi.ObjectContextTest
Tests run: 1, Failures: 0, Errors: 0, Skipped: 0, Time elapsed: 5.082 sec
Running org.apache.oodt.commons.activity.DatagramLoggingActivityFactoryTest
Tests run: 2, Failures: 0, Errors: 0, Skipped: 0, Time elapsed: 0.066 sec
Running org.apache.oodt.commons.ConfiguredTestCaseTest
Tests run: 2, Failures: 0, Errors: 0, Skipped: 0, Time elapsed: 0.349 sec
Running org.apache.oodt.commons.util.UtilityTest
Tests run: 1, Failures: 0, Errors: 0, Skipped: 0, Time elapsed: 5.047 sec
Running org.apache.oodt.commons.io.DirectorySelectorTest
Tests run: 5, Failures: 0, Errors: 0, Skipped: 0, Time elapsed: 0.027 sec
Running org.apache.oodt.commons.NaughtyTest
Tests run: 1, Failures: 0, Errors: 0, Skipped: 0, Time elapsed: 0.022 sec
Running org.apache.oodt.commons.object.jndi.TestContextTest
Tests run: 1, Failures: 0, Errors: 0, Skipped: 0, Time elapsed: 0.026 sec
Running org.apache.oodt.commons.activity.ActivityTrackerTest
Tests run: 1, Failures: 0, Errors: 0, Skipped: 0, Time elapsed: 0.057 sec

Results :

Tests run: 64, Failures: 0, Errors: 0, Skipped: 0

[JENKINS] Recording test results
[INFO] 
[INFO] --- maven-jar-plugin:2.5:jar (default-jar) @ oodt-commons ---
[INFO] Building jar: <https://builds.apache.org/job/oodt-2.0-development/ws/commons/target/oodt-commons-1.9-SNAPSHOT.jar>
[INFO] 
[INFO] --- maven-site-plugin:3.4:attach-descriptor (attach-descriptor) @ oodt-commons ---
[INFO] 
[INFO] >>> maven-javadoc-plugin:2.10.3:javadoc (attach-javadocs) > generate-sources
@ oodt-commons >>>
[INFO] 
[INFO] <<< maven-javadoc-plugin:2.10.3:javadoc (attach-javadocs) < generate-sources
@ oodt-commons <<<
[INFO] 
[INFO] 
[INFO] --- maven-javadoc-plugin:2.10.3:javadoc (attach-javadocs) @ oodt-commons ---
[INFO] ------------------------------------------------------------------------
[INFO] Reactor Summary:
[INFO] 
[INFO] OODT Core .......................................... SUCCESS [  5.747 s]
[INFO] Common Utilities ................................... FAILURE [01:46 min]
[INFO] CAS Command Line Interface ......................... SKIPPED
[INFO] OODT - Configuration Management .................... SKIPPED
[INFO] Process Control System Input Data Package .......... SKIPPED
[INFO] Catalog and Archive Service Generic Multi-valued Metadata Container SKIPPED
[INFO] Catalog and Archive File Management Component ...... SKIPPED
[INFO] Catalog and Archive Resource Management Component .. SKIPPED
[INFO] Catalog and Archive Workflow Management Component .. SKIPPED
[INFO] Catalog and Archive Crawling Framework ............. SKIPPED
[INFO] OODT CAS Curator Single Sign On Security Package ... SKIPPED
[INFO] CAS Curation Web Services .......................... SKIPPED
[INFO] Process Control System Core Package ................ SKIPPED
[INFO] OODT Wicket Web Components ......................... SKIPPED
[INFO] CAS Curation Interface ............................. SKIPPED
[INFO] CAS PGE Adaptor Framework .......................... SKIPPED
[INFO] CAS Installer Maven Mojo ........................... SKIPPED
[INFO] OODT :: Archetypes :: OpsUI ........................ SKIPPED
[INFO] OODT :: Archetypes :: RADiX ........................ SKIPPED
[INFO] OODT :: Archetypes ................................. SKIPPED
[INFO] CAS File Manager Browser Web App ................... SKIPPED
[INFO] CAS Workflow Manager Monitor Web App ............... SKIPPED
[INFO] CAS Product Server Web Application ................. SKIPPED
[INFO] CAS Workflow REST Services ......................... SKIPPED
[INFO] Process Control System Operator Interface Webapp ... SKIPPED
[INFO] OODT Process Control System JAX-RS service layer ... SKIPPED
[INFO] Apache OODT ........................................ SKIPPED
[INFO] ------------------------------------------------------------------------
[INFO] BUILD FAILURE
[INFO] ------------------------------------------------------------------------
[INFO] Total time: 02:18 min
[INFO] Finished at: 2017-12-12T23:05:16Z
[INFO] Final Memory: 40M/256M
[INFO] ------------------------------------------------------------------------
[ERROR] Failed to execute goal org.apache.maven.plugins:maven-javadoc-plugin:2.10.3:javadoc
(attach-javadocs) on project oodt-commons: An error has occurred in JavaDocs report generation:
Unable to find javadoc command: The environment variable JAVA_HOME is not correctly set. ->
[Help 1]
[ERROR] 
[ERROR] To see the full stack trace of the errors, re-run Maven with the -e switch.
[ERROR] Re-run Maven using the -X switch to enable full debug logging.
[ERROR] 
[ERROR] For more information about the errors and possible solutions, please read the following
articles:
[ERROR] [Help 1] http://cwiki.apache.org/confluence/display/MAVEN/MojoExecutionException
[ERROR] 
[ERROR] After correcting the problems, you can resume the build with the command
[ERROR]   mvn <goals> -rf :oodt-commons
[JENKINS] Archiving <https://builds.apache.org/job/oodt-2.0-development/ws/config/pom.xml>
to org.apache.oodt/oodt-conf/1.9-SNAPSHOT/oodt-conf-1.9-SNAPSHOT.pom
[JENKINS] Archiving <https://builds.apache.org/job/oodt-2.0-development/ws/pcs/services/pom.xml>
to org.apache.oodt/pcs-services/1.9-SNAPSHOT/pcs-services-1.9-SNAPSHOT.pom
[JENKINS] Archiving <https://builds.apache.org/job/oodt-2.0-development/ws/core/pom.xml>
to org.apache.oodt/oodt-core/1.9-SNAPSHOT/oodt-core-1.9-SNAPSHOT.pom
[JENKINS] Archiving <https://builds.apache.org/job/oodt-2.0-development/ws/core/target/oodt-core-1.9-SNAPSHOT-site.xml>
to org.apache.oodt/oodt-core/1.9-SNAPSHOT/oodt-core-1.9-SNAPSHOT-site.xml
[Fast Archiver] Compressed 34.49 KB of artifacts by 92.8% relative to #46
[JENKINS] Archiving <https://builds.apache.org/job/oodt-2.0-development/ws/workflow/pom.xml>
to org.apache.oodt/cas-workflow/1.9-SNAPSHOT/cas-workflow-1.9-SNAPSHOT.pom
[JENKINS] Archiving <https://builds.apache.org/job/oodt-2.0-development/ws/resource/pom.xml>
to org.apache.oodt/cas-resource/1.9-SNAPSHOT/cas-resource-1.9-SNAPSHOT.pom
[JENKINS] Archiving <https://builds.apache.org/job/oodt-2.0-development/ws/pcs/core/pom.xml>
to org.apache.oodt/pcs-core/1.9-SNAPSHOT/pcs-core-1.9-SNAPSHOT.pom
[JENKINS] Archiving <https://builds.apache.org/job/oodt-2.0-development/ws/mvn/archetypes/opsui/pom.xml>
to org.apache.oodt/opsui-archetype/1.9-SNAPSHOT/opsui-archetype-1.9-SNAPSHOT.pom
[JENKINS] Archiving <https://builds.apache.org/job/oodt-2.0-development/ws/curator/services/pom.xml>
to org.apache.oodt/curator-services/1.9-SNAPSHOT/curator-services-1.9-SNAPSHOT.pom
[JENKINS] Archiving <https://builds.apache.org/job/oodt-2.0-development/ws/webapp/fmprod/pom.xml>
to org.apache.oodt/cas-product/1.9-SNAPSHOT/cas-product-1.9-SNAPSHOT.pom
[JENKINS] Archiving <https://builds.apache.org/job/oodt-2.0-development/ws/pcs/opsui/pom.xml>
to org.apache.oodt/pcs-opsui/1.9-SNAPSHOT/pcs-opsui-1.9-SNAPSHOT.pom
[JENKINS] Archiving <https://builds.apache.org/job/oodt-2.0-development/ws/pom.xml>
to org.apache.oodt/oodt/1.9-SNAPSHOT/oodt-1.9-SNAPSHOT.pom
[JENKINS] Archiving <https://builds.apache.org/job/oodt-2.0-development/ws/webapp/fmbrowser/pom.xml>
to org.apache.oodt/fmbrowser/1.9-SNAPSHOT/fmbrowser-1.9-SNAPSHOT.pom
[JENKINS] Archiving <https://builds.apache.org/job/oodt-2.0-development/ws/cli/pom.xml>
to org.apache.oodt/cas-cli/1.9-SNAPSHOT/cas-cli-1.9-SNAPSHOT.pom
[JENKINS] Archiving <https://builds.apache.org/job/oodt-2.0-development/ws/mvn/archetypes/radix/pom.xml>
to org.apache.oodt/radix-archetype/1.9-SNAPSHOT/radix-archetype-1.9-SNAPSHOT.pom
[JENKINS] Archiving <https://builds.apache.org/job/oodt-2.0-development/ws/webapp/wmonitor/pom.xml>
to org.apache.oodt/wmonitor/1.9-SNAPSHOT/wmonitor-1.9-SNAPSHOT.pom
[JENKINS] Archiving <https://builds.apache.org/job/oodt-2.0-development/ws/commons/pom.xml>
to org.apache.oodt/oodt-commons/1.9-SNAPSHOT/oodt-commons-1.9-SNAPSHOT.pom
[JENKINS] Archiving <https://builds.apache.org/job/oodt-2.0-development/ws/commons/target/oodt-commons-1.9-SNAPSHOT.jar>
to org.apache.oodt/oodt-commons/1.9-SNAPSHOT/oodt-commons-1.9-SNAPSHOT.jar
[JENKINS] Archiving <https://builds.apache.org/job/oodt-2.0-development/ws/mvn/archetypes/pom.xml>
to org.apache.oodt/archetypes/1.9-SNAPSHOT/archetypes-1.9-SNAPSHOT.pom
[JENKINS] Archiving <https://builds.apache.org/job/oodt-2.0-development/ws/curator/webapp/pom.xml>
to org.apache.oodt/cas-curator/1.9-SNAPSHOT/cas-curator-1.9-SNAPSHOT.pom
[JENKINS] Archiving <https://builds.apache.org/job/oodt-2.0-development/ws/crawler/pom.xml>
to org.apache.oodt/cas-crawler/1.9-SNAPSHOT/cas-crawler-1.9-SNAPSHOT.pom
[JENKINS] Archiving <https://builds.apache.org/job/oodt-2.0-development/ws/pge/pom.xml>
to org.apache.oodt/cas-pge/1.9-SNAPSHOT/cas-pge-1.9-SNAPSHOT.pom
[JENKINS] Archiving <https://builds.apache.org/job/oodt-2.0-development/ws/pcs/input/pom.xml>
to org.apache.oodt/pcs-input/1.9-SNAPSHOT/pcs-input-1.9-SNAPSHOT.pom
[JENKINS] Archiving <https://builds.apache.org/job/oodt-2.0-development/ws/mvn/plugins/cas-install/pom.xml>
to org.apache.oodt/maven-cas-install-plugin/1.9-SNAPSHOT/maven-cas-install-plugin-1.9-SNAPSHOT.pom
[JENKINS] Archiving <https://builds.apache.org/job/oodt-2.0-development/ws/metadata/pom.xml>
to org.apache.oodt/cas-metadata/1.9-SNAPSHOT/cas-metadata-1.9-SNAPSHOT.pom
[JENKINS] Archiving <https://builds.apache.org/job/oodt-2.0-development/ws/webapp/components/pom.xml>
to org.apache.oodt/oodt-webapp-components/1.9-SNAPSHOT/oodt-webapp-components-1.9-SNAPSHOT.pom
[JENKINS] Archiving <https://builds.apache.org/job/oodt-2.0-development/ws/webapp/wmservices/pom.xml>
to org.apache.oodt/workflow-services/1.9-SNAPSHOT/workflow-services-1.9-SNAPSHOT.pom
[JENKINS] Archiving <https://builds.apache.org/job/oodt-2.0-development/ws/filemgr/pom.xml>
to org.apache.oodt/cas-filemgr/1.9-SNAPSHOT/cas-filemgr-1.9-SNAPSHOT.pom
[JENKINS] Archiving <https://builds.apache.org/job/oodt-2.0-development/ws/curator/sso/pom.xml>
to org.apache.oodt/curator-sso/1.9-SNAPSHOT/curator-sso-1.9-SNAPSHOT.pom
Sending e-mails to: dev@oodt.apache.org
channel stopped
No JDK named ?JDK 1.8.0_102? found
No JDK named ?JDK 1.8.0_102? found

Mime
View raw message