oodt-dev mailing list archives

Site index · List index
Message view « Date » · « Thread »
Top « Date » · « Thread »
From Apache Jenkins Server <jenk...@builds.apache.org>
Subject Build failed in Jenkins: oodt-2.0-development #42
Date Thu, 12 Oct 2017 17:45:05 GMT
See <https://builds.apache.org/job/oodt-2.0-development/42/display/redirect?page=changes>

Changes:

[imesha.sudasingha] Added configuration change listening feature

[imesha.sudasingha] Improved java docs

[imesha.sudasingha] [OODT-965] Added configuration change listening feature

[imesha.sudasingha] Improved java docs

[imesha.sudasingha] [OODT-963] Fixed surefire test failures in workflow manager due to

[imesha.sudasingha] [OODT-964] Removed empty test/workflow.properties which caused wmgr

------------------------------------------
[...truncated 169.16 KB...]
[INFO] Downloaded: https://repo.maven.apache.org/maven2/org/codehaus/plexus/plexus-compiler-api/2.2/plexus-compiler-api-2.2.jar
(25 kB at 532 kB/s)
[INFO] Downloading: https://repo.maven.apache.org/maven2/org/apache/xbean/xbean-reflect/3.4/xbean-reflect-3.4.jar
[INFO] Downloaded: https://repo.maven.apache.org/maven2/org/apache/maven/shared/maven-shared-utils/0.1/maven-shared-utils-0.1.jar
(155 kB at 3.2 MB/s)
[INFO] Downloading: https://repo.maven.apache.org/maven2/log4j/log4j/1.2.12/log4j-1.2.12.jar
[INFO] Downloaded: https://repo.maven.apache.org/maven2/org/codehaus/plexus/plexus-compiler-javac/2.2/plexus-compiler-javac-2.2.jar
(19 kB at 327 kB/s)
[INFO] Downloading: https://repo.maven.apache.org/maven2/commons-logging/commons-logging-api/1.1/commons-logging-api-1.1.jar
[INFO] Downloaded: https://repo.maven.apache.org/maven2/org/codehaus/plexus/plexus-classworlds/2.2.2/plexus-classworlds-2.2.2.jar
(46 kB at 756 kB/s)
[INFO] Downloading: https://repo.maven.apache.org/maven2/com/google/collections/google-collections/1.0/google-collections-1.0.jar
[INFO] Downloaded: https://repo.maven.apache.org/maven2/org/apache/xbean/xbean-reflect/3.4/xbean-reflect-3.4.jar
(134 kB at 2.2 MB/s)
[INFO] Downloading: https://repo.maven.apache.org/maven2/junit/junit/3.8.2/junit-3.8.2.jar
[INFO] Downloaded: https://repo.maven.apache.org/maven2/org/codehaus/plexus/plexus-container-default/1.5.5/plexus-container-default-1.5.5.jar
(217 kB at 3.4 MB/s)
[INFO] Downloaded: https://repo.maven.apache.org/maven2/log4j/log4j/1.2.12/log4j-1.2.12.jar
(358 kB at 5.2 MB/s)
[INFO] Downloaded: https://repo.maven.apache.org/maven2/commons-logging/commons-logging-api/1.1/commons-logging-api-1.1.jar
(45 kB at 619 kB/s)
[INFO] Downloaded: https://repo.maven.apache.org/maven2/junit/junit/3.8.2/junit-3.8.2.jar
(121 kB at 1.6 MB/s)
[INFO] Downloaded: https://repo.maven.apache.org/maven2/com/google/collections/google-collections/1.0/google-collections-1.0.jar
(640 kB at 7.4 MB/s)
[INFO] Changes detected - recompiling the module!
[INFO] Compiling 87 source files to <https://builds.apache.org/job/oodt-2.0-development/ws/commons/target/classes>
[WARNING] <https://builds.apache.org/job/oodt-2.0-development/ws/commons/src/main/java/org/apache/oodt/commons/ExecServer.java>:
Some input files use or override a deprecated API.
[WARNING] <https://builds.apache.org/job/oodt-2.0-development/ws/commons/src/main/java/org/apache/oodt/commons/ExecServer.java>:
Recompile with -Xlint:deprecation for details.
[WARNING] <https://builds.apache.org/job/oodt-2.0-development/ws/commons/src/main/java/org/apache/oodt/commons/activity/SQLDatabaseRetrieval.java>:
Some input files use unchecked or unsafe operations.
[WARNING] <https://builds.apache.org/job/oodt-2.0-development/ws/commons/src/main/java/org/apache/oodt/commons/activity/SQLDatabaseRetrieval.java>:
Recompile with -Xlint:unchecked for details.
[INFO] 
[INFO] --- maven-resources-plugin:2.6:testResources (default-testResources) @ oodt-commons
---
[INFO] Using 'UTF-8' encoding to copy filtered resources.
[INFO] Copying 2 resources
[INFO] Copying 3 resources
[INFO] 
[INFO] --- maven-compiler-plugin:3.1:testCompile (default-testCompile) @ oodt-commons ---
[INFO] Changes detected - recompiling the module!
[INFO] Compiling 30 source files to <https://builds.apache.org/job/oodt-2.0-development/ws/commons/target/test-classes>
[WARNING] <https://builds.apache.org/job/oodt-2.0-development/ws/commons/src/test/java/org/apache/oodt/commons/ConfigurationTest.java>:
Some input files use or override a deprecated API.
[WARNING] <https://builds.apache.org/job/oodt-2.0-development/ws/commons/src/test/java/org/apache/oodt/commons/ConfigurationTest.java>:
Recompile with -Xlint:deprecation for details.
[WARNING] <https://builds.apache.org/job/oodt-2.0-development/ws/commons/src/test/java/org/apache/oodt/commons/filter/TestTimeEventWeightedHash.java>:
Some input files use unchecked or unsafe operations.
[WARNING] <https://builds.apache.org/job/oodt-2.0-development/ws/commons/src/test/java/org/apache/oodt/commons/filter/TestTimeEventWeightedHash.java>:
Recompile with -Xlint:unchecked for details.
[INFO] 
[INFO] --- maven-surefire-plugin:2.4:test (default-test) @ oodt-commons ---
[INFO] Downloading: https://repo.maven.apache.org/maven2/org/apache/maven/maven-plugin-api/2.0/maven-plugin-api-2.0.pom
[INFO] Downloaded: https://repo.maven.apache.org/maven2/org/apache/maven/maven-plugin-api/2.0/maven-plugin-api-2.0.pom
(601 B at 46 kB/s)
[INFO] Downloading: https://repo.maven.apache.org/maven2/org/apache/maven/maven/2.0/maven-2.0.pom
[INFO] Downloaded: https://repo.maven.apache.org/maven2/org/apache/maven/maven/2.0/maven-2.0.pom
(8.8 kB at 797 kB/s)
[INFO] Downloading: https://repo.maven.apache.org/maven2/org/apache/maven/surefire/surefire-booter/2.4/surefire-booter-2.4.pom
[INFO] Downloaded: https://repo.maven.apache.org/maven2/org/apache/maven/surefire/surefire-booter/2.4/surefire-booter-2.4.pom
(2.0 kB at 169 kB/s)
[INFO] Downloading: https://repo.maven.apache.org/maven2/org/apache/maven/surefire/surefire-api/2.4/surefire-api-2.4.pom
[INFO] Downloaded: https://repo.maven.apache.org/maven2/org/apache/maven/surefire/surefire-api/2.4/surefire-api-2.4.pom
(2.1 kB at 176 kB/s)
[INFO] Downloading: https://repo.maven.apache.org/maven2/org/apache/maven/maven-artifact/2.0/maven-artifact-2.0.pom
[INFO] Downloaded: https://repo.maven.apache.org/maven2/org/apache/maven/maven-artifact/2.0/maven-artifact-2.0.pom
(723 B at 72 kB/s)
[INFO] Downloading: https://repo.maven.apache.org/maven2/org/apache/maven/maven-project/2.0/maven-project-2.0.pom
[INFO] Downloaded: https://repo.maven.apache.org/maven2/org/apache/maven/maven-project/2.0/maven-project-2.0.pom
(1.6 kB at 149 kB/s)
[INFO] Downloading: https://repo.maven.apache.org/maven2/org/apache/maven/maven-profile/2.0/maven-profile-2.0.pom
[INFO] Downloaded: https://repo.maven.apache.org/maven2/org/apache/maven/maven-profile/2.0/maven-profile-2.0.pom
(1.4 kB at 57 kB/s)
[INFO] Downloading: https://repo.maven.apache.org/maven2/org/apache/maven/maven-model/2.0/maven-model-2.0.pom
[INFO] Downloaded: https://repo.maven.apache.org/maven2/org/apache/maven/maven-model/2.0/maven-model-2.0.pom
(2.4 kB at 241 kB/s)
[INFO] Downloading: https://repo.maven.apache.org/maven2/org/codehaus/plexus/plexus-container-default/1.0-alpha-8/plexus-container-default-1.0-alpha-8.pom
[INFO] Downloaded: https://repo.maven.apache.org/maven2/org/codehaus/plexus/plexus-container-default/1.0-alpha-8/plexus-container-default-1.0-alpha-8.pom
(7.3 kB at 726 kB/s)
[INFO] Downloading: https://repo.maven.apache.org/maven2/org/apache/maven/maven-artifact-manager/2.0/maven-artifact-manager-2.0.pom
[INFO] Downloaded: https://repo.maven.apache.org/maven2/org/apache/maven/maven-artifact-manager/2.0/maven-artifact-manager-2.0.pom
(1.3 kB at 135 kB/s)
[INFO] Downloading: https://repo.maven.apache.org/maven2/org/apache/maven/maven-repository-metadata/2.0/maven-repository-metadata-2.0.pom
[INFO] Downloaded: https://repo.maven.apache.org/maven2/org/apache/maven/maven-repository-metadata/2.0/maven-repository-metadata-2.0.pom
(1.2 kB at 123 kB/s)
[INFO] Downloading: https://repo.maven.apache.org/maven2/org/apache/maven/maven-plugin-api/2.0/maven-plugin-api-2.0.jar
[INFO] Downloading: https://repo.maven.apache.org/maven2/org/apache/maven/surefire/surefire-booter/2.4/surefire-booter-2.4.jar
[INFO] Downloading: https://repo.maven.apache.org/maven2/org/apache/maven/surefire/surefire-api/2.4/surefire-api-2.4.jar
[INFO] Downloading: https://repo.maven.apache.org/maven2/org/codehaus/plexus/plexus-utils/1.4.9/plexus-utils-1.4.9.jar
[INFO] Downloading: https://repo.maven.apache.org/maven2/org/apache/maven/maven-artifact/2.0/maven-artifact-2.0.jar
[INFO] Downloaded: https://repo.maven.apache.org/maven2/org/apache/maven/maven-plugin-api/2.0/maven-plugin-api-2.0.jar
(10 kB at 507 kB/s)
[INFO] Downloading: https://repo.maven.apache.org/maven2/org/apache/maven/maven-project/2.0/maven-project-2.0.jar
[INFO] Downloaded: https://repo.maven.apache.org/maven2/org/apache/maven/maven-artifact/2.0/maven-artifact-2.0.jar
(79 kB at 4.4 MB/s)
[INFO] Downloading: https://repo.maven.apache.org/maven2/org/apache/maven/maven-profile/2.0/maven-profile-2.0.jar
[INFO] Downloaded: https://repo.maven.apache.org/maven2/org/apache/maven/surefire/surefire-booter/2.4/surefire-booter-2.4.jar
(261 kB at 9.3 MB/s)
[INFO] Downloading: https://repo.maven.apache.org/maven2/org/apache/maven/maven-model/2.0/maven-model-2.0.jar
[INFO] Downloaded: https://repo.maven.apache.org/maven2/org/codehaus/plexus/plexus-utils/1.4.9/plexus-utils-1.4.9.jar
(204 kB at 7.6 MB/s)
[INFO] Downloading: https://repo.maven.apache.org/maven2/org/apache/maven/maven-artifact-manager/2.0/maven-artifact-manager-2.0.jar
[INFO] Downloaded: https://repo.maven.apache.org/maven2/org/apache/maven/maven-profile/2.0/maven-profile-2.0.jar
(30 kB at 1.0 MB/s)
[INFO] Downloading: https://repo.maven.apache.org/maven2/org/apache/maven/maven-repository-metadata/2.0/maven-repository-metadata-2.0.jar
[INFO] Downloaded: https://repo.maven.apache.org/maven2/org/apache/maven/maven-project/2.0/maven-project-2.0.jar
(105 kB at 3.4 MB/s)
[INFO] Downloading: https://repo.maven.apache.org/maven2/org/codehaus/plexus/plexus-container-default/1.0-alpha-8/plexus-container-default-1.0-alpha-8.jar
[INFO] Downloaded: https://repo.maven.apache.org/maven2/org/apache/maven/maven-model/2.0/maven-model-2.0.jar
(78 kB at 2.1 MB/s)
[INFO] Downloaded: https://repo.maven.apache.org/maven2/org/apache/maven/maven-artifact-manager/2.0/maven-artifact-manager-2.0.jar
(51 kB at 1.3 MB/s)
[INFO] Downloaded: https://repo.maven.apache.org/maven2/org/apache/maven/maven-repository-metadata/2.0/maven-repository-metadata-2.0.jar
(21 kB at 504 kB/s)
[INFO] Downloaded: https://repo.maven.apache.org/maven2/org/apache/maven/surefire/surefire-api/2.4/surefire-api-2.4.jar
(507 kB at 10 MB/s)
[INFO] Downloaded: https://repo.maven.apache.org/maven2/org/codehaus/plexus/plexus-container-default/1.0-alpha-8/plexus-container-default-1.0-alpha-8.jar
(195 kB at 4.1 MB/s)
[INFO] Downloading: https://repo.maven.apache.org/maven2/org/apache/maven/surefire/surefire-junit4/2.4/surefire-junit4-2.4.pom
[INFO] Downloaded: https://repo.maven.apache.org/maven2/org/apache/maven/surefire/surefire-junit4/2.4/surefire-junit4-2.4.pom
(2.0 kB at 123 kB/s)
[INFO] Downloading: https://repo.maven.apache.org/maven2/org/apache/maven/surefire/surefire-providers/2.4/surefire-providers-2.4.pom
[INFO] Downloaded: https://repo.maven.apache.org/maven2/org/apache/maven/surefire/surefire-providers/2.4/surefire-providers-2.4.pom
(1.7 kB at 132 kB/s)
[INFO] Downloading: https://repo.maven.apache.org/maven2/junit/junit/4.0/junit-4.0.pom
[INFO] Downloaded: https://repo.maven.apache.org/maven2/junit/junit/4.0/junit-4.0.pom (210
B at 19 kB/s)
[INFO] Downloading: https://repo.maven.apache.org/maven2/junit/junit/4.0/junit-4.0.jar
[INFO] Downloading: https://repo.maven.apache.org/maven2/org/apache/maven/surefire/surefire-junit4/2.4/surefire-junit4-2.4.jar
[INFO] Downloaded: https://repo.maven.apache.org/maven2/org/apache/maven/surefire/surefire-junit4/2.4/surefire-junit4-2.4.jar
(11 kB at 938 kB/s)
[INFO] Downloaded: https://repo.maven.apache.org/maven2/junit/junit/4.0/junit-4.0.jar (106
kB at 3.2 MB/s)
[INFO] Surefire report directory: <https://builds.apache.org/job/oodt-2.0-development/ws/commons/target/surefire-reports>

-------------------------------------------------------
 T E S T S
-------------------------------------------------------
Running org.apache.oodt.commons.activity.ActivityTest
Tests run: 1, Failures: 0, Errors: 0, Skipped: 0, Time elapsed: 0.06 sec
Running org.apache.oodt.commons.util.EnterpriseEntityResolverTest
Tests run: 4, Failures: 0, Errors: 0, Skipped: 0, Time elapsed: 5.166 sec
Running org.apache.oodt.commons.util.LDAPTest
Tests run: 1, Failures: 0, Errors: 0, Skipped: 0, Time elapsed: 0.025 sec
Running org.apache.oodt.commons.io.NullOutputStreamTest
Tests run: 3, Failures: 0, Errors: 0, Skipped: 0, Time elapsed: 0.024 sec
Running org.apache.oodt.commons.util.CacheMapTest
Tests run: 5, Failures: 0, Errors: 0, Skipped: 0, Time elapsed: 0.026 sec
Running org.apache.oodt.commons.activity.ActivityStoppedTest
Tests run: 1, Failures: 0, Errors: 0, Skipped: 0, Time elapsed: 0.126 sec
Running org.apache.oodt.commons.net.NetTest
Tests run: 2, Failures: 0, Errors: 0, Skipped: 0, Time elapsed: 0.04 sec
Running org.apache.oodt.commons.util.XMLTest
Tests run: 9, Failures: 0, Errors: 0, Skipped: 0, Time elapsed: 0.406 sec
Running org.apache.oodt.commons.io.FixedBufferOutputStreamTest
Tests run: 3, Failures: 0, Errors: 0, Skipped: 0, Time elapsed: 0.026 sec
Running org.apache.oodt.commons.MultiServerTest
Tests run: 1, Failures: 0, Errors: 0, Skipped: 0, Time elapsed: 0.228 sec
Running org.apache.oodt.commons.util.Base64Test
Tests run: 1, Failures: 0, Errors: 0, Skipped: 0, Time elapsed: 0.025 sec
Running org.apache.oodt.commons.AppTest
Tests run: 1, Failures: 0, Errors: 0, Skipped: 0, Time elapsed: 0.025 sec
Running org.apache.oodt.commons.io.NullInputStreamTest
Tests run: 2, Failures: 0, Errors: 0, Skipped: 0, Time elapsed: 0.023 sec
Running org.apache.oodt.commons.exec.TestEnvUtilities
Tests run: 5, Failures: 0, Errors: 0, Skipped: 0, Time elapsed: 0.049 sec
Running org.apache.oodt.commons.filter.TestTimeEventWeightedHash
Tests run: 1, Failures: 0, Errors: 0, Skipped: 0, Time elapsed: 0.03 sec
Running org.apache.oodt.commons.ConfigurationTest
Tests run: 1, Failures: 0, Errors: 0, Skipped: 0, Time elapsed: 5.236 sec
Running org.apache.oodt.commons.activity.HistoryTest
Tests run: 5, Failures: 0, Errors: 0, Skipped: 0, Time elapsed: 3.849 sec
Running org.apache.oodt.commons.io.TestLoggerOutputStream
Tests run: 1, Failures: 0, Errors: 0, Skipped: 0, Time elapsed: 0.04 sec
Running org.apache.oodt.commons.activity.IncidentTest
Tests run: 2, Failures: 0, Errors: 0, Skipped: 0, Time elapsed: 0.049 sec
Running org.apache.oodt.commons.activity.CompositeActivityTest
Tests run: 1, Failures: 0, Errors: 0, Skipped: 0, Time elapsed: 0.071 sec
Running org.apache.oodt.commons.object.jndi.ObjectContextTest
Tests run: 1, Failures: 0, Errors: 0, Skipped: 0, Time elapsed: 5.092 sec
Running org.apache.oodt.commons.activity.DatagramLoggingActivityFactoryTest
Tests run: 2, Failures: 0, Errors: 0, Skipped: 0, Time elapsed: 0.073 sec
Running org.apache.oodt.commons.ConfiguredTestCaseTest
Tests run: 2, Failures: 0, Errors: 0, Skipped: 0, Time elapsed: 0.372 sec
Running org.apache.oodt.commons.io.DirectorySelectorTest
Tests run: 5, Failures: 0, Errors: 0, Skipped: 0, Time elapsed: 0.029 sec
Running org.apache.oodt.commons.util.UtilityTest
Tests run: 1, Failures: 0, Errors: 0, Skipped: 0, Time elapsed: 5.038 sec
Running org.apache.oodt.commons.NaughtyTest
Tests run: 1, Failures: 0, Errors: 0, Skipped: 0, Time elapsed: 0.024 sec
Running org.apache.oodt.commons.object.jndi.TestContextTest
Tests run: 1, Failures: 0, Errors: 0, Skipped: 0, Time elapsed: 0.027 sec
Running org.apache.oodt.commons.activity.ActivityTrackerTest
Tests run: 1, Failures: 0, Errors: 0, Skipped: 0, Time elapsed: 0.053 sec

Results :

Tests run: 64, Failures: 0, Errors: 0, Skipped: 0

[JENKINS] Recording test results
[INFO] 
[INFO] --- maven-jar-plugin:2.5:jar (default-jar) @ oodt-commons ---
[INFO] Building jar: <https://builds.apache.org/job/oodt-2.0-development/ws/commons/target/oodt-commons-1.3-SNAPSHOT.jar>
[INFO] 
[INFO] --- maven-site-plugin:3.4:attach-descriptor (attach-descriptor) @ oodt-commons ---
[INFO] 
[INFO] >>> maven-javadoc-plugin:2.10.3:javadoc (attach-javadocs) > generate-sources
@ oodt-commons >>>
[INFO] 
[INFO] <<< maven-javadoc-plugin:2.10.3:javadoc (attach-javadocs) < generate-sources
@ oodt-commons <<<
[INFO] 
[INFO] 
[INFO] --- maven-javadoc-plugin:2.10.3:javadoc (attach-javadocs) @ oodt-commons ---
[INFO] ------------------------------------------------------------------------
[INFO] Reactor Summary:
[INFO] 
[INFO] OODT Core .......................................... SUCCESS [ 11.443 s]
[INFO] Common Utilities ................................... FAILURE [02:33 min]
[INFO] CAS Command Line Interface ......................... SKIPPED
[INFO] OODT - Configuration Management .................... SKIPPED
[INFO] Process Control System Input Data Package .......... SKIPPED
[INFO] Catalog and Archive Service Generic Multi-valued Metadata Container SKIPPED
[INFO] Catalog and Archive File Management Component ...... SKIPPED
[INFO] Catalog and Archive Resource Management Component .. SKIPPED
[INFO] Catalog and Archive Workflow Management Component .. SKIPPED
[INFO] Catalog and Archive Crawling Framework ............. SKIPPED
[INFO] OODT CAS Curator Single Sign On Security Package ... SKIPPED
[INFO] CAS Curation Web Services .......................... SKIPPED
[INFO] Process Control System Core Package ................ SKIPPED
[INFO] OODT Wicket Web Components ......................... SKIPPED
[INFO] CAS Curation Interface ............................. SKIPPED
[INFO] CAS PGE Adaptor Framework .......................... SKIPPED
[INFO] CAS Installer Maven Mojo ........................... SKIPPED
[INFO] OODT :: Archetypes :: OpsUI ........................ SKIPPED
[INFO] OODT :: Archetypes :: RADiX ........................ SKIPPED
[INFO] OODT :: Archetypes ................................. SKIPPED
[INFO] CAS File Manager Browser Web App ................... SKIPPED
[INFO] CAS Workflow Manager Monitor Web App ............... SKIPPED
[INFO] CAS Product Server Web Application ................. SKIPPED
[INFO] CAS Workflow REST Services ......................... SKIPPED
[INFO] Process Control System Operator Interface Webapp ... SKIPPED
[INFO] OODT Process Control System JAX-RS service layer ... SKIPPED
[INFO] Apache OODT ........................................ SKIPPED
[INFO] ------------------------------------------------------------------------
[INFO] BUILD FAILURE
[INFO] ------------------------------------------------------------------------
[INFO] Total time: 03:43 min
[INFO] Finished at: 2017-10-12T17:42:00Z
[INFO] Final Memory: 41M/256M
[INFO] ------------------------------------------------------------------------
[ERROR] Failed to execute goal org.apache.maven.plugins:maven-javadoc-plugin:2.10.3:javadoc
(attach-javadocs) on project oodt-commons: An error has occurred in JavaDocs report generation:
Unable to find javadoc command: The environment variable JAVA_HOME is not correctly set. ->
[Help 1]
[ERROR] 
[ERROR] To see the full stack trace of the errors, re-run Maven with the -e switch.
[ERROR] Re-run Maven using the -X switch to enable full debug logging.
[ERROR] 
[ERROR] For more information about the errors and possible solutions, please read the following
articles:
[ERROR] [Help 1] http://cwiki.apache.org/confluence/display/MAVEN/MojoExecutionException
[ERROR] 
[ERROR] After correcting the problems, you can resume the build with the command
[ERROR]   mvn <goals> -rf :oodt-commons
[JENKINS] Archiving <https://builds.apache.org/job/oodt-2.0-development/ws/config/pom.xml>
to org.apache.oodt/oodt-conf/1.3-SNAPSHOT/oodt-conf-1.3-SNAPSHOT.pom
[JENKINS] Archiving <https://builds.apache.org/job/oodt-2.0-development/ws/pcs/services/pom.xml>
to org.apache.oodt/pcs-services/1.3-SNAPSHOT/pcs-services-1.3-SNAPSHOT.pom
[JENKINS] Archiving <https://builds.apache.org/job/oodt-2.0-development/ws/core/pom.xml>
to org.apache.oodt/oodt-core/1.3-SNAPSHOT/oodt-core-1.3-SNAPSHOT.pom
[JENKINS] Archiving <https://builds.apache.org/job/oodt-2.0-development/ws/core/target/oodt-core-1.3-SNAPSHOT-site.xml>
to org.apache.oodt/oodt-core/1.3-SNAPSHOT/oodt-core-1.3-SNAPSHOT-site.xml
[JENKINS] Archiving <https://builds.apache.org/job/oodt-2.0-development/ws/workflow/pom.xml>
to org.apache.oodt/cas-workflow/1.3-SNAPSHOT/cas-workflow-1.3-SNAPSHOT.pom
[JENKINS] Archiving <https://builds.apache.org/job/oodt-2.0-development/ws/resource/pom.xml>
to org.apache.oodt/cas-resource/1.3-SNAPSHOT/cas-resource-1.3-SNAPSHOT.pom
[JENKINS] Archiving <https://builds.apache.org/job/oodt-2.0-development/ws/pcs/core/pom.xml>
to org.apache.oodt/pcs-core/1.3-SNAPSHOT/pcs-core-1.3-SNAPSHOT.pom
[JENKINS] Archiving <https://builds.apache.org/job/oodt-2.0-development/ws/mvn/archetypes/opsui/pom.xml>
to org.apache.oodt/opsui-archetype/1.3-SNAPSHOT/opsui-archetype-1.3-SNAPSHOT.pom
[JENKINS] Archiving <https://builds.apache.org/job/oodt-2.0-development/ws/curator/services/pom.xml>
to org.apache.oodt/curator-services/1.3-SNAPSHOT/curator-services-1.3-SNAPSHOT.pom
[JENKINS] Archiving <https://builds.apache.org/job/oodt-2.0-development/ws/webapp/fmprod/pom.xml>
to org.apache.oodt/cas-product/1.3-SNAPSHOT/cas-product-1.3-SNAPSHOT.pom
[JENKINS] Archiving <https://builds.apache.org/job/oodt-2.0-development/ws/pcs/opsui/pom.xml>
to org.apache.oodt/pcs-opsui/1.3-SNAPSHOT/pcs-opsui-1.3-SNAPSHOT.pom
[JENKINS] Archiving <https://builds.apache.org/job/oodt-2.0-development/ws/pom.xml>
to org.apache.oodt/oodt/1.3-SNAPSHOT/oodt-1.3-SNAPSHOT.pom
[JENKINS] Archiving <https://builds.apache.org/job/oodt-2.0-development/ws/webapp/fmbrowser/pom.xml>
to org.apache.oodt/fmbrowser/1.3-SNAPSHOT/fmbrowser-1.3-SNAPSHOT.pom
[JENKINS] Archiving <https://builds.apache.org/job/oodt-2.0-development/ws/cli/pom.xml>
to org.apache.oodt/cas-cli/1.3-SNAPSHOT/cas-cli-1.3-SNAPSHOT.pom
[JENKINS] Archiving <https://builds.apache.org/job/oodt-2.0-development/ws/mvn/archetypes/radix/pom.xml>
to org.apache.oodt/radix-archetype/1.3-SNAPSHOT/radix-archetype-1.3-SNAPSHOT.pom
[JENKINS] Archiving <https://builds.apache.org/job/oodt-2.0-development/ws/webapp/wmonitor/pom.xml>
to org.apache.oodt/wmonitor/1.3-SNAPSHOT/wmonitor-1.3-SNAPSHOT.pom
[JENKINS] Archiving <https://builds.apache.org/job/oodt-2.0-development/ws/commons/pom.xml>
to org.apache.oodt/oodt-commons/1.3-SNAPSHOT/oodt-commons-1.3-SNAPSHOT.pom
[JENKINS] Archiving <https://builds.apache.org/job/oodt-2.0-development/ws/commons/target/oodt-commons-1.3-SNAPSHOT.jar>
to org.apache.oodt/oodt-commons/1.3-SNAPSHOT/oodt-commons-1.3-SNAPSHOT.jar
[JENKINS] Archiving <https://builds.apache.org/job/oodt-2.0-development/ws/mvn/archetypes/pom.xml>
to org.apache.oodt/archetypes/1.3-SNAPSHOT/archetypes-1.3-SNAPSHOT.pom
[JENKINS] Archiving <https://builds.apache.org/job/oodt-2.0-development/ws/curator/webapp/pom.xml>
to org.apache.oodt/cas-curator/1.3-SNAPSHOT/cas-curator-1.3-SNAPSHOT.pom
[JENKINS] Archiving <https://builds.apache.org/job/oodt-2.0-development/ws/crawler/pom.xml>
to org.apache.oodt/cas-crawler/1.3-SNAPSHOT/cas-crawler-1.3-SNAPSHOT.pom
[JENKINS] Archiving <https://builds.apache.org/job/oodt-2.0-development/ws/pge/pom.xml>
to org.apache.oodt/cas-pge/1.3-SNAPSHOT/cas-pge-1.3-SNAPSHOT.pom
[JENKINS] Archiving <https://builds.apache.org/job/oodt-2.0-development/ws/pcs/input/pom.xml>
to org.apache.oodt/pcs-input/1.3-SNAPSHOT/pcs-input-1.3-SNAPSHOT.pom
[JENKINS] Archiving <https://builds.apache.org/job/oodt-2.0-development/ws/mvn/plugins/cas-install/pom.xml>
to org.apache.oodt/maven-cas-install-plugin/1.3-SNAPSHOT/maven-cas-install-plugin-1.3-SNAPSHOT.pom
[JENKINS] Archiving <https://builds.apache.org/job/oodt-2.0-development/ws/metadata/pom.xml>
to org.apache.oodt/cas-metadata/1.3-SNAPSHOT/cas-metadata-1.3-SNAPSHOT.pom
[JENKINS] Archiving <https://builds.apache.org/job/oodt-2.0-development/ws/webapp/components/pom.xml>
to org.apache.oodt/oodt-webapp-components/1.3-SNAPSHOT/oodt-webapp-components-1.3-SNAPSHOT.pom
[JENKINS] Archiving <https://builds.apache.org/job/oodt-2.0-development/ws/webapp/wmservices/pom.xml>
to org.apache.oodt/workflow-services/1.3-SNAPSHOT/workflow-services-1.3-SNAPSHOT.pom
[JENKINS] Archiving <https://builds.apache.org/job/oodt-2.0-development/ws/filemgr/pom.xml>
to org.apache.oodt/cas-filemgr/1.3-SNAPSHOT/cas-filemgr-1.3-SNAPSHOT.pom
[JENKINS] Archiving <https://builds.apache.org/job/oodt-2.0-development/ws/curator/sso/pom.xml>
to org.apache.oodt/curator-sso/1.3-SNAPSHOT/curator-sso-1.3-SNAPSHOT.pom
Sending e-mails to: dev@oodt.apache.org
channel stopped
No JDK named ?JDK 1.8.0_102? found
No JDK named ?JDK 1.8.0_102? found

Mime
View raw message