oodt-dev mailing list archives

Site index · List index
Message view « Date » · « Thread »
Top « Date » · « Thread »
From Apache Jenkins Server <jenk...@builds.apache.org>
Subject Build failed in Jenkins: oodt-2.0-development #36
Date Sat, 02 Sep 2017 15:37:24 GMT
See <https://builds.apache.org/job/oodt-2.0-development/36/display/redirect?page=changes>

Changes:

[mattmann] Remove grid.

------------------------------------------
Started by an SCM change
[EnvInject] - Loading node environment variables.
Building remotely on H22 (couchdbtest ubuntu xenial) in workspace <https://builds.apache.org/job/oodt-2.0-development/ws/>
 > git rev-parse --is-inside-work-tree # timeout=10
Fetching changes from the remote Git repository
 > git config remote.origin.url https://git-wip-us.apache.org/repos/asf/oodt.git # timeout=10
Fetching upstream changes from https://git-wip-us.apache.org/repos/asf/oodt.git
 > git --version # timeout=10
 > git fetch --tags --progress https://git-wip-us.apache.org/repos/asf/oodt.git +refs/heads/*:refs/remotes/origin/*
 > git rev-parse refs/remotes/origin/development^{commit} # timeout=10
 > git rev-parse refs/remotes/origin/origin/development^{commit} # timeout=10
Checking out Revision 758eece9ea648ed784101aa8612286a8d1a17241 (refs/remotes/origin/development)
Commit message: "Remove grid."
 > git config core.sparsecheckout # timeout=10
 > git checkout -f 758eece9ea648ed784101aa8612286a8d1a17241
 > git rev-list 423444cb9147f21f211a45e20a5fb74203d88666 # timeout=10
Injecting SonarQube environment variables using the configuration: ASF Sonar Analysis
Parsing POMs
ERROR: Failed to parse POMs
java.io.IOException: remote file operation failed: <https://builds.apache.org/job/oodt-2.0-development/ws/>
at hudson.remoting.Channel@79e88210:H22: hudson.remoting.ProxyException: hudson.maven.MavenModuleSetBuild$MavenExecutionException:
org.apache.maven.project.ProjectBuildingException: Some problems were encountered while processing
the POMs:
[FATAL] Non-parseable POM <https://builds.apache.org/job/oodt-2.0-development/ws/core/pom.xml>:
unexpected character in markup < (position: START_TAG seen ...<dependency>\n<<...
@252:3)  @ <https://builds.apache.org/job/oodt-2.0-development/ws/core/pom.xml,> line
252, column 3

	at hudson.FilePath.act(FilePath.java:993)
	at hudson.FilePath.act(FilePath.java:975)
	at hudson.maven.MavenModuleSetBuild$MavenModuleSetBuildExecution.parsePoms(MavenModuleSetBuild.java:985)
	at hudson.maven.MavenModuleSetBuild$MavenModuleSetBuildExecution.doRun(MavenModuleSetBuild.java:690)
	at hudson.model.AbstractBuild$AbstractBuildExecution.run(AbstractBuild.java:490)
	at hudson.model.Run.execute(Run.java:1735)
	at hudson.maven.MavenModuleSetBuild.run(MavenModuleSetBuild.java:542)
	at hudson.model.ResourceController.execute(ResourceController.java:97)
	at hudson.model.Executor.run(Executor.java:405)
Caused by: hudson.remoting.ProxyException: hudson.maven.MavenModuleSetBuild$MavenExecutionException:
org.apache.maven.project.ProjectBuildingException: Some problems were encountered while processing
the POMs:
[FATAL] Non-parseable POM <https://builds.apache.org/job/oodt-2.0-development/ws/core/pom.xml>:
unexpected character in markup < (position: START_TAG seen ...<dependency>\n<<...
@252:3)  @ <https://builds.apache.org/job/oodt-2.0-development/ws/core/pom.xml,> line
252, column 3

	at hudson.maven.MavenModuleSetBuild$PomParser.invoke(MavenModuleSetBuild.java:1389)
	at hudson.maven.MavenModuleSetBuild$PomParser.invoke(MavenModuleSetBuild.java:1123)
	at hudson.FilePath$FileCallableWrapper.call(FilePath.java:2739)
	at hudson.remoting.UserRequest.perform(UserRequest.java:153)
	at hudson.remoting.UserRequest.perform(UserRequest.java:50)
	at hudson.remoting.Request$2.run(Request.java:336)
	at hudson.remoting.InterceptingExecutorService$1.call(InterceptingExecutorService.java:68)
	at java.util.concurrent.FutureTask.run(FutureTask.java:266)
	at java.util.concurrent.ThreadPoolExecutor.runWorker(ThreadPoolExecutor.java:1142)
	at java.util.concurrent.ThreadPoolExecutor$Worker.run(ThreadPoolExecutor.java:617)
	at java.lang.Thread.run(Thread.java:748)
	at ......remote call to H22(Native Method)
	at hudson.remoting.Channel.attachCallSiteStackTrace(Channel.java:1545)
	at hudson.remoting.UserResponse.retrieve(UserRequest.java:253)
	at hudson.remoting.Channel.call(Channel.java:830)
	at hudson.FilePath.act(FilePath.java:986)
	... 8 more
Caused by: hudson.remoting.ProxyException: org.apache.maven.project.ProjectBuildingException:
Some problems were encountered while processing the POMs:
[FATAL] Non-parseable POM <https://builds.apache.org/job/oodt-2.0-development/ws/core/pom.xml>:
unexpected character in markup < (position: START_TAG seen ...<dependency>\n<<...
@252:3)  @ <https://builds.apache.org/job/oodt-2.0-development/ws/core/pom.xml,> line
252, column 3

	at org.apache.maven.project.DefaultProjectBuilder.build(DefaultProjectBuilder.java:364)
	at hudson.maven.MavenEmbedder.buildProjects(MavenEmbedder.java:361)
	at hudson.maven.MavenEmbedder.readProjects(MavenEmbedder.java:331)
	at hudson.maven.MavenModuleSetBuild$PomParser.invoke(MavenModuleSetBuild.java:1326)
	at hudson.maven.MavenModuleSetBuild$PomParser.invoke(MavenModuleSetBuild.java:1123)
	at hudson.FilePath$FileCallableWrapper.call(FilePath.java:2739)
	at hudson.remoting.UserRequest.perform(UserRequest.java:153)
	at hudson.remoting.UserRequest.perform(UserRequest.java:50)
	at hudson.remoting.Request$2.run(Request.java:336)
	at hudson.remoting.InterceptingExecutorService$1.call(InterceptingExecutorService.java:68)
	at java.util.concurrent.FutureTask.run(FutureTask.java:266)
	at java.util.concurrent.ThreadPoolExecutor.runWorker(ThreadPoolExecutor.java:1142)
	at java.util.concurrent.ThreadPoolExecutor$Worker.run(ThreadPoolExecutor.java:617)
	at java.lang.Thread.run(Thread.java:748)

Mime
View raw message