oodt-dev mailing list archives

Site index · List index
Message view « Date » · « Thread »
Top « Date » · « Thread »
From Apache Jenkins Server <jenk...@builds.apache.org>
Subject Build failed in Jenkins: oodt-2.0-development #29
Date Thu, 15 Jun 2017 11:40:42 GMT
See <https://builds.apache.org/job/oodt-2.0-development/29/display/redirect>

------------------------------------------
[...truncated 234.15 KB...]
[ERROR] ^
[ERROR] <https://builds.apache.org/job/oodt-2.0-development/ws/commons/src/main/java/org/apache/oodt/commons/database/SqlScript.java>:62:
warning: no @param for scriptFileName
[ERROR] public SqlScript(String scriptFileName, DataSource ds) {
[ERROR] ^
[ERROR] <https://builds.apache.org/job/oodt-2.0-development/ws/commons/src/main/java/org/apache/oodt/commons/database/SqlScript.java>:62:
warning: no @param for ds
[ERROR] public SqlScript(String scriptFileName, DataSource ds) {
[ERROR] ^
[ERROR] <https://builds.apache.org/job/oodt-2.0-development/ws/commons/src/main/java/org/apache/oodt/commons/activity/SQLDatabaseRetrieval.java>:65:
error: unexpected end tag: </p>
[ERROR] </p>
[ERROR] ^
[ERROR] <https://builds.apache.org/job/oodt-2.0-development/ws/commons/src/main/java/org/apache/oodt/commons/activity/SQLDatabaseRetrieval.java>:77:
error: unexpected end tag: </p>
[ERROR] </p>
[ERROR] ^
[ERROR] <https://builds.apache.org/job/oodt-2.0-development/ws/commons/src/main/java/org/apache/oodt/commons/activity/SQLDatabaseStorage.java>:66:
error: unexpected end tag: </p>
[ERROR] * </p>
[ERROR] ^
[ERROR] <https://builds.apache.org/job/oodt-2.0-development/ws/commons/src/main/java/org/apache/oodt/commons/activity/SQLDatabaseStorage.java>:81:
error: unexpected end tag: </p>
[ERROR] * </p>
[ERROR] ^
[ERROR] <https://builds.apache.org/job/oodt-2.0-development/ws/commons/src/main/java/org/apache/oodt/commons/activity/XMLStorage.java>:69:
error: exception not thrown: java.io.IOException
[ERROR] * @throws IOException if an error occurs.
[ERROR] ^
[ERROR] <https://builds.apache.org/job/oodt-2.0-development/ws/commons/src/main/java/org/apache/oodt/commons/xml/DOMUtil.java>:53:
warning: no @throws for org.apache.oodt.commons.exceptions.CommonsException
[ERROR] public static Element getFirstElement(Element element, String name)
[ERROR] ^
[ERROR] <https://builds.apache.org/job/oodt-2.0-development/ws/commons/src/main/java/org/apache/oodt/commons/xml/DOMUtil.java>:69:
error: unknown tag: Tag
[ERROR] * elements inside (i.e. <Tag><Tag2>here is text</Tag2></Tag>)
[ERROR] ^
[ERROR] <https://builds.apache.org/job/oodt-2.0-development/ws/commons/src/main/java/org/apache/oodt/commons/xml/DOMUtil.java>:69:
error: unknown tag: Tag2
[ERROR] * elements inside (i.e. <Tag><Tag2>here is text</Tag2></Tag>)
[ERROR] ^
[ERROR] <https://builds.apache.org/job/oodt-2.0-development/ws/commons/src/main/java/org/apache/oodt/commons/xml/DOMUtil.java>:69:
error: unknown tag: Tag2
[ERROR] * elements inside (i.e. <Tag><Tag2>here is text</Tag2></Tag>)
[ERROR] ^
[ERROR] <https://builds.apache.org/job/oodt-2.0-development/ws/commons/src/main/java/org/apache/oodt/commons/xml/DOMUtil.java>:69:
error: unknown tag: Tag
[ERROR] * elements inside (i.e. <Tag><Tag2>here is text</Tag2></Tag>)
[ERROR] ^
[ERROR] <https://builds.apache.org/job/oodt-2.0-development/ws/commons/src/main/java/org/apache/oodt/commons/xml/DOMUtil.java>:78:
warning: no @throws for org.apache.oodt.commons.exceptions.CommonsException
[ERROR] public static String getSimpleElementText(Element node, String name)
[ERROR] ^
[ERROR] <https://builds.apache.org/job/oodt-2.0-development/ws/commons/src/main/java/org/apache/oodt/commons/xml/DOMUtil.java>:88:
error: unknown tag: Tag
[ERROR] * XML Element (i.e. <Tag>text here</Tag>).
[ERROR] ^
[ERROR] <https://builds.apache.org/job/oodt-2.0-development/ws/commons/src/main/java/org/apache/oodt/commons/xml/DOMUtil.java>:88:
error: unknown tag: Tag
[ERROR] * XML Element (i.e. <Tag>text here</Tag>).
[ERROR] ^
[ERROR] <https://builds.apache.org/job/oodt-2.0-development/ws/commons/src/main/java/org/apache/oodt/commons/util/Base64.java>:213:
warning: no @throws for java.io.IOException
[ERROR] public static void main(String[] argv) throws IOException {
[ERROR] ^
[ERROR] <https://builds.apache.org/job/oodt-2.0-development/ws/commons/src/main/java/org/apache/oodt/commons/util/DOMParser.java>:97:
error: exception not thrown: org.xml.sax.SAXNotRecognizedException
[ERROR] * @exception SAXNotRecognizedException If the requested feature is
[ERROR] ^
[ERROR] <https://builds.apache.org/job/oodt-2.0-development/ws/commons/src/main/java/org/apache/oodt/commons/util/DOMParser.java>:116:
error: exception not thrown: org.xml.sax.SAXNotRecognizedException
[ERROR] * @exception SAXNotRecognizedException If the requested feature is
[ERROR] ^
[ERROR] <https://builds.apache.org/job/oodt-2.0-development/ws/commons/src/main/java/org/apache/oodt/commons/util/DOMParser.java>:119:
warning: no @throws for org.xml.sax.SAXNotSupportedException
[ERROR] public boolean getFeature(String featureId) throws SAXNotSupportedException {
[ERROR] ^
[ERROR] <https://builds.apache.org/job/oodt-2.0-development/ws/commons/src/main/java/org/apache/oodt/commons/util/DOMParser.java>:132:
error: exception not thrown: org.xml.sax.SAXNotRecognizedException
[ERROR] * @exception SAXNotRecognizedException If the requested property is
[ERROR] ^
[ERROR] <https://builds.apache.org/job/oodt-2.0-development/ws/commons/src/main/java/org/apache/oodt/commons/util/DOMParser.java>:151:
error: exception not thrown: org.xml.sax.SAXNotRecognizedException
[ERROR] * @exception SAXNotRecognizedException If the requested property is
[ERROR] ^
[ERROR] <https://builds.apache.org/job/oodt-2.0-development/ws/commons/src/main/java/org/apache/oodt/commons/util/DOMParser.java>:155:
warning: no @throws for org.xml.sax.SAXNotSupportedException
[ERROR] public Object getProperty(String propertyId) throws SAXNotSupportedException {
[ERROR] ^
[ERROR] <https://builds.apache.org/job/oodt-2.0-development/ws/commons/src/main/java/org/apache/oodt/commons/util/DOMParser.java>:163:
warning: no @param for featureId
[ERROR] public boolean isFeatureRecognized(String featureId) {
[ERROR] ^
[ERROR] <https://builds.apache.org/job/oodt-2.0-development/ws/commons/src/main/java/org/apache/oodt/commons/util/DOMParser.java>:163:
warning: no @return
[ERROR] public boolean isFeatureRecognized(String featureId) {
[ERROR] ^
[ERROR] <https://builds.apache.org/job/oodt-2.0-development/ws/commons/src/main/java/org/apache/oodt/commons/util/DOMParser.java>:172:
warning: no @param for propertyId
[ERROR] public boolean isPropertyRecognized(String propertyId) {
[ERROR] ^
[ERROR] <https://builds.apache.org/job/oodt-2.0-development/ws/commons/src/main/java/org/apache/oodt/commons/util/DOMParser.java>:172:
warning: no @return
[ERROR] public boolean isPropertyRecognized(String propertyId) {
[ERROR] ^
[ERROR] <https://builds.apache.org/job/oodt-2.0-development/ws/commons/src/main/java/org/apache/oodt/commons/util/DOMParser.java>:262:
error: exception not thrown: org.xml.sax.SAXException
[ERROR] * @exception SAXException An exception thrown if the parser does not
[ERROR] ^
[ERROR] <https://builds.apache.org/job/oodt-2.0-development/ws/commons/src/main/java/org/apache/oodt/commons/io/WriterLogger.java>:121:
error: block element not allowed within inline element <code>: p
[ERROR] * <p>where <var>epochTime</var> is the time in milliseconds since
midnight, 1st
[ERROR] ^
[ERROR] <https://builds.apache.org/job/oodt-2.0-development/ws/commons/src/main/java/org/apache/oodt/commons/io/WriterLogger.java>:126:
error: tag not allowed here: <p>
[ERROR] * <p>You can override this method and provide your own formatting.
[ERROR] ^
[ERROR] <https://builds.apache.org/job/oodt-2.0-development/ws/commons/src/main/java/org/apache/oodt/commons/io/WriterLogger.java>:118:
error: element not closed: code
[ERROR] * <p><code><var>epochTime</var> (<var>time</var>)
<var>source</var> <var>category</var>:
[ERROR] ^
[ERROR] <https://builds.apache.org/job/oodt-2.0-development/ws/commons/src/main/java/org/apache/oodt/commons/io/WriterLogger.java>:133:
warning: no @return
[ERROR] protected String formatMessage(java.util.Date timestamp, String source, Object category,
String message) {
[ERROR] ^
[ERROR] <https://builds.apache.org/job/oodt-2.0-development/ws/commons/src/main/java/org/apache/oodt/commons/util/JDBC_DB.java>:86:
warning: no @throws for java.sql.SQLException
[ERROR] public void openConnection() throws SQLException
[ERROR] ^
[ERROR] <https://builds.apache.org/job/oodt-2.0-development/ws/commons/src/main/java/org/apache/oodt/commons/util/JDBC_DB.java>:202:
warning: no @param for cmd
[ERROR] public void executeSQLCommand(String cmd) throws SQLException
[ERROR] ^
[ERROR] <https://builds.apache.org/job/oodt-2.0-development/ws/commons/src/main/java/org/apache/oodt/commons/util/JDBC_DB.java>:202:
warning: no @throws for java.sql.SQLException
[ERROR] public void executeSQLCommand(String cmd) throws SQLException
[ERROR] ^
[ERROR] <https://builds.apache.org/job/oodt-2.0-development/ws/commons/src/main/java/org/apache/oodt/commons/util/JDBC_DB.java>:249:
warning: no @param for cmd
[ERROR] public ResultSet executeQuery(String cmd) throws SQLException
[ERROR] ^
[ERROR] <https://builds.apache.org/job/oodt-2.0-development/ws/commons/src/main/java/org/apache/oodt/commons/util/JDBC_DB.java>:249:
warning: no @return
[ERROR] public ResultSet executeQuery(String cmd) throws SQLException
[ERROR] ^
[ERROR] <https://builds.apache.org/job/oodt-2.0-development/ws/commons/src/main/java/org/apache/oodt/commons/util/JDBC_DB.java>:249:
warning: no @throws for java.sql.SQLException
[ERROR] public ResultSet executeQuery(String cmd) throws SQLException
[ERROR] ^
[ERROR] <https://builds.apache.org/job/oodt-2.0-development/ws/commons/src/main/java/org/apache/oodt/commons/util/JDBC_DB.java>:301:
warning: no @param for cmd
[ERROR] public int getCount(String cmd) throws SQLException
[ERROR] ^
[ERROR] <https://builds.apache.org/job/oodt-2.0-development/ws/commons/src/main/java/org/apache/oodt/commons/util/JDBC_DB.java>:301:
warning: no @return
[ERROR] public int getCount(String cmd) throws SQLException
[ERROR] ^
[ERROR] <https://builds.apache.org/job/oodt-2.0-development/ws/commons/src/main/java/org/apache/oodt/commons/util/JDBC_DB.java>:301:
warning: no @throws for java.sql.SQLException
[ERROR] public int getCount(String cmd) throws SQLException
[ERROR] ^
[ERROR] <https://builds.apache.org/job/oodt-2.0-development/ws/commons/src/main/java/org/apache/oodt/commons/util/JDBC_DB.java>:341:
warning: no @throws for java.sql.SQLException
[ERROR] public void commit() throws SQLException
[ERROR] ^
[ERROR] <https://builds.apache.org/job/oodt-2.0-development/ws/commons/src/main/java/org/apache/oodt/commons/util/JDBC_DB.java>:403:
warning: no @param for inDate
[ERROR] public String toDateStr(java.util.Date inDate)
[ERROR] ^
[ERROR] <https://builds.apache.org/job/oodt-2.0-development/ws/commons/src/main/java/org/apache/oodt/commons/util/JDBC_DB.java>:403:
warning: no @return
[ERROR] public String toDateStr(java.util.Date inDate)
[ERROR] ^
[ERROR] <https://builds.apache.org/job/oodt-2.0-development/ws/commons/src/main/java/org/apache/oodt/commons/util/JDBC_DB.java>:57:
warning: no @param for sys_props
[ERROR] public  JDBC_DB(
[ERROR] ^
[ERROR] <https://builds.apache.org/job/oodt-2.0-development/ws/commons/src/main/java/org/apache/oodt/commons/util/LDAP.java>:31:
warning: no @param for str
[ERROR] public static String toLDAPString(String str) {
[ERROR] ^
[ERROR] <https://builds.apache.org/job/oodt-2.0-development/ws/commons/src/main/java/org/apache/oodt/commons/util/LogInit.java>:56:
error: exception not thrown: java.lang.Exception
[ERROR] @throws Exception If the logging capability cannot be initialized.
[ERROR] ^
[ERROR] <https://builds.apache.org/job/oodt-2.0-development/ws/commons/src/main/java/org/apache/oodt/commons/util/LogInit.java>:58:
warning: no @throws for java.lang.ClassNotFoundException
[ERROR] public static void init(Properties props, String source)
[ERROR] ^
[ERROR] <https://builds.apache.org/job/oodt-2.0-development/ws/commons/src/main/java/org/apache/oodt/commons/util/LogInit.java>:58:
warning: no @throws for java.lang.IllegalAccessException
[ERROR] public static void init(Properties props, String source)
[ERROR] ^
[ERROR] <https://builds.apache.org/job/oodt-2.0-development/ws/commons/src/main/java/org/apache/oodt/commons/util/LogInit.java>:58:
warning: no @throws for java.lang.InstantiationException
[ERROR] public static void init(Properties props, String source)
[ERROR] ^
[ERROR] <https://builds.apache.org/job/oodt-2.0-development/ws/commons/src/main/java/org/apache/oodt/commons/util/SAXParser.java>:69:
error: exception not thrown: org.xml.sax.SAXNotRecognizedException
[ERROR] * @exception SAXNotRecognizedException If the requested feature is
[ERROR] ^
[ERROR] <https://builds.apache.org/job/oodt-2.0-development/ws/commons/src/main/java/org/apache/oodt/commons/util/SAXParser.java>:88:
error: exception not thrown: org.xml.sax.SAXNotRecognizedException
[ERROR] * @exception SAXNotRecognizedException If the requested feature is
[ERROR] ^
[ERROR] <https://builds.apache.org/job/oodt-2.0-development/ws/commons/src/main/java/org/apache/oodt/commons/util/SAXParser.java>:91:
warning: no @throws for org.xml.sax.SAXNotSupportedException
[ERROR] public boolean getFeature(String featureId) throws SAXNotSupportedException {
[ERROR] ^
[ERROR] <https://builds.apache.org/job/oodt-2.0-development/ws/commons/src/main/java/org/apache/oodt/commons/util/SAXParser.java>:104:
error: exception not thrown: org.xml.sax.SAXNotRecognizedException
[ERROR] * @exception SAXNotRecognizedException If the requested property is
[ERROR] ^
[ERROR] <https://builds.apache.org/job/oodt-2.0-development/ws/commons/src/main/java/org/apache/oodt/commons/util/SAXParser.java>:123:
error: exception not thrown: org.xml.sax.SAXNotRecognizedException
[ERROR] * @exception SAXNotRecognizedException If the requested property is
[ERROR] ^
[ERROR] <https://builds.apache.org/job/oodt-2.0-development/ws/commons/src/main/java/org/apache/oodt/commons/util/SAXParser.java>:127:
warning: no @throws for org.xml.sax.SAXNotSupportedException
[ERROR] public Object getProperty(String propertyId) throws SAXNotSupportedException {
[ERROR] ^
[ERROR] <https://builds.apache.org/job/oodt-2.0-development/ws/commons/src/main/java/org/apache/oodt/commons/util/SAXParser.java>:135:
warning: no @param for featureId
[ERROR] public boolean isFeatureRecognized(String featureId) {
[ERROR] ^
[ERROR] <https://builds.apache.org/job/oodt-2.0-development/ws/commons/src/main/java/org/apache/oodt/commons/util/SAXParser.java>:135:
warning: no @return
[ERROR] public boolean isFeatureRecognized(String featureId) {
[ERROR] ^
[ERROR] <https://builds.apache.org/job/oodt-2.0-development/ws/commons/src/main/java/org/apache/oodt/commons/util/SAXParser.java>:144:
warning: no @param for propertyId
[ERROR] public boolean isPropertyRecognized(String propertyId) {
[ERROR] ^
[ERROR] <https://builds.apache.org/job/oodt-2.0-development/ws/commons/src/main/java/org/apache/oodt/commons/util/SAXParser.java>:144:
warning: no @return
[ERROR] public boolean isPropertyRecognized(String propertyId) {
[ERROR] ^
[ERROR] <https://builds.apache.org/job/oodt-2.0-development/ws/commons/src/main/java/org/apache/oodt/commons/util/SAXParser.java>:238:
error: exception not thrown: org.xml.sax.SAXException
[ERROR] * @exception SAXException An exception thrown if the parser does not
[ERROR] ^
[ERROR] <https://builds.apache.org/job/oodt-2.0-development/ws/commons/src/main/java/org/apache/oodt/commons/util/XML.java>:235:
error: exception not thrown: java.io.IOException
[ERROR] * @throws IOException If an I/O error occurs.
[ERROR] ^
[ERROR] <https://builds.apache.org/job/oodt-2.0-development/ws/commons/src/main/java/org/apache/oodt/commons/util/XML.java>:276:
error: exception not thrown: java.io.IOException
[ERROR] * @throws IOException If an I/O error occurs.
[ERROR] ^
[ERROR] <https://builds.apache.org/job/oodt-2.0-development/ws/commons/src/main/java/org/apache/oodt/commons/exec/EnvUtilities.java>:88:
error: reference not found
[ERROR] * @return A {@link Properites} object containing the user's current
[ERROR] ^
[ERROR] 
[ERROR] Command line was: /usr/local/asfpackages/java/jdk1.8.0_102/jre/../bin/javadoc @options
@packages
[ERROR] 
[ERROR] Refer to the generated Javadoc files in '<https://builds.apache.org/job/oodt-2.0-development/ws/commons/target/site/apidocs'>
dir.
[ERROR] -> [Help 1]
[ERROR] 
[ERROR] To see the full stack trace of the errors, re-run Maven with the -e switch.
[ERROR] Re-run Maven using the -X switch to enable full debug logging.
[ERROR] 
[ERROR] For more information about the errors and possible solutions, please read the following
articles:
[ERROR] [Help 1] http://cwiki.apache.org/confluence/display/MAVEN/MojoExecutionException
[ERROR] 
[ERROR] After correcting the problems, you can resume the build with the command
[ERROR]   mvn <goals> -rf :oodt-commons
[JENKINS] Archiving <https://builds.apache.org/job/oodt-2.0-development/ws/pcs/services/pom.xml>
to org.apache.oodt/pcs-services/1.1-SNAPSHOT/pcs-services-1.1-SNAPSHOT.pom
[JENKINS] Archiving <https://builds.apache.org/job/oodt-2.0-development/ws/product/pom.xml>
to org.apache.oodt/oodt-product/1.1-SNAPSHOT/oodt-product-1.1-SNAPSHOT.pom
[JENKINS] Archiving <https://builds.apache.org/job/oodt-2.0-development/ws/xmlquery/pom.xml>
to org.apache.oodt/oodt-xmlquery/1.1-SNAPSHOT/oodt-xmlquery-1.1-SNAPSHOT.pom
[JENKINS] Archiving <https://builds.apache.org/job/oodt-2.0-development/ws/app/weditor/pom.xml>
to org.apache.oodt/weditor/1.1-SNAPSHOT/weditor-1.1-SNAPSHOT.pom
[JENKINS] Archiving <https://builds.apache.org/job/oodt-2.0-development/ws/core/pom.xml>
to org.apache.oodt/oodt-core/1.1-SNAPSHOT/oodt-core-1.1-SNAPSHOT.pom
[JENKINS] Archiving <https://builds.apache.org/job/oodt-2.0-development/ws/core/target/oodt-core-1.1-SNAPSHOT-site.xml>
to org.apache.oodt/oodt-core/1.1-SNAPSHOT/oodt-core-1.1-SNAPSHOT-site.xml
Compressed 32.68 KB of artifacts by 97.9% relative to #28
[JENKINS] Archiving <https://builds.apache.org/job/oodt-2.0-development/ws/workflow/pom.xml>
to org.apache.oodt/cas-workflow/1.1-SNAPSHOT/cas-workflow-1.1-SNAPSHOT.pom
[JENKINS] Archiving <https://builds.apache.org/job/oodt-2.0-development/ws/resource/pom.xml>
to org.apache.oodt/cas-resource/1.1-SNAPSHOT/cas-resource-1.1-SNAPSHOT.pom
[JENKINS] Archiving <https://builds.apache.org/job/oodt-2.0-development/ws/profile/pom.xml>
to org.apache.oodt/oodt-profile/1.1-SNAPSHOT/oodt-profile-1.1-SNAPSHOT.pom
[JENKINS] Archiving <https://builds.apache.org/job/oodt-2.0-development/ws/protocol/sftp/pom.xml>
to org.apache.oodt/cas-protocol-sftp/1.1-SNAPSHOT/cas-protocol-sftp-1.1-SNAPSHOT.pom
[JENKINS] Archiving <https://builds.apache.org/job/oodt-2.0-development/ws/pcs/core/pom.xml>
to org.apache.oodt/pcs-core/1.1-SNAPSHOT/pcs-core-1.1-SNAPSHOT.pom
[JENKINS] Archiving <https://builds.apache.org/job/oodt-2.0-development/ws/protocol/api/pom.xml>
to org.apache.oodt/cas-protocol-api/1.1-SNAPSHOT/cas-protocol-api-1.1-SNAPSHOT.pom
[JENKINS] Archiving <https://builds.apache.org/job/oodt-2.0-development/ws/mvn/archetypes/opsui/pom.xml>
to org.apache.oodt/opsui-archetype/1.1-SNAPSHOT/opsui-archetype-1.1-SNAPSHOT.pom
[JENKINS] Archiving <https://builds.apache.org/job/oodt-2.0-development/ws/curator/services/pom.xml>
to org.apache.oodt/curator-services/1.1-SNAPSHOT/curator-services-1.1-SNAPSHOT.pom
[JENKINS] Archiving <https://builds.apache.org/job/oodt-2.0-development/ws/webapp/fmprod/pom.xml>
to org.apache.oodt/cas-product/1.1-SNAPSHOT/cas-product-1.1-SNAPSHOT.pom
[JENKINS] Archiving <https://builds.apache.org/job/oodt-2.0-development/ws/pushpull/pom.xml>
to org.apache.oodt/cas-pushpull/1.1-SNAPSHOT/cas-pushpull-1.1-SNAPSHOT.pom
[JENKINS] Archiving <https://builds.apache.org/job/oodt-2.0-development/ws/pcs/opsui/pom.xml>
to org.apache.oodt/pcs-opsui/1.1-SNAPSHOT/pcs-opsui-1.1-SNAPSHOT.pom
[JENKINS] Archiving <https://builds.apache.org/job/oodt-2.0-development/ws/pom.xml>
to org.apache.oodt/oodt/1.1-SNAPSHOT/oodt-1.1-SNAPSHOT.pom
[JENKINS] Archiving <https://builds.apache.org/job/oodt-2.0-development/ws/webapp/fmbrowser/pom.xml>
to org.apache.oodt/fmbrowser/1.1-SNAPSHOT/fmbrowser-1.1-SNAPSHOT.pom
[JENKINS] Archiving <https://builds.apache.org/job/oodt-2.0-development/ws/cli/pom.xml>
to org.apache.oodt/cas-cli/1.1-SNAPSHOT/cas-cli-1.1-SNAPSHOT.pom
[JENKINS] Archiving <https://builds.apache.org/job/oodt-2.0-development/ws/mvn/archetypes/radix/pom.xml>
to org.apache.oodt/radix-archetype/1.1-SNAPSHOT/radix-archetype-1.1-SNAPSHOT.pom
[JENKINS] Archiving <https://builds.apache.org/job/oodt-2.0-development/ws/protocol/ftp/pom.xml>
to org.apache.oodt/cas-protocol-ftp/1.1-SNAPSHOT/cas-protocol-ftp-1.1-SNAPSHOT.pom
[JENKINS] Archiving <https://builds.apache.org/job/oodt-2.0-development/ws/xmlps/pom.xml>
to org.apache.oodt/oodt-xmlps/1.1-SNAPSHOT/oodt-xmlps-1.1-SNAPSHOT.pom
[JENKINS] Archiving <https://builds.apache.org/job/oodt-2.0-development/ws/catalog/pom.xml>
to org.apache.oodt/cas-catalog/1.1-SNAPSHOT/cas-catalog-1.1-SNAPSHOT.pom
[JENKINS] Archiving <https://builds.apache.org/job/oodt-2.0-development/ws/webapp/wmonitor/pom.xml>
to org.apache.oodt/wmonitor/1.1-SNAPSHOT/wmonitor-1.1-SNAPSHOT.pom
[JENKINS] Archiving <https://builds.apache.org/job/oodt-2.0-development/ws/commons/pom.xml>
to org.apache.oodt/oodt-commons/1.1-SNAPSHOT/oodt-commons-1.1-SNAPSHOT.pom
[JENKINS] Archiving <https://builds.apache.org/job/oodt-2.0-development/ws/commons/target/oodt-commons-1.1-SNAPSHOT.jar>
to org.apache.oodt/oodt-commons/1.1-SNAPSHOT/oodt-commons-1.1-SNAPSHOT.jar
[JENKINS] Archiving <https://builds.apache.org/job/oodt-2.0-development/ws/mvn/archetypes/pom.xml>
to org.apache.oodt/archetypes/1.1-SNAPSHOT/archetypes-1.1-SNAPSHOT.pom
[JENKINS] Archiving <https://builds.apache.org/job/oodt-2.0-development/ws/curator/webapp/pom.xml>
to org.apache.oodt/cas-curator/1.1-SNAPSHOT/cas-curator-1.1-SNAPSHOT.pom
[JENKINS] Archiving <https://builds.apache.org/job/oodt-2.0-development/ws/opendapps/pom.xml>
to org.apache.oodt/opendapps/1.1-SNAPSHOT/opendapps-1.1-SNAPSHOT.pom
[JENKINS] Archiving <https://builds.apache.org/job/oodt-2.0-development/ws/crawler/pom.xml>
to org.apache.oodt/cas-crawler/1.1-SNAPSHOT/cas-crawler-1.1-SNAPSHOT.pom
[JENKINS] Archiving <https://builds.apache.org/job/oodt-2.0-development/ws/pge/pom.xml>
to org.apache.oodt/cas-pge/1.1-SNAPSHOT/cas-pge-1.1-SNAPSHOT.pom
[JENKINS] Archiving <https://builds.apache.org/job/oodt-2.0-development/ws/pcs/input/pom.xml>
to org.apache.oodt/pcs-input/1.1-SNAPSHOT/pcs-input-1.1-SNAPSHOT.pom
[JENKINS] Archiving <https://builds.apache.org/job/oodt-2.0-development/ws/protocol/http/pom.xml>
to org.apache.oodt/cas-protocol-http/1.1-SNAPSHOT/cas-protocol-http-1.1-SNAPSHOT.pom
[JENKINS] Archiving <https://builds.apache.org/job/oodt-2.0-development/ws/mvn/plugins/cas-install/pom.xml>
to org.apache.oodt/maven-cas-install-plugin/1.1-SNAPSHOT/maven-cas-install-plugin-1.1-SNAPSHOT.pom
[JENKINS] Archiving <https://builds.apache.org/job/oodt-2.0-development/ws/grid/pom.xml>
to org.apache.oodt/web-grid/1.1-SNAPSHOT/web-grid-1.1-SNAPSHOT.pom
[JENKINS] Archiving <https://builds.apache.org/job/oodt-2.0-development/ws/metadata/pom.xml>
to org.apache.oodt/cas-metadata/1.1-SNAPSHOT/cas-metadata-1.1-SNAPSHOT.pom
[JENKINS] Archiving <https://builds.apache.org/job/oodt-2.0-development/ws/webapp/components/pom.xml>
to org.apache.oodt/oodt-webapp-components/1.1-SNAPSHOT/oodt-webapp-components-1.1-SNAPSHOT.pom
[JENKINS] Archiving <https://builds.apache.org/job/oodt-2.0-development/ws/sso/pom.xml>
to org.apache.oodt/oodt-sso/1.1-SNAPSHOT/oodt-sso-1.1-SNAPSHOT.pom
[JENKINS] Archiving <https://builds.apache.org/job/oodt-2.0-development/ws/filemgr/pom.xml>
to org.apache.oodt/cas-filemgr/1.1-SNAPSHOT/cas-filemgr-1.1-SNAPSHOT.pom
[JENKINS] Archiving <https://builds.apache.org/job/oodt-2.0-development/ws/app/fmbrowser/pom.xml>
to org.apache.oodt/cas-fm-browser/1.1-SNAPSHOT/cas-fm-browser-1.1-SNAPSHOT.pom
[JENKINS] Archiving <https://builds.apache.org/job/oodt-2.0-development/ws/protocol/imaps/pom.xml>
to org.apache.oodt/cas-protocol-imaps/1.1-SNAPSHOT/cas-protocol-imaps-1.1-SNAPSHOT.pom
Sending e-mails to: dev@oodt.apache.org
channel stopped

Mime
View raw message