oodt-dev mailing list archives

Site index · List index
Message view « Date » · « Thread »
Top « Date » · « Thread »
From Apache Jenkins Server <jenk...@builds.apache.org>
Subject Build failed in Jenkins: oodt-trunk #2104
Date Wed, 01 Jun 2016 16:27:09 GMT
See <https://builds.apache.org/job/oodt-trunk/2104/>

------------------------------------------
[...truncated 998 lines...]
[INFO] Copying 3 resources
[INFO] [compiler:testCompile {execution: default-testCompile}]
[INFO] Changes detected - recompiling the module!
[INFO] Compiling 68 source files to <https://builds.apache.org/job/oodt-trunk/ws/filemgr/target/test-classes>
[WARNING] <https://builds.apache.org/job/oodt-trunk/ws/filemgr/src/test/java/org/apache/oodt/cas/filemgr/metadata/extractors/examples/TestTikaAutoDetectExtractor.java>:
Some input files use or override a deprecated API.
[WARNING] <https://builds.apache.org/job/oodt-trunk/ws/filemgr/src/test/java/org/apache/oodt/cas/filemgr/metadata/extractors/examples/TestTikaAutoDetectExtractor.java>:
Recompile with -Xlint:deprecation for details.
[WARNING] <https://builds.apache.org/job/oodt-trunk/ws/filemgr/src/test/java/org/apache/oodt/cas/filemgr/metadata/extractors/TestCoreMetExtractor.java>:
Some input files use unchecked or unsafe operations.
[WARNING] <https://builds.apache.org/job/oodt-trunk/ws/filemgr/src/test/java/org/apache/oodt/cas/filemgr/metadata/extractors/TestCoreMetExtractor.java>:
Recompile with -Xlint:unchecked for details.
[WARNING] DEPRECATED [systemProperties]: Use systemPropertyVariables instead.
[INFO] [surefire:test {execution: default-test}]
[WARNING] The parameter forkMode is deprecated since version 2.14. Use forkCount and reuseForks
instead.
[INFO] Surefire report directory: <https://builds.apache.org/job/oodt-trunk/ws/filemgr/target/surefire-reports>

-------------------------------------------------------
 T E S T S
-------------------------------------------------------
Running org.apache.oodt.cas.filemgr.metadata.extractors.TestCoreMetExtractor
Tests run: 2, Failures: 0, Errors: 0, Skipped: 0, Time elapsed: 0.555 sec - in org.apache.oodt.cas.filemgr.metadata.extractors.TestCoreMetExtractor
Running org.apache.oodt.cas.filemgr.metadata.extractors.TestAbstractFilemgrMetExtractor
Tests run: 1, Failures: 0, Errors: 0, Skipped: 0, Time elapsed: 0.005 sec - in org.apache.oodt.cas.filemgr.metadata.extractors.TestAbstractFilemgrMetExtractor
Running org.apache.oodt.cas.filemgr.metadata.extractors.examples.TestFinalFileLocationExtractor
Tests run: 2, Failures: 0, Errors: 0, Skipped: 0, Time elapsed: 0.027 sec - in org.apache.oodt.cas.filemgr.metadata.extractors.examples.TestFinalFileLocationExtractor
Running org.apache.oodt.cas.filemgr.metadata.extractors.examples.TestFilenameRegexMetExtractor
Tests run: 1, Failures: 0, Errors: 0, Skipped: 0, Time elapsed: 0.002 sec - in org.apache.oodt.cas.filemgr.metadata.extractors.examples.TestFilenameRegexMetExtractor
Running org.apache.oodt.cas.filemgr.metadata.extractors.examples.TestDateTimeExpandMetExtractor
Tests run: 3, Failures: 0, Errors: 0, Skipped: 0, Time elapsed: 0.298 sec - in org.apache.oodt.cas.filemgr.metadata.extractors.examples.TestDateTimeExpandMetExtractor
Running org.apache.oodt.cas.filemgr.metadata.extractors.examples.TestMimeTypeExtractor
Tests run: 1, Failures: 0, Errors: 0, Skipped: 0, Time elapsed: 0.006 sec - in org.apache.oodt.cas.filemgr.metadata.extractors.examples.TestMimeTypeExtractor
Running org.apache.oodt.cas.filemgr.metadata.extractors.examples.TestTikaAutoDetectExtractor
Tests run: 1, Failures: 0, Errors: 0, Skipped: 0, Time elapsed: 0.156 sec - in org.apache.oodt.cas.filemgr.metadata.extractors.examples.TestTikaAutoDetectExtractor
Running org.apache.oodt.cas.filemgr.cli.action.TestHasProductCliAction
Tests run: 2, Failures: 0, Errors: 0, Skipped: 0, Time elapsed: 0.037 sec - in org.apache.oodt.cas.filemgr.cli.action.TestHasProductCliAction
Running org.apache.oodt.cas.filemgr.cli.action.TestGetProductByNameCliAction
Tests run: 2, Failures: 0, Errors: 0, Skipped: 0, Time elapsed: 0.034 sec - in org.apache.oodt.cas.filemgr.cli.action.TestGetProductByNameCliAction
Running org.apache.oodt.cas.filemgr.cli.action.TestGetFirstPageCliAction
Tests run: 2, Failures: 0, Errors: 0, Skipped: 0, Time elapsed: 0.006 sec - in org.apache.oodt.cas.filemgr.cli.action.TestGetFirstPageCliAction
Running org.apache.oodt.cas.filemgr.cli.action.TestIngestProductCliAction
Tests run: 5, Failures: 0, Errors: 0, Skipped: 0, Time elapsed: 0.136 sec - in org.apache.oodt.cas.filemgr.cli.action.TestIngestProductCliAction
Running org.apache.oodt.cas.filemgr.cli.action.TestSqlQueryCliAction
Tests run: 3, Failures: 0, Errors: 0, Skipped: 0, Time elapsed: 0.018 sec - in org.apache.oodt.cas.filemgr.cli.action.TestSqlQueryCliAction
Running org.apache.oodt.cas.filemgr.cli.action.TestGetLastPageCliAction
Tests run: 2, Failures: 0, Errors: 0, Skipped: 0, Time elapsed: 0.004 sec - in org.apache.oodt.cas.filemgr.cli.action.TestGetLastPageCliAction
Running org.apache.oodt.cas.filemgr.cli.action.TestAddProductTypeCliAction
Tests run: 2, Failures: 0, Errors: 0, Skipped: 0, Time elapsed: 0.004 sec - in org.apache.oodt.cas.filemgr.cli.action.TestAddProductTypeCliAction
Running org.apache.oodt.cas.filemgr.cli.action.TestGetNumProductsCliAction
Tests run: 2, Failures: 0, Errors: 0, Skipped: 0, Time elapsed: 0.003 sec - in org.apache.oodt.cas.filemgr.cli.action.TestGetNumProductsCliAction
Running org.apache.oodt.cas.filemgr.cli.action.TestDeleteProductByNameCliAction
Tests run: 2, Failures: 0, Errors: 0, Skipped: 0, Time elapsed: 0.149 sec - in org.apache.oodt.cas.filemgr.cli.action.TestDeleteProductByNameCliAction
Running org.apache.oodt.cas.filemgr.cli.action.TestGetCurrentTransfersCliAction
Tests run: 2, Failures: 0, Errors: 0, Skipped: 0, Time elapsed: 0.006 sec - in org.apache.oodt.cas.filemgr.cli.action.TestGetCurrentTransfersCliAction
Running org.apache.oodt.cas.filemgr.cli.action.TestDeleteProductByIdCliAction
Tests run: 2, Failures: 0, Errors: 0, Skipped: 0, Time elapsed: 0.019 sec - in org.apache.oodt.cas.filemgr.cli.action.TestDeleteProductByIdCliAction
Running org.apache.oodt.cas.filemgr.cli.action.TestGetFilePercentTransferredCliAction
Tests run: 2, Failures: 0, Errors: 0, Skipped: 0, Time elapsed: 0.004 sec - in org.apache.oodt.cas.filemgr.cli.action.TestGetFilePercentTransferredCliAction
Running org.apache.oodt.cas.filemgr.cli.action.TestGetCurrentTransferCliAction
Tests run: 2, Failures: 0, Errors: 0, Skipped: 0, Time elapsed: 0.008 sec - in org.apache.oodt.cas.filemgr.cli.action.TestGetCurrentTransferCliAction
Running org.apache.oodt.cas.filemgr.cli.action.TestLuceneQueryCliAction
Tests run: 2, Failures: 0, Errors: 0, Skipped: 0, Time elapsed: 0.042 sec - in org.apache.oodt.cas.filemgr.cli.action.TestLuceneQueryCliAction
Running org.apache.oodt.cas.filemgr.cli.action.TestGetProductByIdCliAction
Tests run: 2, Failures: 0, Errors: 0, Skipped: 0, Time elapsed: 0.018 sec - in org.apache.oodt.cas.filemgr.cli.action.TestGetProductByIdCliAction
Running org.apache.oodt.cas.filemgr.cli.action.TestDumpMetadataCliAction
Tests run: 1, Failures: 0, Errors: 0, Skipped: 0, Time elapsed: 0.041 sec - in org.apache.oodt.cas.filemgr.cli.action.TestDumpMetadataCliAction
Running org.apache.oodt.cas.filemgr.cli.action.TestGetNextPageCliAction
Tests run: 2, Failures: 0, Errors: 0, Skipped: 0, Time elapsed: 0.006 sec - in org.apache.oodt.cas.filemgr.cli.action.TestGetNextPageCliAction
Running org.apache.oodt.cas.filemgr.cli.action.TestGetPrevPageCliAction
Tests run: 2, Failures: 0, Errors: 0, Skipped: 0, Time elapsed: 0.004 sec - in org.apache.oodt.cas.filemgr.cli.action.TestGetPrevPageCliAction
Running org.apache.oodt.cas.filemgr.cli.action.TestGetProductPercentTransferredCliAction
Tests run: 2, Failures: 0, Errors: 0, Skipped: 0, Time elapsed: 0.002 sec - in org.apache.oodt.cas.filemgr.cli.action.TestGetProductPercentTransferredCliAction
Running org.apache.oodt.cas.filemgr.cli.action.TestGetProductTypeByNameCliAction
Tests run: 2, Failures: 0, Errors: 0, Skipped: 0, Time elapsed: 0.003 sec - in org.apache.oodt.cas.filemgr.cli.action.TestGetProductTypeByNameCliAction
Running org.apache.oodt.cas.filemgr.cli.TestFileManagerCli
Tests run: 21, Failures: 0, Errors: 0, Skipped: 0, Time elapsed: 5.913 sec - in org.apache.oodt.cas.filemgr.cli.TestFileManagerCli
Running org.apache.oodt.cas.filemgr.versioning.TestConfigurableMetadataBasedFileVersioner
Tests run: 4, Failures: 0, Errors: 0, Skipped: 0, Time elapsed: 0.007 sec - in org.apache.oodt.cas.filemgr.versioning.TestConfigurableMetadataBasedFileVersioner
Running org.apache.oodt.cas.filemgr.versioning.TestSingleFileBasicVersioner
Tests run: 1, Failures: 0, Errors: 0, Skipped: 0, Time elapsed: 0.003 sec - in org.apache.oodt.cas.filemgr.versioning.TestSingleFileBasicVersioner
Running org.apache.oodt.cas.filemgr.versioning.TestProductTypeMetVersioner
Tests run: 1, Failures: 0, Errors: 0, Skipped: 0, Time elapsed: 0.006 sec - in org.apache.oodt.cas.filemgr.versioning.TestProductTypeMetVersioner
Running org.apache.oodt.cas.filemgr.versioning.TestMetadataBasedFileVersioner
Tests run: 2, Failures: 0, Errors: 0, Skipped: 0, Time elapsed: 0.004 sec - in org.apache.oodt.cas.filemgr.versioning.TestMetadataBasedFileVersioner
Running org.apache.oodt.cas.filemgr.versioning.TestDateTimeVersioner
Tests run: 1, Failures: 0, Errors: 0, Skipped: 0, Time elapsed: 0.007 sec - in org.apache.oodt.cas.filemgr.versioning.TestDateTimeVersioner
Running org.apache.oodt.cas.filemgr.versioning.TestBasicVersioner
Tests run: 2, Failures: 0, Errors: 0, Skipped: 0, Time elapsed: 0.027 sec - in org.apache.oodt.cas.filemgr.versioning.TestBasicVersioner
Running org.apache.oodt.cas.filemgr.versioning.TestDirectoryBasedProductVersioner
Tests run: 1, Failures: 0, Errors: 0, Skipped: 0, Time elapsed: 0.007 sec - in org.apache.oodt.cas.filemgr.versioning.TestDirectoryBasedProductVersioner
Running org.apache.oodt.cas.filemgr.versioning.TestAcquisitionDateVersioner
Tests run: 3, Failures: 0, Errors: 0, Skipped: 0, Time elapsed: 0.013 sec - in org.apache.oodt.cas.filemgr.versioning.TestAcquisitionDateVersioner
Running org.apache.oodt.cas.filemgr.versioning.TestInPlaceVersioner
Tests run: 2, Failures: 0, Errors: 0, Skipped: 0, Time elapsed: 0.014 sec - in org.apache.oodt.cas.filemgr.versioning.TestInPlaceVersioner
Running org.apache.oodt.cas.filemgr.structs.query.TestQueryResult
Tests run: 4, Failures: 0, Errors: 0, Skipped: 0, Time elapsed: 0.003 sec - in org.apache.oodt.cas.filemgr.structs.query.TestQueryResult
Running org.apache.oodt.cas.filemgr.structs.query.TestQueryResultComparator
Tests run: 1, Failures: 0, Errors: 0, Skipped: 0, Time elapsed: 0.013 sec - in org.apache.oodt.cas.filemgr.structs.query.TestQueryResultComparator
Running org.apache.oodt.cas.filemgr.structs.TestReference
Tests run: 2, Failures: 0, Errors: 0, Skipped: 0, Time elapsed: 0.006 sec - in org.apache.oodt.cas.filemgr.structs.TestReference
Running org.apache.oodt.cas.filemgr.structs.TestProduct
Tests run: 3, Failures: 0, Errors: 0, Skipped: 0, Time elapsed: 0.011 sec - in org.apache.oodt.cas.filemgr.structs.TestProduct
Running org.apache.oodt.cas.filemgr.structs.type.TestTypeHandler
Tests run: 3, Failures: 0, Errors: 0, Skipped: 0, Time elapsed: 10.641 sec - in org.apache.oodt.cas.filemgr.structs.type.TestTypeHandler
Running org.apache.oodt.cas.filemgr.tools.TestMetadataBasedProductMover
Tests run: 1, Failures: 0, Errors: 0, Skipped: 0, Time elapsed: 0.329 sec - in org.apache.oodt.cas.filemgr.tools.TestMetadataBasedProductMover
Running org.apache.oodt.cas.filemgr.tools.TestExpImpCatalog
Tests run: 3, Failures: 0, Errors: 0, Skipped: 0, Time elapsed: 15.869 sec - in org.apache.oodt.cas.filemgr.tools.TestExpImpCatalog
Running org.apache.oodt.cas.filemgr.system.TestXmlRpcFileManagerClient
Tests run: 5, Failures: 0, Errors: 0, Skipped: 0, Time elapsed: 20.639 sec - in org.apache.oodt.cas.filemgr.system.TestXmlRpcFileManagerClient
Running org.apache.oodt.cas.filemgr.system.TestXmlRpcFileManager
Tests run: 1, Failures: 0, Errors: 0, Skipped: 0, Time elapsed: 5.127 sec - in org.apache.oodt.cas.filemgr.system.TestXmlRpcFileManager
Running org.apache.oodt.cas.filemgr.validation.TestXMLValidationLayer
Tests run: 7, Failures: 0, Errors: 0, Skipped: 0, Time elapsed: 0.417 sec - in org.apache.oodt.cas.filemgr.validation.TestXMLValidationLayer
Running org.apache.oodt.cas.filemgr.repository.TestXMLRepositoryManager
Tests run: 12, Failures: 0, Errors: 0, Skipped: 0, Time elapsed: 0.048 sec - in org.apache.oodt.cas.filemgr.repository.TestXMLRepositoryManager
Running org.apache.oodt.cas.filemgr.ingest.TestStdIngester
Tests run: 1, Failures: 0, Errors: 0, Skipped: 0, Time elapsed: 0.06 sec - in org.apache.oodt.cas.filemgr.ingest.TestStdIngester
Running org.apache.oodt.cas.filemgr.ingest.TestLocalCache
Tests run: 3, Failures: 0, Errors: 0, Skipped: 0, Time elapsed: 15.246 sec - in org.apache.oodt.cas.filemgr.ingest.TestLocalCache
Running org.apache.oodt.cas.filemgr.ingest.TestRmiCache
Tests run: 3, Failures: 0, Errors: 0, Skipped: 0, Time elapsed: 16.447 sec - in org.apache.oodt.cas.filemgr.ingest.TestRmiCache
Running org.apache.oodt.cas.filemgr.ingest.TestCachedIngester
Tests run: 2, Failures: 0, Errors: 0, Skipped: 0, Time elapsed: 10.207 sec - in org.apache.oodt.cas.filemgr.ingest.TestCachedIngester
Running org.apache.oodt.cas.filemgr.datatransfer.TestS3DataTransferer
Tests run: 3, Failures: 0, Errors: 0, Skipped: 0, Time elapsed: 0.186 sec - in org.apache.oodt.cas.filemgr.datatransfer.TestS3DataTransferer
Running org.apache.oodt.cas.filemgr.datatransfer.TestInPlaceDataTransferer
Tests run: 1, Failures: 0, Errors: 0, Skipped: 0, Time elapsed: 0.003 sec - in org.apache.oodt.cas.filemgr.datatransfer.TestInPlaceDataTransferer
Running org.apache.oodt.cas.filemgr.datatransfer.TestS3DataTransfererFactory
Tests run: 1, Failures: 0, Errors: 0, Skipped: 0, Time elapsed: 0.71 sec - in org.apache.oodt.cas.filemgr.datatransfer.TestS3DataTransfererFactory
Running org.apache.oodt.cas.filemgr.datatransfer.TestLocalDataTransferer
Tests run: 1, Failures: 0, Errors: 0, Skipped: 0, Time elapsed: 0.008 sec - in org.apache.oodt.cas.filemgr.datatransfer.TestLocalDataTransferer
Running org.apache.oodt.cas.filemgr.catalog.TestLuceneCatalog
Tests run: 24, Failures: 0, Errors: 0, Skipped: 0, Time elapsed: 1.976 sec - in org.apache.oodt.cas.filemgr.catalog.TestLuceneCatalog
Running org.apache.oodt.cas.filemgr.catalog.TestOrderedDataSourceCatalog
Tests run: 11, Failures: 0, Errors: 0, Skipped: 0, Time elapsed: 0.281 sec - in org.apache.oodt.cas.filemgr.catalog.TestOrderedDataSourceCatalog
Running org.apache.oodt.cas.filemgr.catalog.TestDataSourceCatalog
Tests run: 10, Failures: 0, Errors: 0, Skipped: 0, Time elapsed: 0.145 sec - in org.apache.oodt.cas.filemgr.catalog.TestDataSourceCatalog
Running org.apache.oodt.cas.filemgr.catalog.TestMappedDataSourceCatalog
Tests run: 10, Failures: 0, Errors: 0, Skipped: 0, Time elapsed: 0.176 sec - in org.apache.oodt.cas.filemgr.catalog.TestMappedDataSourceCatalog
Running org.apache.oodt.cas.filemgr.util.TestXmlStructFactory
Tests run: 1, Failures: 0, Errors: 0, Skipped: 0, Time elapsed: 0.003 sec - in org.apache.oodt.cas.filemgr.util.TestXmlStructFactory
Running org.apache.oodt.cas.filemgr.util.TestGenericFileManagerObjectStructFactory
Tests run: 6, Failures: 0, Errors: 0, Skipped: 0, Time elapsed: 0.005 sec - in org.apache.oodt.cas.filemgr.util.TestGenericFileManagerObjectStructFactory
Running org.apache.oodt.cas.filemgr.util.TestXmlRpcStructFactory
Tests run: 2, Failures: 0, Errors: 0, Skipped: 0, Time elapsed: 5.041 sec - in org.apache.oodt.cas.filemgr.util.TestXmlRpcStructFactory

Results :

Tests run: 213, Failures: 0, Errors: 0, Skipped: 0

[JENKINS] Recording test results
[INFO] [jar:jar {execution: default-jar}]
[INFO] Building jar: <https://builds.apache.org/job/oodt-trunk/ws/filemgr/target/cas-filemgr-0.13-SNAPSHOT.jar>
[INFO] Preparing javadoc:javadoc
[WARNING] Removing: javadoc from forked lifecycle, to prevent recursive invocation.
[INFO] No goals needed for project - skipping
[WARNING] DEPRECATED [aggregate]: since 2.5. Use the goals <code>javadoc:aggregate</code>
and <code>javadoc:test-aggregate</code> instead.
[INFO] [javadoc:javadoc {execution: attach-javadocs}]
[INFO] [assembly:single {execution: default}]
[INFO] Reading assembly descriptor: src/main/assembly/assembly.xml
[INFO] Processing DependencySet (output=lib)
[INFO] Building tar : <https://builds.apache.org/job/oodt-trunk/ws/filemgr/target/cas-filemgr-0.13-SNAPSHOT-dist.tar.gz>
[INFO] Processing DependencySet (output=lib)
[INFO] Building zip: <https://builds.apache.org/job/oodt-trunk/ws/filemgr/target/cas-filemgr-0.13-SNAPSHOT-dist.zip>
[INFO] [install:install {execution: default-install}]
[INFO] Installing <https://builds.apache.org/job/oodt-trunk/ws/filemgr/target/cas-filemgr-0.13-SNAPSHOT.jar>
to <https://builds.apache.org/job/oodt-trunk/ws/.repository/org/apache/oodt/cas-filemgr/0.13-SNAPSHOT/cas-filemgr-0.13-SNAPSHOT.jar>
[INFO] Installing <https://builds.apache.org/job/oodt-trunk/ws/filemgr/target/cas-filemgr-0.13-SNAPSHOT-dist.tar.gz>
to <https://builds.apache.org/job/oodt-trunk/ws/.repository/org/apache/oodt/cas-filemgr/0.13-SNAPSHOT/cas-filemgr-0.13-SNAPSHOT-dist.tar.gz>
[INFO] Installing <https://builds.apache.org/job/oodt-trunk/ws/filemgr/target/cas-filemgr-0.13-SNAPSHOT-dist.zip>
to <https://builds.apache.org/job/oodt-trunk/ws/.repository/org/apache/oodt/cas-filemgr/0.13-SNAPSHOT/cas-filemgr-0.13-SNAPSHOT-dist.zip>
[INFO] ------------------------------------------------------------------------
[INFO] Building OODT CAS Virtual Catalog and Integration Service.
[INFO]    task-segment: [clean, install]
[INFO] ------------------------------------------------------------------------
[INFO] [clean:clean {execution: default-clean}]
[INFO] Deleting <https://builds.apache.org/job/oodt-trunk/ws/catalog/target>
[INFO] [remote-resources:process {execution: default}]
[INFO] [resources:resources {execution: default-resources}]
[INFO] Using 'UTF-8' encoding to copy filtered resources.
[INFO] Copying 7 resources to org/apache/oodt/cas/catalog/config
[INFO] Copying 3 resources
[INFO] [compiler:compile {execution: default-compile}]
[INFO] Changes detected - recompiling the module!
[INFO] Compiling 125 source files to <https://builds.apache.org/job/oodt-trunk/ws/catalog/target/classes>
[INFO] -------------------------------------------------------------
[ERROR] COMPILATION ERROR : 
[INFO] -------------------------------------------------------------
[ERROR] <https://builds.apache.org/job/oodt-trunk/ws/catalog/src/main/java/org/apache/oodt/cas/catalog/mapping/MemoryBasedIngestMapper.java>:[53,84]
diamond operator is not supported in -source 1.6
  (use -source 7 or higher to enable diamond operator)
[ERROR] <https://builds.apache.org/job/oodt-trunk/ws/catalog/src/main/java/org/apache/oodt/cas/catalog/mapping/DataSourceIngestMapper.java>:[70,21]
try-with-resources is not supported in -source 1.6
  (use -source 7 or higher to enable try-with-resources)
[ERROR] <https://builds.apache.org/job/oodt-trunk/ws/catalog/src/main/java/org/apache/oodt/cas/catalog/mapping/DataSourceIngestMapper.java>:[149,62]
diamond operator is not supported in -source 1.6
  (use -source 7 or higher to enable diamond operator)
[INFO] 3 errors 
[INFO] -------------------------------------------------------------
[INFO] ------------------------------------------------------------------------
[ERROR] BUILD FAILURE
[INFO] ------------------------------------------------------------------------
[INFO] Compilation failure

<https://builds.apache.org/job/oodt-trunk/ws/catalog/src/main/java/org/apache/oodt/cas/catalog/mapping/MemoryBasedIngestMapper.java>:[53,84]
diamond operator is not supported in -source 1.6
  (use -source 7 or higher to enable diamond operator)
<https://builds.apache.org/job/oodt-trunk/ws/catalog/src/main/java/org/apache/oodt/cas/catalog/mapping/DataSourceIngestMapper.java>:[70,21]
try-with-resources is not supported in -source 1.6
  (use -source 7 or higher to enable try-with-resources)
<https://builds.apache.org/job/oodt-trunk/ws/catalog/src/main/java/org/apache/oodt/cas/catalog/mapping/DataSourceIngestMapper.java>:[149,62]
diamond operator is not supported in -source 1.6
  (use -source 7 or higher to enable diamond operator)

[INFO] ------------------------------------------------------------------------
[INFO] For more information, run Maven with the -e switch
[INFO] ------------------------------------------------------------------------
[INFO] Total time: 3 minutes 40 seconds
[INFO] Finished at: Wed Jun 01 16:25:35 UTC 2016
[INFO] Final Memory: 141M/782M
[INFO] ------------------------------------------------------------------------
Waiting for Jenkins to finish collecting data
[JENKINS] Archiving <https://builds.apache.org/job/oodt-trunk/ws/sso/pom.xml> to org.apache.oodt/oodt-sso/0.13-SNAPSHOT/oodt-sso-0.13-SNAPSHOT.pom
[JENKINS] Archiving <https://builds.apache.org/job/oodt-trunk/ws/sso/target/oodt-sso-0.13-SNAPSHOT.jar>
to org.apache.oodt/oodt-sso/0.13-SNAPSHOT/oodt-sso-0.13-SNAPSHOT.jar
[JENKINS] Archiving <https://builds.apache.org/job/oodt-trunk/ws/protocol/ftp/pom.xml>
to org.apache.oodt/cas-protocol-ftp/0.13-SNAPSHOT/cas-protocol-ftp-0.13-SNAPSHOT.pom
[JENKINS] Archiving <https://builds.apache.org/job/oodt-trunk/ws/protocol/ftp/target/cas-protocol-ftp-0.13-SNAPSHOT.jar>
to org.apache.oodt/cas-protocol-ftp/0.13-SNAPSHOT/cas-protocol-ftp-0.13-SNAPSHOT.jar
[JENKINS] Archiving <https://builds.apache.org/job/oodt-trunk/ws/metadata/pom.xml> to
org.apache.oodt/cas-metadata/0.13-SNAPSHOT/cas-metadata-0.13-SNAPSHOT.pom
[JENKINS] Archiving <https://builds.apache.org/job/oodt-trunk/ws/metadata/target/cas-metadata-0.13-SNAPSHOT.jar>
to org.apache.oodt/cas-metadata/0.13-SNAPSHOT/cas-metadata-0.13-SNAPSHOT.jar
[JENKINS] Archiving <https://builds.apache.org/job/oodt-trunk/ws/.repository/org/apache/oodt/oodt-core/0.13-SNAPSHOT/oodt-core-0.13-SNAPSHOT.pom>
to org.apache.oodt/oodt-core/0.13-SNAPSHOT/oodt-core-0.13-SNAPSHOT.pom
[JENKINS] Archiving <https://builds.apache.org/job/oodt-trunk/ws/core/target/oodt-core-0.13-SNAPSHOT-site.xml>
to org.apache.oodt/oodt-core/0.13-SNAPSHOT/oodt-core-0.13-SNAPSHOT-site.xml
<https://builds.apache.org/job/oodt-trunk/ws/.repository/org/apache/oodt/oodt-core/0.13-SNAPSHOT/oodt-core-0.13-SNAPSHOT.pom>
is not inside <https://builds.apache.org/job/oodt-trunk/ws/core/;> will archive in a
separate pass
[JENKINS] Archiving <https://builds.apache.org/job/oodt-trunk/ws/protocol/http/pom.xml>
to org.apache.oodt/cas-protocol-http/0.13-SNAPSHOT/cas-protocol-http-0.13-SNAPSHOT.pom
[JENKINS] Archiving <https://builds.apache.org/job/oodt-trunk/ws/protocol/http/target/cas-protocol-http-0.13-SNAPSHOT.jar>
to org.apache.oodt/cas-protocol-http/0.13-SNAPSHOT/cas-protocol-http-0.13-SNAPSHOT.jar
[JENKINS] Archiving <https://builds.apache.org/job/oodt-trunk/ws/protocol/api/pom.xml>
to org.apache.oodt/cas-protocol-api/0.13-SNAPSHOT/cas-protocol-api-0.13-SNAPSHOT.pom
[JENKINS] Archiving <https://builds.apache.org/job/oodt-trunk/ws/protocol/api/target/cas-protocol-api-0.13-SNAPSHOT.jar>
to org.apache.oodt/cas-protocol-api/0.13-SNAPSHOT/cas-protocol-api-0.13-SNAPSHOT.jar
[JENKINS] Archiving <https://builds.apache.org/job/oodt-trunk/ws/protocol/api/target/cas-protocol-api-0.13-SNAPSHOT-dist.tar.gz>
to org.apache.oodt/cas-protocol-api/0.13-SNAPSHOT/cas-protocol-api-0.13-SNAPSHOT-dist.tar.gz
[JENKINS] Archiving <https://builds.apache.org/job/oodt-trunk/ws/protocol/api/target/cas-protocol-api-0.13-SNAPSHOT-dist.zip>
to org.apache.oodt/cas-protocol-api/0.13-SNAPSHOT/cas-protocol-api-0.13-SNAPSHOT-dist.zip
Compressed 19.48 MB of artifacts by 73.0% relative to #2103
[JENKINS] Archiving <https://builds.apache.org/job/oodt-trunk/ws/filemgr/pom.xml> to
org.apache.oodt/cas-filemgr/0.13-SNAPSHOT/cas-filemgr-0.13-SNAPSHOT.pom
[JENKINS] Archiving <https://builds.apache.org/job/oodt-trunk/ws/filemgr/target/cas-filemgr-0.13-SNAPSHOT.jar>
to org.apache.oodt/cas-filemgr/0.13-SNAPSHOT/cas-filemgr-0.13-SNAPSHOT.jar
[JENKINS] Archiving <https://builds.apache.org/job/oodt-trunk/ws/filemgr/target/cas-filemgr-0.13-SNAPSHOT-dist.tar.gz>
to org.apache.oodt/cas-filemgr/0.13-SNAPSHOT/cas-filemgr-0.13-SNAPSHOT-dist.tar.gz
[JENKINS] Archiving <https://builds.apache.org/job/oodt-trunk/ws/filemgr/target/cas-filemgr-0.13-SNAPSHOT-dist.zip>
to org.apache.oodt/cas-filemgr/0.13-SNAPSHOT/cas-filemgr-0.13-SNAPSHOT-dist.zip
Compressed 110.44 MB of artifacts by 63.9% relative to #2103
[JENKINS] Archiving <https://builds.apache.org/job/oodt-trunk/ws/cli/pom.xml> to org.apache.oodt/cas-cli/0.13-SNAPSHOT/cas-cli-0.13-SNAPSHOT.pom
[JENKINS] Archiving <https://builds.apache.org/job/oodt-trunk/ws/cli/target/cas-cli-0.13-SNAPSHOT.jar>
to org.apache.oodt/cas-cli/0.13-SNAPSHOT/cas-cli-0.13-SNAPSHOT.jar
[JENKINS] Archiving <https://builds.apache.org/job/oodt-trunk/ws/cli/target/cas-cli-0.13-SNAPSHOT-dist.tar.gz>
to org.apache.oodt/cas-cli/0.13-SNAPSHOT/cas-cli-0.13-SNAPSHOT-dist.tar.gz
[JENKINS] Archiving <https://builds.apache.org/job/oodt-trunk/ws/cli/target/cas-cli-0.13-SNAPSHOT-dist.zip>
to org.apache.oodt/cas-cli/0.13-SNAPSHOT/cas-cli-0.13-SNAPSHOT-dist.zip
Compressed 13.45 MB of artifacts by 97.8% relative to #2103
[JENKINS] Archiving <https://builds.apache.org/job/oodt-trunk/ws/xmlquery/pom.xml> to
org.apache.oodt/oodt-xmlquery/0.13-SNAPSHOT/oodt-xmlquery-0.13-SNAPSHOT.pom
[JENKINS] Archiving <https://builds.apache.org/job/oodt-trunk/ws/xmlquery/target/oodt-xmlquery-0.13-SNAPSHOT.jar>
to org.apache.oodt/oodt-xmlquery/0.13-SNAPSHOT/oodt-xmlquery-0.13-SNAPSHOT.jar
[JENKINS] Archiving <https://builds.apache.org/job/oodt-trunk/ws/protocol/imaps/pom.xml>
to org.apache.oodt/cas-protocol-imaps/0.13-SNAPSHOT/cas-protocol-imaps-0.13-SNAPSHOT.pom
[JENKINS] Archiving <https://builds.apache.org/job/oodt-trunk/ws/protocol/imaps/target/cas-protocol-imaps-0.13-SNAPSHOT.jar>
to org.apache.oodt/cas-protocol-imaps/0.13-SNAPSHOT/cas-protocol-imaps-0.13-SNAPSHOT.jar
[JENKINS] Archiving <https://builds.apache.org/job/oodt-trunk/ws/commons/pom.xml> to
org.apache.oodt/oodt-commons/0.13-SNAPSHOT/oodt-commons-0.13-SNAPSHOT.pom
[JENKINS] Archiving <https://builds.apache.org/job/oodt-trunk/ws/commons/target/oodt-commons-0.13-SNAPSHOT.jar>
to org.apache.oodt/oodt-commons/0.13-SNAPSHOT/oodt-commons-0.13-SNAPSHOT.jar
[JENKINS] Archiving <https://builds.apache.org/job/oodt-trunk/ws/protocol/sftp/pom.xml>
to org.apache.oodt/cas-protocol-sftp/0.13-SNAPSHOT/cas-protocol-sftp-0.13-SNAPSHOT.pom
[JENKINS] Archiving <https://builds.apache.org/job/oodt-trunk/ws/protocol/sftp/target/cas-protocol-sftp-0.13-SNAPSHOT.jar>
to org.apache.oodt/cas-protocol-sftp/0.13-SNAPSHOT/cas-protocol-sftp-0.13-SNAPSHOT.jar
[JENKINS] Archiving <https://builds.apache.org/job/oodt-trunk/ws/pcs/input/pom.xml>
to org.apache.oodt/pcs-input/0.13-SNAPSHOT/pcs-input-0.13-SNAPSHOT.pom
[JENKINS] Archiving <https://builds.apache.org/job/oodt-trunk/ws/pcs/input/target/pcs-input-0.13-SNAPSHOT.jar>
to org.apache.oodt/pcs-input/0.13-SNAPSHOT/pcs-input-0.13-SNAPSHOT.jar
[JENKINS] Archiving <https://builds.apache.org/job/oodt-trunk/ws/catalog/pom.xml> to
org.apache.oodt/cas-catalog/0.13-SNAPSHOT/cas-catalog-0.13-SNAPSHOT.pom
Sending e-mails to: dev@oodt.apache.org
channel stopped

Mime
View raw message