oodt-dev mailing list archives

Site index · List index
Message view « Date » · « Thread »
Top « Date » · « Thread »
From Apache Jenkins Server <jenk...@builds.apache.org>
Subject Build failed in Jenkins: oodt-trunk » Catalog and Archive File Management Component #2094
Date Thu, 04 Feb 2016 18:02:50 GMT
See <https://builds.apache.org/job/oodt-trunk/org.apache.oodt$cas-filemgr/2094/changes>

Changes:

[tom] OODT-781 fix removal error

------------------------------------------
[...truncated 55 lines...]
Downloading: http://repo1.maven.org/maven2/org/apache/solr/solr-core/1.3.0/solr-core-1.3.0.pom
3K downloaded  (solr-core-1.3.0.pom)
Downloading: https://oss.sonatype.org/content/groups/public/org/apache/solr/solr-parent/1.3.0/solr-parent-1.3.0.pom
[INFO] Unable to find resource 'org.apache.solr:solr-parent:pom:1.3.0' in repository sonatype-nexus
(https://oss.sonatype.org/content/groups/public)
Downloading: http://repo1.maven.org/maven2/org/apache/solr/solr-parent/1.3.0/solr-parent-1.3.0.pom
3K downloaded  (solr-parent-1.3.0.pom)
Downloading: https://oss.sonatype.org/content/groups/public/org/apache/solr/solr-common/1.3.0/solr-common-1.3.0.pom
[INFO] Unable to find resource 'org.apache.solr:solr-common:pom:1.3.0' in repository sonatype-nexus
(https://oss.sonatype.org/content/groups/public)
Downloading: http://repo1.maven.org/maven2/org/apache/solr/solr-common/1.3.0/solr-common-1.3.0.pom
1K downloaded  (solr-common-1.3.0.pom)
Downloading: https://oss.sonatype.org/content/groups/public/org/apache/solr/solr-solrj/1.3.0/solr-solrj-1.3.0.pom
[INFO] Unable to find resource 'org.apache.solr:solr-solrj:pom:1.3.0' in repository sonatype-nexus
(https://oss.sonatype.org/content/groups/public)
Downloading: http://repo1.maven.org/maven2/org/apache/solr/solr-solrj/1.3.0/solr-solrj-1.3.0.pom
2K downloaded  (solr-solrj-1.3.0.pom)
Downloading: https://oss.sonatype.org/content/groups/public/org/apache/commons/commons-io/1.3.2/commons-io-1.3.2.pom
[INFO] Unable to find resource 'org.apache.commons:commons-io:pom:1.3.2' in repository sonatype-nexus
(https://oss.sonatype.org/content/groups/public)
Downloading: http://repo1.maven.org/maven2/org/apache/commons/commons-io/1.3.2/commons-io-1.3.2.pom
640b downloaded  (commons-io-1.3.2.pom)
Downloading: https://oss.sonatype.org/content/groups/public/commons-io/commons-io/1.3.2/commons-io-1.3.2.pom
[INFO] Unable to find resource 'commons-io:commons-io:pom:1.3.2' in repository sonatype-nexus
(https://oss.sonatype.org/content/groups/public)
Downloading: http://repo1.maven.org/maven2/commons-io/commons-io/1.3.2/commons-io-1.3.2.pom
9K downloaded  (commons-io-1.3.2.pom)
Downloading: https://oss.sonatype.org/content/groups/public/org/apache/commons/commons-parent/3/commons-parent-3.pom
[INFO] Unable to find resource 'org.apache.commons:commons-parent:pom:3' in repository sonatype-nexus
(https://oss.sonatype.org/content/groups/public)
Downloading: http://repo1.maven.org/maven2/org/apache/commons/commons-parent/3/commons-parent-3.pom
11K downloaded  (commons-parent-3.pom)
Downloading: https://oss.sonatype.org/content/groups/public/commons-fileupload/commons-fileupload/1.2/commons-fileupload-1.2.pom
[INFO] Unable to find resource 'commons-fileupload:commons-fileupload:pom:1.2' in repository
sonatype-nexus (https://oss.sonatype.org/content/groups/public)
Downloading: http://repo1.maven.org/maven2/commons-fileupload/commons-fileupload/1.2/commons-fileupload-1.2.pom
10K downloaded  (commons-fileupload-1.2.pom)
Downloading: https://oss.sonatype.org/content/groups/public/org/apache/commons/commons-parent/1/commons-parent-1.pom
[INFO] Unable to find resource 'org.apache.commons:commons-parent:pom:1' in repository sonatype-nexus
(https://oss.sonatype.org/content/groups/public)
Downloading: http://repo1.maven.org/maven2/org/apache/commons/commons-parent/1/commons-parent-1.pom
7K downloaded  (commons-parent-1.pom)
Downloading: https://oss.sonatype.org/content/groups/public/stax/stax/1.2.0/stax-1.2.0.pom
[INFO] Unable to find resource 'stax:stax:pom:1.2.0' in repository sonatype-nexus (https://oss.sonatype.org/content/groups/public)
Downloading: http://repo1.maven.org/maven2/stax/stax/1.2.0/stax-1.2.0.pom
3K downloaded  (stax-1.2.0.pom)
Downloading: https://oss.sonatype.org/content/groups/public/stax/stax-api/1.0.1/stax-api-1.0.1.pom
[INFO] Unable to find resource 'stax:stax-api:pom:1.0.1' in repository sonatype-nexus (https://oss.sonatype.org/content/groups/public)
Downloading: http://repo1.maven.org/maven2/stax/stax-api/1.0.1/stax-api-1.0.1.pom
1K downloaded  (stax-api-1.0.1.pom)
Downloading: https://oss.sonatype.org/content/groups/public/stax-utils/stax-utils/snapshot-20040917/stax-utils-snapshot-20040917.pom
[INFO] Unable to find resource 'stax-utils:stax-utils:pom:snapshot-20040917' in repository
sonatype-nexus (https://oss.sonatype.org/content/groups/public)
Downloading: http://repo1.maven.org/maven2/stax-utils/stax-utils/snapshot-20040917/stax-utils-snapshot-20040917.pom
341b downloaded  (stax-utils-snapshot-20040917.pom)
Downloading: https://oss.sonatype.org/content/groups/public/net/java/dev/stax-utils/stax-utils/20040917/stax-utils-20040917.pom
[INFO] Unable to find resource 'net.java.dev.stax-utils:stax-utils:pom:20040917' in repository
sonatype-nexus (https://oss.sonatype.org/content/groups/public)
Downloading: http://repo1.maven.org/maven2/net/java/dev/stax-utils/stax-utils/20040917/stax-utils-20040917.pom
170b downloaded  (stax-utils-20040917.pom)
Downloading: https://oss.sonatype.org/content/groups/public/org/apache/solr/solr-lucene-analyzers/1.3.0/solr-lucene-analyzers-1.3.0.pom
[INFO] Unable to find resource 'org.apache.solr:solr-lucene-analyzers:pom:1.3.0' in repository
sonatype-nexus (https://oss.sonatype.org/content/groups/public)
Downloading: http://repo1.maven.org/maven2/org/apache/solr/solr-lucene-analyzers/1.3.0/solr-lucene-analyzers-1.3.0.pom
1K downloaded  (solr-lucene-analyzers-1.3.0.pom)
Downloading: https://oss.sonatype.org/content/groups/public/org/apache/solr/solr-lucene-contrib/1.3.0/solr-lucene-contrib-1.3.0.pom
[INFO] Unable to find resource 'org.apache.solr:solr-lucene-contrib:pom:1.3.0' in repository
sonatype-nexus (https://oss.sonatype.org/content/groups/public)
Downloading: http://repo1.maven.org/maven2/org/apache/solr/solr-lucene-contrib/1.3.0/solr-lucene-contrib-1.3.0.pom
1K downloaded  (solr-lucene-contrib-1.3.0.pom)
Downloading: https://oss.sonatype.org/content/groups/public/org/apache/solr/solr-lucene-highlighter/1.3.0/solr-lucene-highlighter-1.3.0.pom
[INFO] Unable to find resource 'org.apache.solr:solr-lucene-highlighter:pom:1.3.0' in repository
sonatype-nexus (https://oss.sonatype.org/content/groups/public)
Downloading: http://repo1.maven.org/maven2/org/apache/solr/solr-lucene-highlighter/1.3.0/solr-lucene-highlighter-1.3.0.pom
1K downloaded  (solr-lucene-highlighter-1.3.0.pom)
Downloading: https://oss.sonatype.org/content/groups/public/org/apache/solr/solr-lucene-queries/1.3.0/solr-lucene-queries-1.3.0.pom
[INFO] Unable to find resource 'org.apache.solr:solr-lucene-queries:pom:1.3.0' in repository
sonatype-nexus (https://oss.sonatype.org/content/groups/public)
Downloading: http://repo1.maven.org/maven2/org/apache/solr/solr-lucene-queries/1.3.0/solr-lucene-queries-1.3.0.pom
1K downloaded  (solr-lucene-queries-1.3.0.pom)
Downloading: https://oss.sonatype.org/content/groups/public/org/apache/solr/solr-lucene-snowball/1.3.0/solr-lucene-snowball-1.3.0.pom
[INFO] Unable to find resource 'org.apache.solr:solr-lucene-snowball:pom:1.3.0' in repository
sonatype-nexus (https://oss.sonatype.org/content/groups/public)
Downloading: http://repo1.maven.org/maven2/org/apache/solr/solr-lucene-snowball/1.3.0/solr-lucene-snowball-1.3.0.pom
1K downloaded  (solr-lucene-snowball-1.3.0.pom)
Downloading: https://oss.sonatype.org/content/groups/public/org/apache/solr/solr-lucene-spellchecker/1.3.0/solr-lucene-spellchecker-1.3.0.pom
[INFO] Unable to find resource 'org.apache.solr:solr-lucene-spellchecker:pom:1.3.0' in repository
sonatype-nexus (https://oss.sonatype.org/content/groups/public)
Downloading: http://repo1.maven.org/maven2/org/apache/solr/solr-lucene-spellchecker/1.3.0/solr-lucene-spellchecker-1.3.0.pom
1K downloaded  (solr-lucene-spellchecker-1.3.0.pom)
Downloading: https://oss.sonatype.org/content/groups/public/org/apache/solr/solr-commons-csv/1.3.0/solr-commons-csv-1.3.0.pom
[INFO] Unable to find resource 'org.apache.solr:solr-commons-csv:pom:1.3.0' in repository
sonatype-nexus (https://oss.sonatype.org/content/groups/public)
Downloading: http://repo1.maven.org/maven2/org/apache/solr/solr-commons-csv/1.3.0/solr-commons-csv-1.3.0.pom
1K downloaded  (solr-commons-csv-1.3.0.pom)
Downloading: https://oss.sonatype.org/content/groups/public/org/apache/geronimo/specs/geronimo-stax-api_1.0_spec/1.0.1/geronimo-stax-api_1.0_spec-1.0.1.pom
[INFO] Unable to find resource 'org.apache.geronimo.specs:geronimo-stax-api_1.0_spec:pom:1.0.1'
in repository sonatype-nexus (https://oss.sonatype.org/content/groups/public)
Downloading: http://repo1.maven.org/maven2/org/apache/geronimo/specs/geronimo-stax-api_1.0_spec/1.0.1/geronimo-stax-api_1.0_spec-1.0.1.pom
2K downloaded  (geronimo-stax-api_1.0_spec-1.0.1.pom)
Downloading: https://oss.sonatype.org/content/groups/public/org/apache/geronimo/specs/specs/1.3/specs-1.3.pom
[INFO] Unable to find resource 'org.apache.geronimo.specs:specs:pom:1.3' in repository sonatype-nexus
(https://oss.sonatype.org/content/groups/public)
Downloading: http://repo1.maven.org/maven2/org/apache/geronimo/specs/specs/1.3/specs-1.3.pom
6K downloaded  (specs-1.3.pom)
Downloading: https://oss.sonatype.org/content/groups/public/org/apache/geronimo/genesis/config/project-config/1.1/project-config-1.1.pom
[INFO] Unable to find resource 'org.apache.geronimo.genesis.config:project-config:pom:1.1'
in repository sonatype-nexus (https://oss.sonatype.org/content/groups/public)
Downloading: http://repo1.maven.org/maven2/org/apache/geronimo/genesis/config/project-config/1.1/project-config-1.1.pom
14K downloaded  (project-config-1.1.pom)
Downloading: http://people.apache.org/repo/m2-incubating-repository//org/apache/geronimo/genesis/config/config/1.1/config-1.1.pom
[INFO] Unable to find resource 'org.apache.geronimo.genesis.config:config:pom:1.1' in repository
apache-incubator (http://people.apache.org/repo/m2-incubating-repository/)
Downloading: http://repository.codehaus.org/org/apache/geronimo/genesis/config/config/1.1/config-1.1.pom
[WARNING] Unable to get resource 'org.apache.geronimo.genesis.config:config:pom:1.1' from
repository codehaus (http://repository.codehaus.org): Error transferring file: repository.codehaus.org
Downloading: https://oss.sonatype.org/content/groups/public/org/apache/geronimo/genesis/config/config/1.1/config-1.1.pom
[INFO] Unable to find resource 'org.apache.geronimo.genesis.config:config:pom:1.1' in repository
sonatype-nexus (https://oss.sonatype.org/content/groups/public)
Downloading: http://repo1.maven.org/maven2/org/apache/geronimo/genesis/config/config/1.1/config-1.1.pom
670b downloaded  (config-1.1.pom)
Downloading: http://people.apache.org/repo/m2-incubating-repository//org/apache/geronimo/genesis/genesis/1.1/genesis-1.1.pom
[INFO] Unable to find resource 'org.apache.geronimo.genesis:genesis:pom:1.1' in repository
apache-incubator (http://people.apache.org/repo/m2-incubating-repository/)
Downloading: http://repository.codehaus.org/org/apache/geronimo/genesis/genesis/1.1/genesis-1.1.pom
[WARNING] Unable to get resource 'org.apache.geronimo.genesis:genesis:pom:1.1' from repository
codehaus (http://repository.codehaus.org): Error transferring file: repository.codehaus.org
Downloading: https://oss.sonatype.org/content/groups/public/org/apache/geronimo/genesis/genesis/1.1/genesis-1.1.pom
[INFO] Unable to find resource 'org.apache.geronimo.genesis:genesis:pom:1.1' in repository
sonatype-nexus (https://oss.sonatype.org/content/groups/public)
Downloading: http://repo1.maven.org/maven2/org/apache/geronimo/genesis/genesis/1.1/genesis-1.1.pom
6K downloaded  (genesis-1.1.pom)
Downloading: https://oss.sonatype.org/content/groups/public/org/python/jython/2.2-beta1/jython-2.2-beta1.pom
1000b downloaded  (jython-2.2-beta1.pom)
Downloading: https://oss.sonatype.org/content/groups/public/org/safehaus/jug/jug/2.0.0/jug-2.0.0.pom
[INFO] Unable to find resource 'org.safehaus.jug:jug:pom:2.0.0' in repository sonatype-nexus
(https://oss.sonatype.org/content/groups/public)
Downloading: http://repo1.maven.org/maven2/org/safehaus/jug/jug/2.0.0/jug-2.0.0.pom
707b downloaded  (jug-2.0.0.pom)
Downloading: https://oss.sonatype.org/content/groups/public/org/apache/lucene/lucene-core/2.0.0/lucene-core-2.0.0.jar
Downloading: https://oss.sonatype.org/content/groups/public/org/safehaus/jug/jug/2.0.0/jug-2.0.0-asl.jar
Downloading: https://oss.sonatype.org/content/groups/public/commons-fileupload/commons-fileupload/1.2/commons-fileupload-1.2.jar
Downloading: https://oss.sonatype.org/content/groups/public/joda-time/joda-time/2.5/joda-time-2.5.jar
Downloading: https://oss.sonatype.org/content/groups/public/org/apache/httpcomponents/httpclient/4.2.5/httpclient-4.2.5.jar
[INFO] Unable to find resource 'commons-fileupload:commons-fileupload:jar:1.2' in repository
sonatype-nexus (https://oss.sonatype.org/content/groups/public)
Downloading: http://repo1.maven.org/maven2/commons-fileupload/commons-fileupload/1.2/commons-fileupload-1.2.jar
[INFO] Unable to find resource 'org.safehaus.jug:jug:jar:asl:2.0.0' in repository sonatype-nexus
(https://oss.sonatype.org/content/groups/public)
[INFO] Unable to find resource 'org.apache.lucene:lucene-core:jar:2.0.0' in repository sonatype-nexus
(https://oss.sonatype.org/content/groups/public)
Downloading: http://repo1.maven.org/maven2/org/safehaus/jug/jug/2.0.0/jug-2.0.0-asl.jar
Downloading: http://repo1.maven.org/maven2/org/apache/lucene/lucene-core/2.0.0/lucene-core-2.0.0.jar
[INFO] Unable to find resource 'org.apache.httpcomponents:httpclient:jar:4.2.5' in repository
sonatype-nexus (https://oss.sonatype.org/content/groups/public)
Downloading: http://repo1.maven.org/maven2/org/apache/httpcomponents/httpclient/4.2.5/httpclient-4.2.5.jar
51K downloaded  (commons-fileupload-1.2.jar)
Downloading: https://oss.sonatype.org/content/groups/public/org/python/jython/2.2-beta1/jython-2.2-beta1.jar
31K downloaded  (jug-2.0.0-asl.jar)
Downloading: https://oss.sonatype.org/content/groups/public/org/apache/solr/solr-core/1.3.0/solr-core-1.3.0.jar
394K downloaded  (lucene-core-2.0.0.jar)
423K downloaded  (httpclient-4.2.5.jar)
Downloading: https://oss.sonatype.org/content/groups/public/com/fasterxml/jackson/core/jackson-core/2.1.1/jackson-core-2.1.1.jar
Downloading: https://oss.sonatype.org/content/groups/public/commons-cli/commons-cli/1.2/commons-cli-1.2.jar
[INFO] Unable to find resource 'org.apache.solr:solr-core:jar:1.3.0' in repository sonatype-nexus
(https://oss.sonatype.org/content/groups/public)
Downloading: http://repo1.maven.org/maven2/org/apache/solr/solr-core/1.3.0/solr-core-1.3.0.jar
900K downloaded  (solr-core-1.3.0.jar)
[INFO] Unable to find resource 'commons-cli:commons-cli:jar:1.2' in repository sonatype-nexus
(https://oss.sonatype.org/content/groups/public)
Downloading: http://repo1.maven.org/maven2/commons-cli/commons-cli/1.2/commons-cli-1.2.jar
Downloading: https://oss.sonatype.org/content/groups/public/hsqldb/hsqldb/1.8.0.7/hsqldb-1.8.0.7.jar
40K downloaded  (commons-cli-1.2.jar)
Downloading: https://oss.sonatype.org/content/groups/public/org/apache/geronimo/specs/geronimo-stax-api_1.0_spec/1.0.1/geronimo-stax-api_1.0_spec-1.0.1.jar
[INFO] Unable to find resource 'hsqldb:hsqldb:jar:1.8.0.7' in repository sonatype-nexus (https://oss.sonatype.org/content/groups/public)
Downloading: http://repo1.maven.org/maven2/hsqldb/hsqldb/1.8.0.7/hsqldb-1.8.0.7.jar
[INFO] Unable to find resource 'org.apache.geronimo.specs:geronimo-stax-api_1.0_spec:jar:1.0.1'
in repository sonatype-nexus (https://oss.sonatype.org/content/groups/public)
Downloading: http://repo1.maven.org/maven2/org/apache/geronimo/specs/geronimo-stax-api_1.0_spec/1.0.1/geronimo-stax-api_1.0_spec-1.0.1.jar
628K downloaded  (hsqldb-1.8.0.7.jar)
28K downloaded  (geronimo-stax-api_1.0_spec-1.0.1.jar)
Downloading: https://oss.sonatype.org/content/groups/public/net/java/dev/stax-utils/stax-utils/20040917/stax-utils-20040917.jar
Downloading: https://oss.sonatype.org/content/groups/public/stax/stax/1.2.0/stax-1.2.0.jar
574K downloaded  (joda-time-2.5.jar)
201K downloaded  (jackson-core-2.1.1.jar)
Downloading: https://oss.sonatype.org/content/groups/public/com/amazonaws/aws-java-sdk/1.7.4/aws-java-sdk-1.7.4.jar
[INFO] Unable to find resource 'stax:stax:jar:1.2.0' in repository sonatype-nexus (https://oss.sonatype.org/content/groups/public)
Downloading: http://repo1.maven.org/maven2/stax/stax/1.2.0/stax-1.2.0.jar
[INFO] Unable to find resource 'net.java.dev.stax-utils:stax-utils:jar:20040917' in repository
sonatype-nexus (https://oss.sonatype.org/content/groups/public)
Downloading: http://repo1.maven.org/maven2/net/java/dev/stax-utils/stax-utils/20040917/stax-utils-20040917.jar
175K downloaded  (stax-1.2.0.jar)
111K downloaded  (stax-utils-20040917.jar)
Downloading: https://oss.sonatype.org/content/groups/public/org/apache/httpcomponents/httpcore/4.2.4/httpcore-4.2.4.jar
Downloading: https://oss.sonatype.org/content/groups/public/org/apache/solr/solr-common/1.3.0/solr-common-1.3.0.jar
Downloading: https://oss.sonatype.org/content/groups/public/stax/stax-api/1.0.1/stax-api-1.0.1.jar
[INFO] Unable to find resource 'org.apache.solr:solr-common:jar:1.3.0' in repository sonatype-nexus
(https://oss.sonatype.org/content/groups/public)
Downloading: http://repo1.maven.org/maven2/org/apache/solr/solr-common/1.3.0/solr-common-1.3.0.jar
86K downloaded  (solr-common-1.3.0.jar)
Downloading: https://oss.sonatype.org/content/groups/public/com/fasterxml/jackson/core/jackson-databind/2.1.1/jackson-databind-2.1.1.jar
[INFO] Unable to find resource 'org.apache.httpcomponents:httpcore:jar:4.2.4' in repository
sonatype-nexus (https://oss.sonatype.org/content/groups/public)
Downloading: http://files.couchbase.com/maven2//org/apache/httpcomponents/httpcore/4.2.4/httpcore-4.2.4.jar
[INFO] Unable to find resource 'stax:stax-api:jar:1.0.1' in repository sonatype-nexus (https://oss.sonatype.org/content/groups/public)
Downloading: http://repo1.maven.org/maven2/stax/stax-api/1.0.1/stax-api-1.0.1.jar
25K downloaded  (stax-api-1.0.1.jar)
Downloading: https://oss.sonatype.org/content/groups/public/org/apache/solr/solr-solrj/1.3.0/solr-solrj-1.3.0.jar
[INFO] Unable to find resource 'org.apache.httpcomponents:httpcore:jar:4.2.4' in repository
spy (http://files.couchbase.com/maven2/)
Downloading: http://repo1.maven.org/maven2/org/apache/httpcomponents/httpcore/4.2.4/httpcore-4.2.4.jar
1134K downloaded  (jython-2.2-beta1.jar)
221K downloaded  (httpcore-4.2.4.jar)
[INFO] Unable to find resource 'org.apache.solr:solr-solrj:jar:1.3.0' in repository sonatype-nexus
(https://oss.sonatype.org/content/groups/public)
Downloading: http://repo1.maven.org/maven2/org/apache/solr/solr-solrj/1.3.0/solr-solrj-1.3.0.jar
94K downloaded  (solr-solrj-1.3.0.jar)
Downloading: https://oss.sonatype.org/content/groups/public/org/apache/solr/solr-lucene-analyzers/1.3.0/solr-lucene-analyzers-1.3.0.jar
[INFO] Unable to find resource 'org.apache.solr:solr-lucene-analyzers:jar:1.3.0' in repository
sonatype-nexus (https://oss.sonatype.org/content/groups/public)
Downloading: http://repo1.maven.org/maven2/org/apache/solr/solr-lucene-analyzers/1.3.0/solr-lucene-analyzers-1.3.0.jar
135K downloaded  (solr-lucene-analyzers-1.3.0.jar)
Downloading: https://oss.sonatype.org/content/groups/public/org/apache/solr/solr-lucene-highlighter/1.3.0/solr-lucene-highlighter-1.3.0.jar
[INFO] Unable to find resource 'org.apache.solr:solr-lucene-highlighter:jar:1.3.0' in repository
sonatype-nexus (https://oss.sonatype.org/content/groups/public)
Downloading: http://repo1.maven.org/maven2/org/apache/solr/solr-lucene-highlighter/1.3.0/solr-lucene-highlighter-1.3.0.jar
88K downloaded  (solr-lucene-highlighter-1.3.0.jar)
Downloading: https://oss.sonatype.org/content/groups/public/org/apache/solr/solr-lucene-queries/1.3.0/solr-lucene-queries-1.3.0.jar
901K downloaded  (jackson-databind-2.1.1.jar)
[INFO] Unable to find resource 'org.apache.solr:solr-lucene-queries:jar:1.3.0' in repository
sonatype-nexus (https://oss.sonatype.org/content/groups/public)
Downloading: http://repo1.maven.org/maven2/org/apache/solr/solr-lucene-queries/1.3.0/solr-lucene-queries-1.3.0.jar
32K downloaded  (solr-lucene-queries-1.3.0.jar)
Downloading: https://oss.sonatype.org/content/groups/public/org/apache/solr/solr-lucene-snowball/1.3.0/solr-lucene-snowball-1.3.0.jar
Downloading: https://oss.sonatype.org/content/groups/public/com/fasterxml/jackson/core/jackson-annotations/2.1.1/jackson-annotations-2.1.1.jar
33K downloaded  (jackson-annotations-2.1.1.jar)
[INFO] Unable to find resource 'org.apache.solr:solr-lucene-snowball:jar:1.3.0' in repository
sonatype-nexus (https://oss.sonatype.org/content/groups/public)
Downloading: http://repo1.maven.org/maven2/org/apache/solr/solr-lucene-snowball/1.3.0/solr-lucene-snowball-1.3.0.jar
110K downloaded  (solr-lucene-snowball-1.3.0.jar)
Downloading: https://oss.sonatype.org/content/groups/public/org/apache/solr/solr-lucene-spellchecker/1.3.0/solr-lucene-spellchecker-1.3.0.jar
[INFO] Unable to find resource 'org.apache.solr:solr-lucene-spellchecker:jar:1.3.0' in repository
sonatype-nexus (https://oss.sonatype.org/content/groups/public)
Downloading: http://repo1.maven.org/maven2/org/apache/solr/solr-lucene-spellchecker/1.3.0/solr-lucene-spellchecker-1.3.0.jar
18K downloaded  (solr-lucene-spellchecker-1.3.0.jar)
Downloading: https://oss.sonatype.org/content/groups/public/org/apache/solr/solr-commons-csv/1.3.0/solr-commons-csv-1.3.0.jar
11668K downloaded  (aws-java-sdk-1.7.4.jar)
[INFO] Unable to find resource 'org.apache.solr:solr-commons-csv:jar:1.3.0' in repository
sonatype-nexus (https://oss.sonatype.org/content/groups/public)
Downloading: http://repo1.maven.org/maven2/org/apache/solr/solr-commons-csv/1.3.0/solr-commons-csv-1.3.0.jar
21K downloaded  (solr-commons-csv-1.3.0.jar)
[INFO] [resources:resources {execution: default-resources}]
[INFO] Using 'UTF-8' encoding to copy filtered resources.
[INFO] Copying 0 resource
[INFO] Copying 3 resources
Downloading: https://oss.sonatype.org/content/groups/public/mysql/mysql-connector-java/5.1.26/mysql-connector-java-5.1.26.pom
[INFO] Unable to find resource 'mysql:mysql-connector-java:pom:5.1.26' in repository sonatype-nexus
(https://oss.sonatype.org/content/groups/public)
Downloading: http://repo1.maven.org/maven2/mysql/mysql-connector-java/5.1.26/mysql-connector-java-5.1.26.pom
1K downloaded  (mysql-connector-java-5.1.26.pom)
[INFO] [compiler:compile {execution: default-compile}]
[INFO] Changes detected - recompiling the module!
[INFO] Compiling 169 source files to <https://builds.apache.org/job/oodt-trunk/org.apache.oodt$cas-filemgr/ws/target/classes>
[INFO] -------------------------------------------------------------
[WARNING] COMPILATION WARNING : 
[INFO] -------------------------------------------------------------
[WARNING] <https://builds.apache.org/job/oodt-trunk/org.apache.oodt$cas-filemgr/ws/src/main/java/org/apache/oodt/cas/filemgr/system/XmlRpcFileManagerClient.java>:
Some input files use or override a deprecated API.
[WARNING] <https://builds.apache.org/job/oodt-trunk/org.apache.oodt$cas-filemgr/ws/src/main/java/org/apache/oodt/cas/filemgr/system/XmlRpcFileManagerClient.java>:
Recompile with -Xlint:deprecation for details.
[WARNING] <https://builds.apache.org/job/oodt-trunk/org.apache.oodt$cas-filemgr/ws/src/main/java/org/apache/oodt/cas/filemgr/system/auth/Result.java>:
Some input files use unchecked or unsafe operations.
[WARNING] <https://builds.apache.org/job/oodt-trunk/org.apache.oodt$cas-filemgr/ws/src/main/java/org/apache/oodt/cas/filemgr/system/auth/Result.java>:
Recompile with -Xlint:unchecked for details.
[INFO] 4 warnings 
[INFO] -------------------------------------------------------------
[INFO] -------------------------------------------------------------
[ERROR] COMPILATION ERROR : 
[INFO] -------------------------------------------------------------
[ERROR] <https://builds.apache.org/job/oodt-trunk/org.apache.oodt$cas-filemgr/ws/src/main/java/org/apache/oodt/cas/filemgr/system/XmlRpcFileManager.java>:[1110,58]
cannot find symbol
  symbol:   variable productHash
  location: class org.apache.oodt.cas.filemgr.system.XmlRpcFileManager
[INFO] 1 error
[INFO] -------------------------------------------------------------
[INFO] ------------------------------------------------------------------------
[ERROR] BUILD FAILURE
[INFO] ------------------------------------------------------------------------
[INFO] Compilation failure
<https://builds.apache.org/job/oodt-trunk/org.apache.oodt$cas-filemgr/ws/src/main/java/org/apache/oodt/cas/filemgr/system/XmlRpcFileManager.java>:[1110,58]
cannot find symbol
  symbol:   variable productHash
  location: class org.apache.oodt.cas.filemgr.system.XmlRpcFileManager

[INFO] ------------------------------------------------------------------------
[INFO] For more information, run Maven with the -e switch
[INFO] ------------------------------------------------------------------------
[INFO] Total time: 2 minutes 28 seconds
[INFO] Finished at: Thu Feb 04 18:02:41 UTC 2016
[INFO] Final Memory: 113M/798M
[INFO] ------------------------------------------------------------------------

Mime
View raw message