oodt-dev mailing list archives

Site index · List index
Message view « Date » · « Thread »
Top « Date » · « Thread »
From Apache Jenkins Server <jenk...@builds.apache.org>
Subject Build failed in Jenkins: oodt-trunk #2094
Date Thu, 04 Feb 2016 18:02:53 GMT
See <https://builds.apache.org/job/oodt-trunk/2094/changes>

Changes:

[tom] OODT-781 fix removal error

------------------------------------------
[...truncated 2784 lines...]
Downloading: https://oss.sonatype.org/content/groups/public/stax/stax/1.2.0/stax-1.2.0.pom
[INFO] Unable to find resource 'stax:stax:pom:1.2.0' in repository sonatype-nexus (https://oss.sonatype.org/content/groups/public)
Downloading: http://repo1.maven.org/maven2/stax/stax/1.2.0/stax-1.2.0.pom
3K downloaded  (stax-1.2.0.pom)
Downloading: https://oss.sonatype.org/content/groups/public/stax/stax-api/1.0.1/stax-api-1.0.1.pom
[INFO] Unable to find resource 'stax:stax-api:pom:1.0.1' in repository sonatype-nexus (https://oss.sonatype.org/content/groups/public)
Downloading: http://repo1.maven.org/maven2/stax/stax-api/1.0.1/stax-api-1.0.1.pom
1K downloaded  (stax-api-1.0.1.pom)
Downloading: https://oss.sonatype.org/content/groups/public/stax-utils/stax-utils/snapshot-20040917/stax-utils-snapshot-20040917.pom
[INFO] Unable to find resource 'stax-utils:stax-utils:pom:snapshot-20040917' in repository
sonatype-nexus (https://oss.sonatype.org/content/groups/public)
Downloading: http://repo1.maven.org/maven2/stax-utils/stax-utils/snapshot-20040917/stax-utils-snapshot-20040917.pom
341b downloaded  (stax-utils-snapshot-20040917.pom)
Downloading: https://oss.sonatype.org/content/groups/public/net/java/dev/stax-utils/stax-utils/20040917/stax-utils-20040917.pom
[INFO] Unable to find resource 'net.java.dev.stax-utils:stax-utils:pom:20040917' in repository
sonatype-nexus (https://oss.sonatype.org/content/groups/public)
Downloading: http://repo1.maven.org/maven2/net/java/dev/stax-utils/stax-utils/20040917/stax-utils-20040917.pom
170b downloaded  (stax-utils-20040917.pom)
Downloading: https://oss.sonatype.org/content/groups/public/org/apache/solr/solr-lucene-analyzers/1.3.0/solr-lucene-analyzers-1.3.0.pom
[INFO] Unable to find resource 'org.apache.solr:solr-lucene-analyzers:pom:1.3.0' in repository
sonatype-nexus (https://oss.sonatype.org/content/groups/public)
Downloading: http://repo1.maven.org/maven2/org/apache/solr/solr-lucene-analyzers/1.3.0/solr-lucene-analyzers-1.3.0.pom
1K downloaded  (solr-lucene-analyzers-1.3.0.pom)
Downloading: https://oss.sonatype.org/content/groups/public/org/apache/solr/solr-lucene-contrib/1.3.0/solr-lucene-contrib-1.3.0.pom
[INFO] Unable to find resource 'org.apache.solr:solr-lucene-contrib:pom:1.3.0' in repository
sonatype-nexus (https://oss.sonatype.org/content/groups/public)
Downloading: http://repo1.maven.org/maven2/org/apache/solr/solr-lucene-contrib/1.3.0/solr-lucene-contrib-1.3.0.pom
1K downloaded  (solr-lucene-contrib-1.3.0.pom)
Downloading: https://oss.sonatype.org/content/groups/public/org/apache/solr/solr-lucene-highlighter/1.3.0/solr-lucene-highlighter-1.3.0.pom
[INFO] Unable to find resource 'org.apache.solr:solr-lucene-highlighter:pom:1.3.0' in repository
sonatype-nexus (https://oss.sonatype.org/content/groups/public)
Downloading: http://repo1.maven.org/maven2/org/apache/solr/solr-lucene-highlighter/1.3.0/solr-lucene-highlighter-1.3.0.pom
1K downloaded  (solr-lucene-highlighter-1.3.0.pom)
Downloading: https://oss.sonatype.org/content/groups/public/org/apache/solr/solr-lucene-queries/1.3.0/solr-lucene-queries-1.3.0.pom
[INFO] Unable to find resource 'org.apache.solr:solr-lucene-queries:pom:1.3.0' in repository
sonatype-nexus (https://oss.sonatype.org/content/groups/public)
Downloading: http://repo1.maven.org/maven2/org/apache/solr/solr-lucene-queries/1.3.0/solr-lucene-queries-1.3.0.pom
1K downloaded  (solr-lucene-queries-1.3.0.pom)
Downloading: https://oss.sonatype.org/content/groups/public/org/apache/solr/solr-lucene-snowball/1.3.0/solr-lucene-snowball-1.3.0.pom
[INFO] Unable to find resource 'org.apache.solr:solr-lucene-snowball:pom:1.3.0' in repository
sonatype-nexus (https://oss.sonatype.org/content/groups/public)
Downloading: http://repo1.maven.org/maven2/org/apache/solr/solr-lucene-snowball/1.3.0/solr-lucene-snowball-1.3.0.pom
1K downloaded  (solr-lucene-snowball-1.3.0.pom)
Downloading: https://oss.sonatype.org/content/groups/public/org/apache/solr/solr-lucene-spellchecker/1.3.0/solr-lucene-spellchecker-1.3.0.pom
[INFO] Unable to find resource 'org.apache.solr:solr-lucene-spellchecker:pom:1.3.0' in repository
sonatype-nexus (https://oss.sonatype.org/content/groups/public)
Downloading: http://repo1.maven.org/maven2/org/apache/solr/solr-lucene-spellchecker/1.3.0/solr-lucene-spellchecker-1.3.0.pom
1K downloaded  (solr-lucene-spellchecker-1.3.0.pom)
Downloading: https://oss.sonatype.org/content/groups/public/org/apache/solr/solr-commons-csv/1.3.0/solr-commons-csv-1.3.0.pom
[INFO] Unable to find resource 'org.apache.solr:solr-commons-csv:pom:1.3.0' in repository
sonatype-nexus (https://oss.sonatype.org/content/groups/public)
Downloading: http://repo1.maven.org/maven2/org/apache/solr/solr-commons-csv/1.3.0/solr-commons-csv-1.3.0.pom
1K downloaded  (solr-commons-csv-1.3.0.pom)
Downloading: https://oss.sonatype.org/content/groups/public/org/apache/geronimo/specs/geronimo-stax-api_1.0_spec/1.0.1/geronimo-stax-api_1.0_spec-1.0.1.pom
[INFO] Unable to find resource 'org.apache.geronimo.specs:geronimo-stax-api_1.0_spec:pom:1.0.1'
in repository sonatype-nexus (https://oss.sonatype.org/content/groups/public)
Downloading: http://repo1.maven.org/maven2/org/apache/geronimo/specs/geronimo-stax-api_1.0_spec/1.0.1/geronimo-stax-api_1.0_spec-1.0.1.pom
2K downloaded  (geronimo-stax-api_1.0_spec-1.0.1.pom)
Downloading: https://oss.sonatype.org/content/groups/public/org/apache/geronimo/specs/specs/1.3/specs-1.3.pom
[INFO] Unable to find resource 'org.apache.geronimo.specs:specs:pom:1.3' in repository sonatype-nexus
(https://oss.sonatype.org/content/groups/public)
Downloading: http://repo1.maven.org/maven2/org/apache/geronimo/specs/specs/1.3/specs-1.3.pom
6K downloaded  (specs-1.3.pom)
Downloading: https://oss.sonatype.org/content/groups/public/org/apache/geronimo/genesis/config/project-config/1.1/project-config-1.1.pom
[INFO] Unable to find resource 'org.apache.geronimo.genesis.config:project-config:pom:1.1'
in repository sonatype-nexus (https://oss.sonatype.org/content/groups/public)
Downloading: http://repo1.maven.org/maven2/org/apache/geronimo/genesis/config/project-config/1.1/project-config-1.1.pom
14K downloaded  (project-config-1.1.pom)
Downloading: http://people.apache.org/repo/m2-incubating-repository//org/apache/geronimo/genesis/config/config/1.1/config-1.1.pom
[INFO] Unable to find resource 'org.apache.geronimo.genesis.config:config:pom:1.1' in repository
apache-incubator (http://people.apache.org/repo/m2-incubating-repository/)
Downloading: http://repository.codehaus.org/org/apache/geronimo/genesis/config/config/1.1/config-1.1.pom
[WARNING] Unable to get resource 'org.apache.geronimo.genesis.config:config:pom:1.1' from
repository codehaus (http://repository.codehaus.org): Error transferring file: repository.codehaus.org
Downloading: https://oss.sonatype.org/content/groups/public/org/apache/geronimo/genesis/config/config/1.1/config-1.1.pom
[INFO] Unable to find resource 'org.apache.geronimo.genesis.config:config:pom:1.1' in repository
sonatype-nexus (https://oss.sonatype.org/content/groups/public)
Downloading: http://repo1.maven.org/maven2/org/apache/geronimo/genesis/config/config/1.1/config-1.1.pom
670b downloaded  (config-1.1.pom)
Downloading: http://people.apache.org/repo/m2-incubating-repository//org/apache/geronimo/genesis/genesis/1.1/genesis-1.1.pom
[INFO] Unable to find resource 'org.apache.geronimo.genesis:genesis:pom:1.1' in repository
apache-incubator (http://people.apache.org/repo/m2-incubating-repository/)
Downloading: http://repository.codehaus.org/org/apache/geronimo/genesis/genesis/1.1/genesis-1.1.pom
[WARNING] Unable to get resource 'org.apache.geronimo.genesis:genesis:pom:1.1' from repository
codehaus (http://repository.codehaus.org): Error transferring file: repository.codehaus.org
Downloading: https://oss.sonatype.org/content/groups/public/org/apache/geronimo/genesis/genesis/1.1/genesis-1.1.pom
[INFO] Unable to find resource 'org.apache.geronimo.genesis:genesis:pom:1.1' in repository
sonatype-nexus (https://oss.sonatype.org/content/groups/public)
Downloading: http://repo1.maven.org/maven2/org/apache/geronimo/genesis/genesis/1.1/genesis-1.1.pom
6K downloaded  (genesis-1.1.pom)
Downloading: https://oss.sonatype.org/content/groups/public/org/python/jython/2.2-beta1/jython-2.2-beta1.pom
1000b downloaded  (jython-2.2-beta1.pom)
Downloading: https://oss.sonatype.org/content/groups/public/org/safehaus/jug/jug/2.0.0/jug-2.0.0.pom
[INFO] Unable to find resource 'org.safehaus.jug:jug:pom:2.0.0' in repository sonatype-nexus
(https://oss.sonatype.org/content/groups/public)
Downloading: http://repo1.maven.org/maven2/org/safehaus/jug/jug/2.0.0/jug-2.0.0.pom
707b downloaded  (jug-2.0.0.pom)
Downloading: https://oss.sonatype.org/content/groups/public/org/apache/lucene/lucene-core/2.0.0/lucene-core-2.0.0.jar
Downloading: https://oss.sonatype.org/content/groups/public/org/safehaus/jug/jug/2.0.0/jug-2.0.0-asl.jar
Downloading: https://oss.sonatype.org/content/groups/public/commons-fileupload/commons-fileupload/1.2/commons-fileupload-1.2.jar
Downloading: https://oss.sonatype.org/content/groups/public/joda-time/joda-time/2.5/joda-time-2.5.jar
Downloading: https://oss.sonatype.org/content/groups/public/org/apache/httpcomponents/httpclient/4.2.5/httpclient-4.2.5.jar
[INFO] Unable to find resource 'commons-fileupload:commons-fileupload:jar:1.2' in repository
sonatype-nexus (https://oss.sonatype.org/content/groups/public)
Downloading: http://repo1.maven.org/maven2/commons-fileupload/commons-fileupload/1.2/commons-fileupload-1.2.jar
[INFO] Unable to find resource 'org.safehaus.jug:jug:jar:asl:2.0.0' in repository sonatype-nexus
(https://oss.sonatype.org/content/groups/public)
[INFO] Unable to find resource 'org.apache.lucene:lucene-core:jar:2.0.0' in repository sonatype-nexus
(https://oss.sonatype.org/content/groups/public)
Downloading: http://repo1.maven.org/maven2/org/safehaus/jug/jug/2.0.0/jug-2.0.0-asl.jar
Downloading: http://repo1.maven.org/maven2/org/apache/lucene/lucene-core/2.0.0/lucene-core-2.0.0.jar
[INFO] Unable to find resource 'org.apache.httpcomponents:httpclient:jar:4.2.5' in repository
sonatype-nexus (https://oss.sonatype.org/content/groups/public)
Downloading: http://repo1.maven.org/maven2/org/apache/httpcomponents/httpclient/4.2.5/httpclient-4.2.5.jar
51K downloaded  (commons-fileupload-1.2.jar)
Downloading: https://oss.sonatype.org/content/groups/public/org/python/jython/2.2-beta1/jython-2.2-beta1.jar
31K downloaded  (jug-2.0.0-asl.jar)
Downloading: https://oss.sonatype.org/content/groups/public/org/apache/solr/solr-core/1.3.0/solr-core-1.3.0.jar
394K downloaded  (lucene-core-2.0.0.jar)
423K downloaded  (httpclient-4.2.5.jar)
Downloading: https://oss.sonatype.org/content/groups/public/com/fasterxml/jackson/core/jackson-core/2.1.1/jackson-core-2.1.1.jar
Downloading: https://oss.sonatype.org/content/groups/public/commons-cli/commons-cli/1.2/commons-cli-1.2.jar
[INFO] Unable to find resource 'org.apache.solr:solr-core:jar:1.3.0' in repository sonatype-nexus
(https://oss.sonatype.org/content/groups/public)
Downloading: http://repo1.maven.org/maven2/org/apache/solr/solr-core/1.3.0/solr-core-1.3.0.jar
900K downloaded  (solr-core-1.3.0.jar)
[INFO] Unable to find resource 'commons-cli:commons-cli:jar:1.2' in repository sonatype-nexus
(https://oss.sonatype.org/content/groups/public)
Downloading: http://repo1.maven.org/maven2/commons-cli/commons-cli/1.2/commons-cli-1.2.jar
Downloading: https://oss.sonatype.org/content/groups/public/hsqldb/hsqldb/1.8.0.7/hsqldb-1.8.0.7.jar
40K downloaded  (commons-cli-1.2.jar)
Downloading: https://oss.sonatype.org/content/groups/public/org/apache/geronimo/specs/geronimo-stax-api_1.0_spec/1.0.1/geronimo-stax-api_1.0_spec-1.0.1.jar
[INFO] Unable to find resource 'hsqldb:hsqldb:jar:1.8.0.7' in repository sonatype-nexus (https://oss.sonatype.org/content/groups/public)
Downloading: http://repo1.maven.org/maven2/hsqldb/hsqldb/1.8.0.7/hsqldb-1.8.0.7.jar
[INFO] Unable to find resource 'org.apache.geronimo.specs:geronimo-stax-api_1.0_spec:jar:1.0.1'
in repository sonatype-nexus (https://oss.sonatype.org/content/groups/public)
Downloading: http://repo1.maven.org/maven2/org/apache/geronimo/specs/geronimo-stax-api_1.0_spec/1.0.1/geronimo-stax-api_1.0_spec-1.0.1.jar
628K downloaded  (hsqldb-1.8.0.7.jar)
28K downloaded  (geronimo-stax-api_1.0_spec-1.0.1.jar)
Downloading: https://oss.sonatype.org/content/groups/public/net/java/dev/stax-utils/stax-utils/20040917/stax-utils-20040917.jar
Downloading: https://oss.sonatype.org/content/groups/public/stax/stax/1.2.0/stax-1.2.0.jar
574K downloaded  (joda-time-2.5.jar)
201K downloaded  (jackson-core-2.1.1.jar)
Downloading: https://oss.sonatype.org/content/groups/public/com/amazonaws/aws-java-sdk/1.7.4/aws-java-sdk-1.7.4.jar
[INFO] Unable to find resource 'stax:stax:jar:1.2.0' in repository sonatype-nexus (https://oss.sonatype.org/content/groups/public)
Downloading: http://repo1.maven.org/maven2/stax/stax/1.2.0/stax-1.2.0.jar
[INFO] Unable to find resource 'net.java.dev.stax-utils:stax-utils:jar:20040917' in repository
sonatype-nexus (https://oss.sonatype.org/content/groups/public)
Downloading: http://repo1.maven.org/maven2/net/java/dev/stax-utils/stax-utils/20040917/stax-utils-20040917.jar
175K downloaded  (stax-1.2.0.jar)
111K downloaded  (stax-utils-20040917.jar)
Downloading: https://oss.sonatype.org/content/groups/public/org/apache/httpcomponents/httpcore/4.2.4/httpcore-4.2.4.jar
Downloading: https://oss.sonatype.org/content/groups/public/org/apache/solr/solr-common/1.3.0/solr-common-1.3.0.jar
Downloading: https://oss.sonatype.org/content/groups/public/stax/stax-api/1.0.1/stax-api-1.0.1.jar
[INFO] Unable to find resource 'org.apache.solr:solr-common:jar:1.3.0' in repository sonatype-nexus
(https://oss.sonatype.org/content/groups/public)
Downloading: http://repo1.maven.org/maven2/org/apache/solr/solr-common/1.3.0/solr-common-1.3.0.jar
86K downloaded  (solr-common-1.3.0.jar)
Downloading: https://oss.sonatype.org/content/groups/public/com/fasterxml/jackson/core/jackson-databind/2.1.1/jackson-databind-2.1.1.jar
[INFO] Unable to find resource 'org.apache.httpcomponents:httpcore:jar:4.2.4' in repository
sonatype-nexus (https://oss.sonatype.org/content/groups/public)
Downloading: http://files.couchbase.com/maven2//org/apache/httpcomponents/httpcore/4.2.4/httpcore-4.2.4.jar
[INFO] Unable to find resource 'stax:stax-api:jar:1.0.1' in repository sonatype-nexus (https://oss.sonatype.org/content/groups/public)
Downloading: http://repo1.maven.org/maven2/stax/stax-api/1.0.1/stax-api-1.0.1.jar
25K downloaded  (stax-api-1.0.1.jar)
Downloading: https://oss.sonatype.org/content/groups/public/org/apache/solr/solr-solrj/1.3.0/solr-solrj-1.3.0.jar
[INFO] Unable to find resource 'org.apache.httpcomponents:httpcore:jar:4.2.4' in repository
spy (http://files.couchbase.com/maven2/)
Downloading: http://repo1.maven.org/maven2/org/apache/httpcomponents/httpcore/4.2.4/httpcore-4.2.4.jar
1134K downloaded  (jython-2.2-beta1.jar)
221K downloaded  (httpcore-4.2.4.jar)
[INFO] Unable to find resource 'org.apache.solr:solr-solrj:jar:1.3.0' in repository sonatype-nexus
(https://oss.sonatype.org/content/groups/public)
Downloading: http://repo1.maven.org/maven2/org/apache/solr/solr-solrj/1.3.0/solr-solrj-1.3.0.jar
94K downloaded  (solr-solrj-1.3.0.jar)
Downloading: https://oss.sonatype.org/content/groups/public/org/apache/solr/solr-lucene-analyzers/1.3.0/solr-lucene-analyzers-1.3.0.jar
[INFO] Unable to find resource 'org.apache.solr:solr-lucene-analyzers:jar:1.3.0' in repository
sonatype-nexus (https://oss.sonatype.org/content/groups/public)
Downloading: http://repo1.maven.org/maven2/org/apache/solr/solr-lucene-analyzers/1.3.0/solr-lucene-analyzers-1.3.0.jar
135K downloaded  (solr-lucene-analyzers-1.3.0.jar)
Downloading: https://oss.sonatype.org/content/groups/public/org/apache/solr/solr-lucene-highlighter/1.3.0/solr-lucene-highlighter-1.3.0.jar
[INFO] Unable to find resource 'org.apache.solr:solr-lucene-highlighter:jar:1.3.0' in repository
sonatype-nexus (https://oss.sonatype.org/content/groups/public)
Downloading: http://repo1.maven.org/maven2/org/apache/solr/solr-lucene-highlighter/1.3.0/solr-lucene-highlighter-1.3.0.jar
88K downloaded  (solr-lucene-highlighter-1.3.0.jar)
Downloading: https://oss.sonatype.org/content/groups/public/org/apache/solr/solr-lucene-queries/1.3.0/solr-lucene-queries-1.3.0.jar
901K downloaded  (jackson-databind-2.1.1.jar)
[INFO] Unable to find resource 'org.apache.solr:solr-lucene-queries:jar:1.3.0' in repository
sonatype-nexus (https://oss.sonatype.org/content/groups/public)
Downloading: http://repo1.maven.org/maven2/org/apache/solr/solr-lucene-queries/1.3.0/solr-lucene-queries-1.3.0.jar
32K downloaded  (solr-lucene-queries-1.3.0.jar)
Downloading: https://oss.sonatype.org/content/groups/public/org/apache/solr/solr-lucene-snowball/1.3.0/solr-lucene-snowball-1.3.0.jar
Downloading: https://oss.sonatype.org/content/groups/public/com/fasterxml/jackson/core/jackson-annotations/2.1.1/jackson-annotations-2.1.1.jar
33K downloaded  (jackson-annotations-2.1.1.jar)
[INFO] Unable to find resource 'org.apache.solr:solr-lucene-snowball:jar:1.3.0' in repository
sonatype-nexus (https://oss.sonatype.org/content/groups/public)
Downloading: http://repo1.maven.org/maven2/org/apache/solr/solr-lucene-snowball/1.3.0/solr-lucene-snowball-1.3.0.jar
110K downloaded  (solr-lucene-snowball-1.3.0.jar)
Downloading: https://oss.sonatype.org/content/groups/public/org/apache/solr/solr-lucene-spellchecker/1.3.0/solr-lucene-spellchecker-1.3.0.jar
[INFO] Unable to find resource 'org.apache.solr:solr-lucene-spellchecker:jar:1.3.0' in repository
sonatype-nexus (https://oss.sonatype.org/content/groups/public)
Downloading: http://repo1.maven.org/maven2/org/apache/solr/solr-lucene-spellchecker/1.3.0/solr-lucene-spellchecker-1.3.0.jar
18K downloaded  (solr-lucene-spellchecker-1.3.0.jar)
Downloading: https://oss.sonatype.org/content/groups/public/org/apache/solr/solr-commons-csv/1.3.0/solr-commons-csv-1.3.0.jar
11668K downloaded  (aws-java-sdk-1.7.4.jar)
[INFO] Unable to find resource 'org.apache.solr:solr-commons-csv:jar:1.3.0' in repository
sonatype-nexus (https://oss.sonatype.org/content/groups/public)
Downloading: http://repo1.maven.org/maven2/org/apache/solr/solr-commons-csv/1.3.0/solr-commons-csv-1.3.0.jar
21K downloaded  (solr-commons-csv-1.3.0.jar)
[INFO] [resources:resources {execution: default-resources}]
[INFO] Using 'UTF-8' encoding to copy filtered resources.
[INFO] Copying 0 resource
[INFO] Copying 3 resources
Downloading: https://oss.sonatype.org/content/groups/public/mysql/mysql-connector-java/5.1.26/mysql-connector-java-5.1.26.pom
[INFO] Unable to find resource 'mysql:mysql-connector-java:pom:5.1.26' in repository sonatype-nexus
(https://oss.sonatype.org/content/groups/public)
Downloading: http://repo1.maven.org/maven2/mysql/mysql-connector-java/5.1.26/mysql-connector-java-5.1.26.pom
1K downloaded  (mysql-connector-java-5.1.26.pom)
[INFO] [compiler:compile {execution: default-compile}]
[INFO] Changes detected - recompiling the module!
[INFO] Compiling 169 source files to <https://builds.apache.org/job/oodt-trunk/ws/filemgr/target/classes>
[INFO] -------------------------------------------------------------
[WARNING] COMPILATION WARNING : 
[INFO] -------------------------------------------------------------
[WARNING] <https://builds.apache.org/job/oodt-trunk/ws/filemgr/src/main/java/org/apache/oodt/cas/filemgr/system/XmlRpcFileManagerClient.java>:
Some input files use or override a deprecated API.
[WARNING] <https://builds.apache.org/job/oodt-trunk/ws/filemgr/src/main/java/org/apache/oodt/cas/filemgr/system/XmlRpcFileManagerClient.java>:
Recompile with -Xlint:deprecation for details.
[WARNING] <https://builds.apache.org/job/oodt-trunk/ws/filemgr/src/main/java/org/apache/oodt/cas/filemgr/system/auth/Result.java>:
Some input files use unchecked or unsafe operations.
[WARNING] <https://builds.apache.org/job/oodt-trunk/ws/filemgr/src/main/java/org/apache/oodt/cas/filemgr/system/auth/Result.java>:
Recompile with -Xlint:unchecked for details.
[INFO] 4 warnings 
[INFO] -------------------------------------------------------------
[INFO] -------------------------------------------------------------
[ERROR] COMPILATION ERROR : 
[INFO] -------------------------------------------------------------
[ERROR] <https://builds.apache.org/job/oodt-trunk/ws/filemgr/src/main/java/org/apache/oodt/cas/filemgr/system/XmlRpcFileManager.java>:[1110,58]
cannot find symbol
  symbol:   variable productHash
  location: class org.apache.oodt.cas.filemgr.system.XmlRpcFileManager
[INFO] 1 error
[INFO] -------------------------------------------------------------
[INFO] ------------------------------------------------------------------------
[ERROR] BUILD FAILURE
[INFO] ------------------------------------------------------------------------
[INFO] Compilation failure
<https://builds.apache.org/job/oodt-trunk/ws/filemgr/src/main/java/org/apache/oodt/cas/filemgr/system/XmlRpcFileManager.java>:[1110,58]
cannot find symbol
  symbol:   variable productHash
  location: class org.apache.oodt.cas.filemgr.system.XmlRpcFileManager

[INFO] ------------------------------------------------------------------------
[INFO] For more information, run Maven with the -e switch
[INFO] ------------------------------------------------------------------------
[INFO] Total time: 2 minutes 28 seconds
[INFO] Finished at: Thu Feb 04 18:02:41 UTC 2016
[INFO] Final Memory: 113M/798M
[INFO] ------------------------------------------------------------------------
[JENKINS] Archiving <https://builds.apache.org/job/oodt-trunk/ws/sso/pom.xml> to org.apache.oodt/oodt-sso/0.12-SNAPSHOT/oodt-sso-0.12-SNAPSHOT.pom
[JENKINS] Archiving <https://builds.apache.org/job/oodt-trunk/ws/sso/target/oodt-sso-0.12-SNAPSHOT.jar>
to org.apache.oodt/oodt-sso/0.12-SNAPSHOT/oodt-sso-0.12-SNAPSHOT.jar
[JENKINS] Archiving <https://builds.apache.org/job/oodt-trunk/ws/protocol/ftp/pom.xml>
to org.apache.oodt/cas-protocol-ftp/0.12-SNAPSHOT/cas-protocol-ftp-0.12-SNAPSHOT.pom
[JENKINS] Archiving <https://builds.apache.org/job/oodt-trunk/ws/protocol/ftp/target/cas-protocol-ftp-0.12-SNAPSHOT.jar>
to org.apache.oodt/cas-protocol-ftp/0.12-SNAPSHOT/cas-protocol-ftp-0.12-SNAPSHOT.jar
[JENKINS] Archiving <https://builds.apache.org/job/oodt-trunk/ws/metadata/pom.xml> to
org.apache.oodt/cas-metadata/0.12-SNAPSHOT/cas-metadata-0.12-SNAPSHOT.pom
[JENKINS] Archiving <https://builds.apache.org/job/oodt-trunk/ws/metadata/target/cas-metadata-0.12-SNAPSHOT.jar>
to org.apache.oodt/cas-metadata/0.12-SNAPSHOT/cas-metadata-0.12-SNAPSHOT.jar
[JENKINS] Archiving <https://builds.apache.org/job/oodt-trunk/ws/.repository/org/apache/oodt/oodt-core/0.12-SNAPSHOT/oodt-core-0.12-SNAPSHOT.pom>
to org.apache.oodt/oodt-core/0.12-SNAPSHOT/oodt-core-0.12-SNAPSHOT.pom
[JENKINS] Archiving <https://builds.apache.org/job/oodt-trunk/ws/core/target/oodt-core-0.12-SNAPSHOT-site.xml>
to org.apache.oodt/oodt-core/0.12-SNAPSHOT/oodt-core-0.12-SNAPSHOT-site.xml
<https://builds.apache.org/job/oodt-trunk/ws/.repository/org/apache/oodt/oodt-core/0.12-SNAPSHOT/oodt-core-0.12-SNAPSHOT.pom>
is not inside <https://builds.apache.org/job/oodt-trunk/ws/core/;> will archive in a
separate pass
[JENKINS] Archiving <https://builds.apache.org/job/oodt-trunk/ws/protocol/http/pom.xml>
to org.apache.oodt/cas-protocol-http/0.12-SNAPSHOT/cas-protocol-http-0.12-SNAPSHOT.pom
[JENKINS] Archiving <https://builds.apache.org/job/oodt-trunk/ws/protocol/http/target/cas-protocol-http-0.12-SNAPSHOT.jar>
to org.apache.oodt/cas-protocol-http/0.12-SNAPSHOT/cas-protocol-http-0.12-SNAPSHOT.jar
[JENKINS] Archiving <https://builds.apache.org/job/oodt-trunk/ws/protocol/api/pom.xml>
to org.apache.oodt/cas-protocol-api/0.12-SNAPSHOT/cas-protocol-api-0.12-SNAPSHOT.pom
[JENKINS] Archiving <https://builds.apache.org/job/oodt-trunk/ws/protocol/api/target/cas-protocol-api-0.12-SNAPSHOT.jar>
to org.apache.oodt/cas-protocol-api/0.12-SNAPSHOT/cas-protocol-api-0.12-SNAPSHOT.jar
[JENKINS] Archiving <https://builds.apache.org/job/oodt-trunk/ws/protocol/api/target/cas-protocol-api-0.12-SNAPSHOT-dist.tar.gz>
to org.apache.oodt/cas-protocol-api/0.12-SNAPSHOT/cas-protocol-api-0.12-SNAPSHOT-dist.tar.gz
[JENKINS] Archiving <https://builds.apache.org/job/oodt-trunk/ws/protocol/api/target/cas-protocol-api-0.12-SNAPSHOT-dist.zip>
to org.apache.oodt/cas-protocol-api/0.12-SNAPSHOT/cas-protocol-api-0.12-SNAPSHOT-dist.zip
Compressed 19.48 MB of artifacts by 43.2% relative to #2093
[JENKINS] Archiving <https://builds.apache.org/job/oodt-trunk/ws/filemgr/pom.xml> to
org.apache.oodt/cas-filemgr/0.12-SNAPSHOT/cas-filemgr-0.12-SNAPSHOT.pom
[JENKINS] Archiving <https://builds.apache.org/job/oodt-trunk/ws/cli/pom.xml> to org.apache.oodt/cas-cli/0.12-SNAPSHOT/cas-cli-0.12-SNAPSHOT.pom
[JENKINS] Archiving <https://builds.apache.org/job/oodt-trunk/ws/cli/target/cas-cli-0.12-SNAPSHOT.jar>
to org.apache.oodt/cas-cli/0.12-SNAPSHOT/cas-cli-0.12-SNAPSHOT.jar
[JENKINS] Archiving <https://builds.apache.org/job/oodt-trunk/ws/cli/target/cas-cli-0.12-SNAPSHOT-dist.tar.gz>
to org.apache.oodt/cas-cli/0.12-SNAPSHOT/cas-cli-0.12-SNAPSHOT-dist.tar.gz
[JENKINS] Archiving <https://builds.apache.org/job/oodt-trunk/ws/cli/target/cas-cli-0.12-SNAPSHOT-dist.zip>
to org.apache.oodt/cas-cli/0.12-SNAPSHOT/cas-cli-0.12-SNAPSHOT-dist.zip
Compressed 13.45 MB of artifacts by 67.4% relative to #2093
[JENKINS] Archiving <https://builds.apache.org/job/oodt-trunk/ws/xmlquery/pom.xml> to
org.apache.oodt/oodt-xmlquery/0.12-SNAPSHOT/oodt-xmlquery-0.12-SNAPSHOT.pom
[JENKINS] Archiving <https://builds.apache.org/job/oodt-trunk/ws/xmlquery/target/oodt-xmlquery-0.12-SNAPSHOT.jar>
to org.apache.oodt/oodt-xmlquery/0.12-SNAPSHOT/oodt-xmlquery-0.12-SNAPSHOT.jar
[JENKINS] Archiving <https://builds.apache.org/job/oodt-trunk/ws/protocol/imaps/pom.xml>
to org.apache.oodt/cas-protocol-imaps/0.12-SNAPSHOT/cas-protocol-imaps-0.12-SNAPSHOT.pom
[JENKINS] Archiving <https://builds.apache.org/job/oodt-trunk/ws/protocol/imaps/target/cas-protocol-imaps-0.12-SNAPSHOT.jar>
to org.apache.oodt/cas-protocol-imaps/0.12-SNAPSHOT/cas-protocol-imaps-0.12-SNAPSHOT.jar
[JENKINS] Archiving <https://builds.apache.org/job/oodt-trunk/ws/commons/pom.xml> to
org.apache.oodt/oodt-commons/0.12-SNAPSHOT/oodt-commons-0.12-SNAPSHOT.pom
[JENKINS] Archiving <https://builds.apache.org/job/oodt-trunk/ws/commons/target/oodt-commons-0.12-SNAPSHOT.jar>
to org.apache.oodt/oodt-commons/0.12-SNAPSHOT/oodt-commons-0.12-SNAPSHOT.jar
[JENKINS] Archiving <https://builds.apache.org/job/oodt-trunk/ws/protocol/sftp/pom.xml>
to org.apache.oodt/cas-protocol-sftp/0.12-SNAPSHOT/cas-protocol-sftp-0.12-SNAPSHOT.pom
[JENKINS] Archiving <https://builds.apache.org/job/oodt-trunk/ws/protocol/sftp/target/cas-protocol-sftp-0.12-SNAPSHOT.jar>
to org.apache.oodt/cas-protocol-sftp/0.12-SNAPSHOT/cas-protocol-sftp-0.12-SNAPSHOT.jar
[JENKINS] Archiving <https://builds.apache.org/job/oodt-trunk/ws/pcs/input/pom.xml>
to org.apache.oodt/pcs-input/0.12-SNAPSHOT/pcs-input-0.12-SNAPSHOT.pom
[JENKINS] Archiving <https://builds.apache.org/job/oodt-trunk/ws/pcs/input/target/pcs-input-0.12-SNAPSHOT.jar>
to org.apache.oodt/pcs-input/0.12-SNAPSHOT/pcs-input-0.12-SNAPSHOT.jar
Sending e-mails to: dev@oodt.apache.org
channel stopped

Mime
View raw message